[
    {
        "height": 1.8364855842,
        "weight": 74.7080536077
    },
    {
        "height": 1.6553941979,
        "weight": 74.0713447355
    },
    {
        "height": 1.6997805521,
        "weight": 75.7169028756
    },
    {
        "height": 1.6066352371,
        "weight": 77.971542289
    },
    {
        "height": 1.8389630049,
        "weight": 76.8465178349
    },
    {
        "height": 1.6961441956,
        "weight": 77.3611602829
    },
    {
        "height": 1.6486341396,
        "weight": 77.0244587936
    },
    {
        "height": 1.8393838174,
        "weight": 78.1300742438
    },
    {
        "height": 1.632917236,
        "weight": 79.277815475
    },
    {
        "height": 1.7967082417,
        "weight": 78.6044005374
    },
    {
        "height": 1.6864193406,
        "weight": 74.4607407202
    },
    {
        "height": 1.767002506,
        "weight": 80.2790895773
    },
    {
        "height": 1.613455287,
        "weight": 76.5796497975
    },
    {
        "height": 1.7458947613,
        "weight": 77.4430835111
    },
    {
        "height": 1.535196141,
        "weight": 78.0985766404
    },
    {
        "height": 1.5203451516,
        "weight": 77.1661357225
    },
    {
        "height": 1.7857945046,
        "weight": 74.3110455187
    },
    {
        "height": 1.8147082516,
        "weight": 76.6918289978
    },
    {
        "height": 1.5091842338,
        "weight": 75.7500099032
    },
    {
        "height": 1.4652437788,
        "weight": 78.104715636
    },
    {
        "height": 1.6529667264,
        "weight": 77.9230604925
    },
    {
        "height": 1.8088600486,
        "weight": 75.7921795422
    },
    {
        "height": 1.8119230747,
        "weight": 77.0498472998
    },
    {
        "height": 1.7695878239,
        "weight": 77.0257549692
    },
    {
        "height": 1.6933936668,
        "weight": 75.7742746247
    },
    {
        "height": 1.7496574484,
        "weight": 76.787529068
    },
    {
        "height": 1.6824693011,
        "weight": 77.4849801919
    },
    {
        "height": 1.6088815408,
        "weight": 76.1831564877
    },
    {
        "height": 1.5500147895,
        "weight": 77.3916948792
    },
    {
        "height": 1.6319339791,
        "weight": 78.8847578268
    },
    {
        "height": 1.7985010181,
        "weight": 76.4895771577
    },
    {
        "height": 1.7384932087,
        "weight": 77.7458257167
    },
    {
        "height": 1.6690013318,
        "weight": 77.2725540179
    },
    {
        "height": 1.596445033,
        "weight": 77.0350783527
    },
    {
        "height": 1.6913804113,
        "weight": 77.6569412686
    },
    {
        "height": 1.7491977255,
        "weight": 75.6847768355
    },
    {
        "height": 1.8205269472,
        "weight": 76.6448466602
    },
    {
        "height": 1.7293439105,
        "weight": 76.9845041358
    },
    {
        "height": 1.8638954406,
        "weight": 79.2138535317
    },
    {
        "height": 1.4349577477,
        "weight": 77.9386652582
    },
    {
        "height": 1.8182987066,
        "weight": 76.857357167
    },
    {
        "height": 1.4875838883,
        "weight": 75.7273795241
    },
    {
        "height": 2.0293771959,
        "weight": 75.6920222066
    },
    {
        "height": 1.7053267107,
        "weight": 77.2579253259
    },
    {
        "height": 1.7426999147,
        "weight": 75.7647269821
    },
    {
        "height": 1.8851714595,
        "weight": 77.8768600358
    },
    {
        "height": 1.7728393346,
        "weight": 76.5965104018
    },
    {
        "height": 1.5913052865,
        "weight": 75.4192018336
    },
    {
        "height": 1.730205721,
        "weight": 78.712703425
    },
    {
        "height": 1.7757448733,
        "weight": 77.8941555967
    },
    {
        "height": 1.8115281222,
        "weight": 78.0905734644
    },
    {
        "height": 1.5155647118,
        "weight": 78.8115206894
    },
    {
        "height": 1.7794851629,
        "weight": 76.4265055932
    },
    {
        "height": 1.6596783282,
        "weight": 73.6353287948
    },
    {
        "height": 1.6550565081,
        "weight": 77.3207354392
    },
    {
        "height": 1.7121459561,
        "weight": 76.0438489063
    },
    {
        "height": 1.5052341217,
        "weight": 77.7218929346
    },
    {
        "height": 1.6899492827,
        "weight": 76.3044751632
    },
    {
        "height": 1.5625186793,
        "weight": 76.6789102218
    },
    {
        "height": 1.7703459627,
        "weight": 76.1408882988
    },
    {
        "height": 1.6174615937,
        "weight": 77.7991715484
    },
    {
        "height": 1.7327702159,
        "weight": 79.9862867983
    },
    {
        "height": 1.7116564824,
        "weight": 77.9356354789
    },
    {
        "height": 1.6954358048,
        "weight": 74.9481908199
    },
    {
        "height": 1.7030166796,
        "weight": 78.1224183132
    },
    {
        "height": 1.7468637847,
        "weight": 76.9952409006
    },
    {
        "height": 1.8083803571,
        "weight": 78.0566423463
    },
    {
        "height": 1.7648114308,
        "weight": 74.874429046
    },
    {
        "height": 1.8537062693,
        "weight": 75.1031592543
    },
    {
        "height": 1.6838015318,
        "weight": 78.2251614467
    },
    {
        "height": 1.7105416062,
        "weight": 75.7752320021
    },
    {
        "height": 1.6797628183,
        "weight": 78.1786004536
    },
    {
        "height": 1.6126453068,
        "weight": 78.7456617126
    },
    {
        "height": 1.8011789891,
        "weight": 75.0124011953
    },
    {
        "height": 1.505892726,
        "weight": 76.0931381023
    },
    {
        "height": 1.5284444018,
        "weight": 75.6139039778
    },
    {
        "height": 1.7786237553,
        "weight": 75.3116923571
    },
    {
        "height": 1.9244443137,
        "weight": 78.93607369
    },
    {
        "height": 1.492123207,
        "weight": 78.10712174
    },
    {
        "height": 1.7652589516,
        "weight": 77.1413807438
    },
    {
        "height": 1.6579266454,
        "weight": 76.0289177346
    },
    {
        "height": 1.8520649478,
        "weight": 77.1454462649
    },
    {
        "height": 1.6788368253,
        "weight": 76.5004950877
    },
    {
        "height": 1.808419046,
        "weight": 76.2214769966
    },
    {
        "height": 1.71925593,
        "weight": 75.4364779068
    },
    {
        "height": 1.885527298,
        "weight": 77.4028611788
    },
    {
        "height": 1.6450798134,
        "weight": 78.056331183
    },
    {
        "height": 1.664189738,
        "weight": 76.9378365256
    },
    {
        "height": 1.8447262999,
        "weight": 76.1832902065
    },
    {
        "height": 1.6194934558,
        "weight": 76.1151668009
    },
    {
        "height": 1.7756463713,
        "weight": 75.3940194206
    },
    {
        "height": 1.6701434103,
        "weight": 77.7916736869
    },
    {
        "height": 1.8258867069,
        "weight": 78.4401528212
    },
    {
        "height": 1.7276084938,
        "weight": 78.7348633925
    },
    {
        "height": 1.6257346462,
        "weight": 76.6321190028
    },
    {
        "height": 1.7639496305,
        "weight": 77.1356636657
    },
    {
        "height": 1.5861847749,
        "weight": 76.0513577522
    },
    {
        "height": 1.9321945195,
        "weight": 77.9702106903
    },
    {
        "height": 1.6715640188,
        "weight": 77.3613122605
    },
    {
        "height": 1.7359563728,
        "weight": 76.6051239164
    }
]
