bcrypt               == 4.0.1    
certifi              == 2022.12.7
cffi                 == 1.15.1   
charset-normalizer   == 2.1.1    
click                == 8.1.3    
contourpy            == 1.0.6    
cryptography         == 39.0.0   
cycler               == 0.11.0   
dash                 == 2.7.1    
dash-core-components == 2.0.0    
dash-html-components == 2.0.0    
dash-table           == 5.0.0    
et-xmlfile           == 1.1.0    
Flask                == 2.2.2    
fonttools            == 4.38.0   
idna                 == 3.4      
importlib-metadata   == 6.0.0    
itsdangerous         == 2.1.2    
Jinja2               == 3.1.2    
json2html            == 1.3.0    
kaleido              == 0.2.1    
kiwisolver           == 1.4.4    
MarkupSafe           == 2.1.1    
matplotlib           == 3.6.2    
numpy                == 1.24.1   
openpyxl             == 3.0.10   
packaging            == 22.0     
pandas               == 1.5.2    
paramiko             == 2.12.0   
pexpect              == 4.8.0    
Pillow               == 9.4.0    
pip                  == 20.0.2   
plotly               == 5.11.0   
ptyprocess           == 0.7.0    
pycparser            == 2.21     
pygtail              == 0.14.0   
PyNaCl               == 1.5.0    
pyparsing            == 3.0.9    
PyQt5                == 5.15.7   
PyQt5-Qt5            == 5.15.2   
PyQt5-sip            == 12.11.0  
PyQtWebEngine        == 5.15.6   
PyQtWebEngine-Qt5    == 5.15.2   
python-dateutil      == 2.8.2    
pytz                 == 2022.7   
requests             == 2.28.1   
setuptools           == 45.2.0   
sip                  == 5.0.0  
six                  == 1.16.0   
tenacity             == 8.1.0    
urllib3              == 1.26.13  
Werkzeug             == 2.2.2    
wheel                == 0.34.2   
zipp                 == 3.11.0   
