[{
  "_id": {
    "$oid": "6188a3be1d24e2c44d59d099"
  },
  "url": "test",
  "createdDate": {
    "$timestamp": {
      "t": 1636344841,
      "i": 1
    }
  },
  "description": "test",
  "idPostParent": "123"
}]