%YAML 1.1
%TAG !u! tag:unity3d.com,2011:
--- !u!1 &6997159338658389362
GameObject:
  m_ObjectHideFlags: 0
  m_CorrespondingSourceObject: {fileID: 0}
  m_PrefabInstance: {fileID: 0}
  m_PrefabAsset: {fileID: 0}
  serializedVersion: 6
  m_Component:
  - component: {fileID: 6997159338658389324}
  - component: {fileID: 6997159338658389363}
  - component: {fileID: 6460553102481472053}
  - component: {fileID: -3875308655068340144}
  m_Layer: 0
  m_Name: road3
  m_TagString: Untagged
  m_Icon: {fileID: 0}
  m_NavMeshLayer: 0
  m_StaticEditorFlags: 0
  m_IsActive: 1
--- !u!4 &6997159338658389324
Transform:
  m_ObjectHideFlags: 0
  m_CorrespondingSourceObject: {fileID: 0}
  m_PrefabInstance: {fileID: 0}
  m_PrefabAsset: {fileID: 0}
  m_GameObject: {fileID: 6997159338658389362}
  m_LocalRotation: {x: -0, y: -0, z: -0, w: 1}
  m_LocalPosition: {x: 18.01, y: 0, z: 0}
  m_LocalScale: {x: 1, y: 1, z: 1}
  m_Children:
  - {fileID: 6997159339334321711}
  - {fileID: 3726511903271692265}
  - {fileID: 5524472834797269099}
  m_Father: {fileID: 0}
  m_RootOrder: 0
  m_LocalEulerAnglesHint: {x: 0, y: 0, z: 0}
--- !u!212 &6997159338658389363
SpriteRenderer:
  m_ObjectHideFlags: 0
  m_CorrespondingSourceObject: {fileID: 0}
  m_PrefabInstance: {fileID: 0}
  m_PrefabAsset: {fileID: 0}
  m_GameObject: {fileID: 6997159338658389362}
  m_Enabled: 0
  m_CastShadows: 0
  m_ReceiveShadows: 0
  m_DynamicOccludee: 1
  m_MotionVectors: 1
  m_LightProbeUsage: 1
  m_ReflectionProbeUsage: 1
  m_RayTracingMode: 0
  m_RenderingLayerMask: 1
  m_RendererPriority: 0
  m_Materials:
  - {fileID: 10754, guid: 0000000000000000f000000000000000, type: 0}
  m_StaticBatchInfo:
    firstSubMesh: 0
    subMeshCount: 0
  m_StaticBatchRoot: {fileID: 0}
  m_ProbeAnchor: {fileID: 0}
  m_LightProbeVolumeOverride: {fileID: 0}
  m_ScaleInLightmap: 1
  m_ReceiveGI: 1
  m_PreserveUVs: 0
  m_IgnoreNormalsForChartDetection: 0
  m_ImportantGI: 0
  m_StitchLightmapSeams: 1
  m_SelectedEditorRenderState: 0
  m_MinimumChartSize: 4
  m_AutoUVMaxDistance: 0.5
  m_AutoUVMaxAngle: 89
  m_LightmapParameters: {fileID: 0}
  m_SortingLayerID: 0
  m_SortingLayer: 0
  m_SortingOrder: -1
  m_Sprite: {fileID: 21300000, guid: 7feab76bc25496e45a507cff9ca0126a, type: 3}
  m_Color: {r: 1, g: 1, b: 1, a: 1}
  m_FlipX: 0
  m_FlipY: 0
  m_DrawMode: 2
  m_Size: {x: 36, y: 10}
  m_AdaptiveModeThreshold: 0.5
  m_SpriteTileMode: 0
  m_WasSpriteAssigned: 1
  m_MaskInteraction: 0
  m_SpriteSortPoint: 1
--- !u!114 &6460553102481472053
MonoBehaviour:
  m_ObjectHideFlags: 0
  m_CorrespondingSourceObject: {fileID: 0}
  m_PrefabInstance: {fileID: 0}
  m_PrefabAsset: {fileID: 0}
  m_GameObject: {fileID: 6997159338658389362}
  m_Enabled: 1
  m_EditorHideFlags: 0
  m_Script: {fileID: 11500000, guid: a7ba0d799caa927489623667f645da16, type: 3}
  m_Name: 
  m_EditorClassIdentifier: 
  body: {fileID: -3875308655068340144}
  speed: 0
--- !u!50 &-3875308655068340144
Rigidbody2D:
  serializedVersion: 4
  m_ObjectHideFlags: 0
  m_CorrespondingSourceObject: {fileID: 0}
  m_PrefabInstance: {fileID: 0}
  m_PrefabAsset: {fileID: 0}
  m_GameObject: {fileID: 6997159338658389362}
  m_BodyType: 0
  m_Simulated: 1
  m_UseFullKinematicContacts: 0
  m_UseAutoMass: 0
  m_Mass: 1
  m_LinearDrag: 0
  m_AngularDrag: 0.05
  m_GravityScale: 1
  m_Material: {fileID: 0}
  m_Interpolate: 0
  m_SleepingMode: 1
  m_CollisionDetection: 0
  m_Constraints: 6
--- !u!1 &6997159339334321710
GameObject:
  m_ObjectHideFlags: 0
  m_CorrespondingSourceObject: {fileID: 0}
  m_PrefabInstance: {fileID: 0}
  m_PrefabAsset: {fileID: 0}
  serializedVersion: 6
  m_Component:
  - component: {fileID: 6997159339334321711}
  - component: {fileID: 6997159339334321704}
  m_Layer: 0
  m_Name: EdgeRight
  m_TagString: EdgeRight
  m_Icon: {fileID: 0}
  m_NavMeshLayer: 0
  m_StaticEditorFlags: 0
  m_IsActive: 1
--- !u!4 &6997159339334321711
Transform:
  m_ObjectHideFlags: 0
  m_CorrespondingSourceObject: {fileID: 0}
  m_PrefabInstance: {fileID: 0}
  m_PrefabAsset: {fileID: 0}
  m_GameObject: {fileID: 6997159339334321710}
  m_LocalRotation: {x: 0, y: 0, z: 0, w: 1}
  m_LocalPosition: {x: 1, y: 0, z: 0}
  m_LocalScale: {x: 1, y: 1, z: 1}
  m_Children: []
  m_Father: {fileID: 6997159338658389324}
  m_RootOrder: 0
  m_LocalEulerAnglesHint: {x: 0, y: 0, z: 0}
--- !u!61 &6997159339334321704
BoxCollider2D:
  m_ObjectHideFlags: 0
  m_CorrespondingSourceObject: {fileID: 0}
  m_PrefabInstance: {fileID: 0}
  m_PrefabAsset: {fileID: 0}
  m_GameObject: {fileID: 6997159339334321710}
  m_Enabled: 1
  m_Density: 1
  m_Material: {fileID: 0}
  m_IsTrigger: 1
  m_UsedByEffector: 0
  m_UsedByComposite: 0
  m_Offset: {x: 0, y: 0}
  m_SpriteTilingProperty:
    border: {x: 0, y: 0, z: 0, w: 0}
    pivot: {x: 0, y: 0}
    oldSize: {x: 0, y: 0}
    newSize: {x: 0, y: 0}
    adaptiveTilingThreshold: 0
    drawMode: 0
    adaptiveTiling: 0
  m_AutoTiling: 0
  serializedVersion: 2
  m_Size: {x: 1, y: 10}
  m_EdgeRadius: 0
--- !u!1001 &6997159338679847342
PrefabInstance:
  m_ObjectHideFlags: 0
  serializedVersion: 2
  m_Modification:
    m_TransformParent: {fileID: 6997159338658389324}
    m_Modifications:
    - target: {fileID: 3292194675887389123, guid: e0aa12e43342af549b0627cb4ea29a5b,
        type: 3}
      propertyPath: m_Name
      value: game elements_2
      objectReference: {fileID: 0}
    - target: {fileID: 3292194675887389125, guid: e0aa12e43342af549b0627cb4ea29a5b,
        type: 3}
      propertyPath: m_RootOrder
      value: 2
      objectReference: {fileID: 0}
    - target: {fileID: 3292194675887389125, guid: e0aa12e43342af549b0627cb4ea29a5b,
        type: 3}
      propertyPath: m_LocalPosition.x
      value: 1.2983856
      objectReference: {fileID: 0}
    - target: {fileID: 3292194675887389125, guid: e0aa12e43342af549b0627cb4ea29a5b,
        type: 3}
      propertyPath: m_LocalPosition.y
      value: -1.9688514
      objectReference: {fileID: 0}
    - target: {fileID: 3292194675887389125, guid: e0aa12e43342af549b0627cb4ea29a5b,
        type: 3}
      propertyPath: m_LocalPosition.z
      value: 0
      objectReference: {fileID: 0}
    - target: {fileID: 3292194675887389125, guid: e0aa12e43342af549b0627cb4ea29a5b,
        type: 3}
      propertyPath: m_LocalRotation.w
      value: 0.7071068
      objectReference: {fileID: 0}
    - target: {fileID: 3292194675887389125, guid: e0aa12e43342af549b0627cb4ea29a5b,
        type: 3}
      propertyPath: m_LocalRotation.x
      value: -0
      objectReference: {fileID: 0}
    - target: {fileID: 3292194675887389125, guid: e0aa12e43342af549b0627cb4ea29a5b,
        type: 3}
      propertyPath: m_LocalRotation.y
      value: -0
      objectReference: {fileID: 0}
    - target: {fileID: 3292194675887389125, guid: e0aa12e43342af549b0627cb4ea29a5b,
        type: 3}
      propertyPath: m_LocalRotation.z
      value: 0.7071068
      objectReference: {fileID: 0}
    - target: {fileID: 3292194675887389125, guid: e0aa12e43342af549b0627cb4ea29a5b,
        type: 3}
      propertyPath: m_LocalEulerAnglesHint.x
      value: 0
      objectReference: {fileID: 0}
    - target: {fileID: 3292194675887389125, guid: e0aa12e43342af549b0627cb4ea29a5b,
        type: 3}
      propertyPath: m_LocalEulerAnglesHint.y
      value: 0
      objectReference: {fileID: 0}
    - target: {fileID: 3292194675887389125, guid: e0aa12e43342af549b0627cb4ea29a5b,
        type: 3}
      propertyPath: m_LocalEulerAnglesHint.z
      value: 90
      objectReference: {fileID: 0}
    m_RemovedComponents: []
  m_SourcePrefab: {fileID: 100100000, guid: e0aa12e43342af549b0627cb4ea29a5b, type: 3}
--- !u!4 &5524472834797269099 stripped
Transform:
  m_CorrespondingSourceObject: {fileID: 3292194675887389125, guid: e0aa12e43342af549b0627cb4ea29a5b,
    type: 3}
  m_PrefabInstance: {fileID: 6997159338679847342}
  m_PrefabAsset: {fileID: 0}
--- !u!1001 &6997159339105438612
PrefabInstance:
  m_ObjectHideFlags: 0
  serializedVersion: 2
  m_Modification:
    m_TransformParent: {fileID: 6997159338658389324}
    m_Modifications:
    - target: {fileID: 5957661482591841405, guid: 2e4de922897f2e149ad604ac195ee74b,
        type: 3}
      propertyPath: m_RootOrder
      value: 1
      objectReference: {fileID: 0}
    - target: {fileID: 5957661482591841405, guid: 2e4de922897f2e149ad604ac195ee74b,
        type: 3}
      propertyPath: m_LocalPosition.x
      value: 12.79
      objectReference: {fileID: 0}
    - target: {fileID: 5957661482591841405, guid: 2e4de922897f2e149ad604ac195ee74b,
        type: 3}
      propertyPath: m_LocalPosition.y
      value: 2.177853
      objectReference: {fileID: 0}
    - target: {fileID: 5957661482591841405, guid: 2e4de922897f2e149ad604ac195ee74b,
        type: 3}
      propertyPath: m_LocalPosition.z
      value: 0
      objectReference: {fileID: 0}
    - target: {fileID: 5957661482591841405, guid: 2e4de922897f2e149ad604ac195ee74b,
        type: 3}
      propertyPath: m_LocalRotation.w
      value: 0.7071068
      objectReference: {fileID: 0}
    - target: {fileID: 5957661482591841405, guid: 2e4de922897f2e149ad604ac195ee74b,
        type: 3}
      propertyPath: m_LocalRotation.x
      value: -0
      objectReference: {fileID: 0}
    - target: {fileID: 5957661482591841405, guid: 2e4de922897f2e149ad604ac195ee74b,
        type: 3}
      propertyPath: m_LocalRotation.y
      value: -0
      objectReference: {fileID: 0}
    - target: {fileID: 5957661482591841405, guid: 2e4de922897f2e149ad604ac195ee74b,
        type: 3}
      propertyPath: m_LocalRotation.z
      value: 0.7071068
      objectReference: {fileID: 0}
    - target: {fileID: 5957661482591841405, guid: 2e4de922897f2e149ad604ac195ee74b,
        type: 3}
      propertyPath: m_LocalEulerAnglesHint.x
      value: 0
      objectReference: {fileID: 0}
    - target: {fileID: 5957661482591841405, guid: 2e4de922897f2e149ad604ac195ee74b,
        type: 3}
      propertyPath: m_LocalEulerAnglesHint.y
      value: 0
      objectReference: {fileID: 0}
    - target: {fileID: 5957661482591841405, guid: 2e4de922897f2e149ad604ac195ee74b,
        type: 3}
      propertyPath: m_LocalEulerAnglesHint.z
      value: 90
      objectReference: {fileID: 0}
    - target: {fileID: 5957661482591841407, guid: 2e4de922897f2e149ad604ac195ee74b,
        type: 3}
      propertyPath: m_Name
      value: game elements_12
      objectReference: {fileID: 0}
    m_RemovedComponents: []
  m_SourcePrefab: {fileID: 100100000, guid: 2e4de922897f2e149ad604ac195ee74b, type: 3}
--- !u!4 &3726511903271692265 stripped
Transform:
  m_CorrespondingSourceObject: {fileID: 5957661482591841405, guid: 2e4de922897f2e149ad604ac195ee74b,
    type: 3}
  m_PrefabInstance: {fileID: 6997159339105438612}
  m_PrefabAsset: {fileID: 0}
