{
  "flashsale_hcm_bd_082018_CP01": {
    "name": "Flash sale 3 ngày vàng",
    "banner_url": "",
    "branches": ["CP01"],
    "date": {
      "startDate": "2018-08-23T17:00:00.000Z",
      "endDate": "2018-08-26T16:59:59.000Z"
    },
    "data": {},
    "priority": 2,
    "limited_quantity": 1
  },
  "flashsale_hcm_bd_082018_CP02": {
    "name": "Flash sale 3 ngày vàng",
    "banner_url": "",
    "branches": ["CP02"],
    "date": {
      "startDate": "2018-08-23T17:00:00.000Z",
      "endDate": "2018-08-26T16:59:59.000Z"
    },
    "data": {},
    "priority": 2,
    "limited_quantity": 1
  },
  "flashsale_hcm_bd_082018_CP04": {
    "name": "Flash sale 3 ngày vàng",
    "banner_url": "",
    "branches": ["CP04"],
    "date": {
      "startDate": "2018-08-23T17:00:00.000Z",
      "endDate": "2018-08-26T16:59:59.000Z"
    },
    "data": {},
    "priority": 2,
    "limited_quantity": 1
  },
  "flashsale_hcm_bd_082018_CP05": {
    "name": "Flash sale 3 ngày vàng",
    "banner_url": "",
    "branches": ["CP05"],
    "date": {
      "startDate": "2018-08-23T17:00:00.000Z",
      "endDate": "2018-08-26T16:59:59.000Z"
    },
    "data": {},
    "priority": 2,
    "limited_quantity": 1
  },
  "flashsale_hcm_bd_082018_CP06": {
    "name": "Flash sale 3 ngày vàng",
    "banner_url": "",
    "branches": ["CP06"],
    "date": {
      "startDate": "2018-08-23T17:00:00.000Z",
      "endDate": "2018-08-26T16:59:59.000Z"
    },
    "data": {},
    "priority": 2,
    "limited_quantity": 1
  },
  "flashsale_hcm_bd_082018_CP07": {
    "name": "Flash sale 3 ngày vàng",
    "banner_url": "",
    "branches": ["CP07"],
    "date": {
      "startDate": "2018-08-23T17:00:00.000Z",
      "endDate": "2018-08-26T16:59:59.000Z"
    },
    "data": {},
    "priority": 2,
    "limited_quantity": 1
  },
  "flashsale_hcm_bd_082018_CP08": {
    "name": "Flash sale 3 ngày vàng",
    "banner_url": "",
    "branches": ["CP08"],
    "date": {
      "startDate": "2018-08-23T17:00:00.000Z",
      "endDate": "2018-08-26T16:59:59.000Z"
    },
    "data": {},
    "priority": 2,
    "limited_quantity": 1
  }
}
