{
  "KM_KT_BACNINH_082018": {
    "applyWithOthers": false,
    "branches": ["CP24"],
    "data": {
      "KM_KT_BACNINH_082018_DATA_LAPTOP_10M_15M": {
        "active": true,
        "benefit": {
          "is_one_of": [
            {
              "promotion_discount": 500000
            }
          ]
        },
        "condition": {
          "products": {
            "is_one_of": [
              {
                "category": {
                  "code": "01-N004-03",
                  "include_children": true,
                  "price_condition": {
                    "unit_price": {
                      "is_greater_or_equal_to": 10000000,
                      "is_smaller_than": 15000000
                    }
                  },
                  "quantity": 1,
                  "required": true
                }
              },
              {
                "category": {
                  "code": "01-N001",
                  "include_children": true,
                  "price_condition": {
                    "unit_price": {
                      "is_greater_or_equal_to": 10000000,
                      "is_smaller_than": 15000000
                    }
                  },
                  "quantity": 1,
                  "required": true
                }
              }
            ]
          }
        },
        "total_value": 500000,
        "description": "Giảm giá 500.000đ khi mua laptop từ 10 triệu đến dưới 15 triệu (từ 30/08 - 30/09/2018)"
      },
      "KM_KT_BACNINH_082018_DATA_LAPTOP_15M_25M": {
        "active": true,
        "benefit": {
          "is_one_of": [
            {
              "promotion_discount": 1000000
            }
          ]
        },
        "condition": {
          "products": {
            "is_one_of": [
              {
                "category": {
                  "code": "01-N004-03",
                  "include_children": true,
                  "price_condition": {
                    "unit_price": {
                      "is_greater_or_equal_to": 15000000,
                      "is_smaller_than": 25000000
                    }
                  },
                  "quantity": 1,
                  "required": true
                }
              },
              {
                "category": {
                  "code": "01-N001",
                  "include_children": true,
                  "price_condition": {
                    "unit_price": {
                      "is_greater_or_equal_to": 15000000,
                      "is_smaller_than": 25000000
                    }
                  },
                  "quantity": 1,
                  "required": true
                }
              }
            ]
          }
        },
        "total_value": 1000000,
        "description": "Giảm giá 1.000.000đ khi mua laptop từ 15 triệu đến dưới 25 triệu (từ 30/08 - 30/09/2018)"
      },
      "KM_KT_BACNINH_082018_DATA_LAPTOP_25M": {
        "active": true,
        "benefit": {
          "is_one_of": [
            {
              "promotion_discount": 1500000
            }
          ]
        },
        "condition": {
          "products": {
            "is_one_of": [
              {
                "category": {
                  "code": "01-N004-03",
                  "include_children": true,
                  "price_condition": {
                    "unit_price": {
                      "is_greater_or_equal_to": 25000000
                    }
                  },
                  "quantity": 1,
                  "required": true
                }
              },
              {
                "category": {
                  "code": "01-N001",
                  "include_children": true,
                  "price_condition": {
                    "unit_price": {
                      "is_greater_or_equal_to": 25000000
                    }
                  },
                  "quantity": 1,
                  "required": true
                }
              }
            ]
          }
        },
        "total_value": 1500000,
        "description": "Giảm giá 1.500.000đ khi mua laptop từ 25 triệu trở lên (từ 30/08 - 30/09/2018)"
      },
      "KM_KT_BACNINH_082018_DATA_PC_BO_10M_15M": {
        "active": true,
        "benefit": {
          "is_one_of": [
            {
              "promotion_discount": 500000
            }
          ]
        },
        "condition": {
          "products": {
            "is_one_of": [
              {
                "category": {
                  "code": "02-N001",
                  "include_children": true,
                  "price_condition": {
                    "unit_price": {
                      "is_greater_or_equal_to": 10000000,
                      "is_smaller_than": 15000000
                    }
                  },
                  "quantity": 1,
                  "required": true
                }
              }
            ]
          }
        },
        "total_value": 500000,
        "description": "Giảm giá 500.000đ khi mua PC bộ từ 10 triệu đến dưới 15 triệu (từ 30/08 - 30/09/2018)"
      },
      "KM_KT_BACNINH_082018_DATA_PC_BO_15M_25M": {
        "active": true,
        "benefit": {
          "is_one_of": [
            {
              "promotion_discount": 1000000
            }
          ]
        },
        "condition": {
          "products": {
            "is_one_of": [
              {
                "category": {
                  "code": "02-N001",
                  "include_children": true,
                  "price_condition": {
                    "unit_price": {
                      "is_greater_or_equal_to": 15000000,
                      "is_smaller_than": 25000000
                    }
                  },
                  "quantity": 1,
                  "required": true
                }
              }
            ]
          }
        },
        "total_value": 1000000,
        "description": "Giảm giá 1.000.000đ khi mua PC bộ từ 15 triệu đến dưới 25 triệu (từ 30/08 - 30/09/2018)"
      },
      "KM_KT_BACNINH_082018_DATA_PC_BO_25M": {
        "active": true,
        "benefit": {
          "is_one_of": [
            {
              "promotion_discount": 1500000
            }
          ]
        },
        "condition": {
          "products": {
            "is_one_of": [
              {
                "category": {
                  "code": "02-N001",
                  "include_children": true,
                  "price_condition": {
                    "unit_price": {
                      "is_greater_or_equal_to": 25000000
                    }
                  },
                  "quantity": 1,
                  "required": true
                }
              }
            ]
          }
        },
        "total_value": 1500000,
        "description": "Giảm giá 1.500.000đ khi mua PC bộ từ 25 triệu trở lên (từ 30/08 - 30/09/2018)"
      },
      "KM_KT_BACNINH_082018_DATA_BUILD_PC_10M_15M": {
        "active": true,
        "benefit": {
          "is_one_of": [
            {
              "promotion_discount": 500000
            }
          ]
        },
        "condition": {
          "products": {
            "is_all_of": [
              {
                "category": {
                  "code": "02-N004",
                  "include_children": true,
                  "name": "Ram",
                  "quantity": 1,
                  "required": true
                }
              },
              {
                "category": {
                  "code": "02-N002",
                  "include_children": true,
                  "name": "Mainboard",
                  "quantity": 1,
                  "required": true
                }
              },
              {
                "category": {
                  "code": "02-N003",
                  "include_children": true,
                  "name": "Cpu",
                  "quantity": 1,
                  "required": true
                }
              },
              {
                "category": {
                  "code": "02-N005",
                  "include_children": true,
                  "name": "ổ cứng gắn trong",
                  "quantity": 1,
                  "required": true
                }
              },
              {
                "category": {
                  "code": "02-N009",
                  "include_children": true,
                  "name": "Thùng Máy",
                  "quantity": 1,
                  "required": true
                }
              },
              {
                "is_one_of": [
                  {
                    "category": {
                      "code": "02-N010",
                      "include_children": true,
                      "quantity": 1,
                      "required": true
                    }
                  },
                  {
                    "category": {
                      "code": "01-N002-05",
                      "include_children": true,
                      "quantity": 1,
                      "required": true
                    }
                  }
                ]
              }
            ]
          }
        },
        "total_value": 500000,
        "description": "Giảm giá 500.000đ khi mua PC từ 10 triệu đến dưới 15 triệu (từ 30/08 - 30/09/2018)"
      },
      "KM_KT_BACNINH_082018_DATA_BUILD_PC_15M_25M": {
        "active": true,
        "benefit": {
          "is_one_of": [
            {
              "promotion_discount": 1000000
            }
          ]
        },
        "condition": {
          "products": {
            "is_all_of": [
              {
                "category": {
                  "code": "02-N004",
                  "include_children": true,
                  "name": "Ram",
                  "quantity": 1,
                  "required": true
                }
              },
              {
                "category": {
                  "code": "02-N002",
                  "include_children": true,
                  "name": "Mainboard",
                  "quantity": 1,
                  "required": true
                }
              },
              {
                "category": {
                  "code": "02-N003",
                  "include_children": true,
                  "name": "Cpu",
                  "quantity": 1,
                  "required": true
                }
              },
              {
                "category": {
                  "code": "02-N005",
                  "include_children": true,
                  "name": "ổ cứng gắn trong",
                  "quantity": 1,
                  "required": true
                }
              },
              {
                "category": {
                  "code": "02-N009",
                  "include_children": true,
                  "name": "Thùng Máy",
                  "quantity": 1,
                  "required": true
                }
              },
              {
                "is_one_of": [
                  {
                    "category": {
                      "code": "02-N010",
                      "include_children": true,
                      "quantity": 1,
                      "required": true
                    }
                  },
                  {
                    "category": {
                      "code": "01-N002-05",
                      "include_children": true,
                      "quantity": 1,
                      "required": true
                    }
                  }
                ]
              }
            ]
          }
        },
        "total_value": 1000000,
        "description": "Giảm giá 1.000.000đ khi mua PC từ 15 triệu đến dưới 25 triệu (từ 30/08 - 30/09/2018)"
      },
      "KM_KT_BACNINH_082018_DATA_BUILD_PC_25M": {
        "active": true,
        "benefit": {
          "is_one_of": [
            {
              "promotion_discount": 1500000
            }
          ]
        },
        "condition": {
          "products": {
            "is_all_of": [
              {
                "category": {
                  "code": "02-N004",
                  "include_children": true,
                  "name": "Ram",
                  "quantity": 1,
                  "required": true
                }
              },
              {
                "category": {
                  "code": "02-N002",
                  "include_children": true,
                  "name": "Mainboard",
                  "quantity": 1,
                  "required": true
                }
              },
              {
                "category": {
                  "code": "02-N003",
                  "include_children": true,
                  "name": "Cpu",
                  "quantity": 1,
                  "required": true
                }
              },
              {
                "category": {
                  "code": "02-N005",
                  "include_children": true,
                  "name": "ổ cứng gắn trong",
                  "quantity": 1,
                  "required": true
                }
              },
              {
                "category": {
                  "code": "02-N009",
                  "include_children": true,
                  "name": "Thùng Máy",
                  "quantity": 1,
                  "required": true
                }
              },
              {
                "is_one_of": [
                  {
                    "category": {
                      "code": "02-N010",
                      "include_children": true,
                      "quantity": 1,
                      "required": true
                    }
                  },
                  {
                    "category": {
                      "code": "01-N002-05",
                      "include_children": true,
                      "quantity": 1,
                      "required": true
                    }
                  }
                ]
              }
            ]
          }
        },
        "total_value": 1500000,
        "description": "Giảm giá 1.500.000đ khi mua PC từ 25 triệu trở lên (từ 30/08 - 30/09/2018)"
      }
    },
    "dateTime": {
      "date": {
        "end": 1538326799000,
        "start": 1535509530000
      },
      "time": [
        {
          "end": 23,
          "start": 0
        }
      ]
    },
    "description": "",
    "name": "Mua laptop tặng Audi"
  }
}
