[
  {
    "category": {
      "code": "02-N004",
      "include_children": true,
      "name": "Ram",
      "quantity": 1,
      "required": true
    }
  },
  {
    "category": {
      "code": "02-N002",
      "include_children": true,
      "name": "Mainboard",
      "quantity": 1,
      "required": true
    }
  },
  {
    "category": {
      "code": "02-N003",
      "include_children": true,
      "name": "Cpu",
      "quantity": 1,
      "required": true
    }
  },
  {
    "category": {
      "code": "02-N005",
      "include_children": true,
      "name": "ổ cứng gắn trong",
      "quantity": 1,
      "required": true
    }
  },
  {
    "category": {
      "code": "02-N009",
      "include_children": true,
      "name": "Thùng Máy",
      "quantity": 1,
      "required": true
    }
  },
  {
    "category": {
      "code": "02-N008",
      "include_children": true,
      "name": "Card Màn Hình",
      "quantity": 1,
      "required": true
    }
  },
  {
    "is_one_of": [
      {
        "category": {
          "code": "02-N010",
          "include_children": true,
          "quantity": 1,
          "required": true
        }
      },
      {
        "category": {
          "code": "01-N002-05",
          "include_children": true,
          "quantity": 1,
          "required": true
        }
      }
    ]
  }
]
