{
  "type": "service_account",
  "project_id": "testclound-7eb7b",
  "private_key_id": "3cee4ba20c36a40a5e5d43f5c8bf29209ff762ea",
  "private_key": "-----BEGIN PRIVATE KEY-----\nMIIEvQIBADANBgkqhkiG9w0BAQEFAASCBKcwggSjAgEAAoIBAQCxGU76BboD6Q+T\nWU6qixd7Z3w/xfbrEVrV/YT/X5SpFeiA0CxrJJkKFsXQEMa+O/g46N5av3Wknqj+\nXhKInzGW1Xx7PJBE5xYEpvDaPi+0pwI7hc/vSdGY39EDsJqmRmLQXBobGKTOAsZv\nBcAEG1q1TAe0Q8Jf2P6ZiW3QINve66rRYuHf7eAyKaSIYKVdogXfwJ7ZtALUH8bR\nLtjlvCRaoci4yEVSjANli+7BcsSm/r3Ox2uy4B9uXjQ+lcCbN2Xg/KYjwBtu1Rok\n5RU5WESbgqYsC4gEKPHWoxqoDaKmHH444CgUhbD3cEIOtbhbdp7JuLdCi2X6e6OO\nqSKSigMHAgMBAAECggEAKKJS8aDwvkbyUO+z0gOZ/rGO258TeXoA6oqBwoputKEX\nOL8LAgZiquLwvj2rLCjcWkpsAkxdtMjGo554CCrmmOIg7rHFtFmFPsoDB0Avd/a9\n12Rrgk7grX/lGECkKzSJJZ+MSd1MqwwN9ZlPJmIUXPa16dGGPrGuMRJMRO3VJP9w\n0LzqrE2sUgKfIB/sUifPZzFnQytFpzQizh+eHvkg9C5QmtXCzltfevYtXMHSaPmf\ngQDsKeyFVomHd+ZxlvLrhDCHacxGol0KRWnHmE6hXq6+OHHgF38y6lhLnjsuXd3z\n+Zca09GNJLNEH6+fjV3FSt/+y0LCEHW0OGOQdoXmCQKBgQD4d0c5vt4H7YlTCS43\noGIRK7rwAXRJgZLfJO4L53l/4TwX+8lJeo98WDfUMtzfb936OwKfumce78DqBk2J\nf/PpKhQaq/fuBYjEmEtS7poYqgBMudnlvylNX8SIJdDp/uDlphAFJvZ7QlMwtv76\nIP0lt7ttrkPQ2JQeGc3m1Hvn5QKBgQC2eAq+h6WMlO6/qvdylwb2/AXYcXqZJ54m\nm9EuzpHpHMdHik6ur5V2g/H8K0cIxC1E2hckapgrbgjeZTHWJPEl3qkD9oTWYyhm\nvIYyjRnn9WONrLBj8/BusO/euB+qwqMXd1V3cJMpALaQsCCU13QZVF0boBF9WGMk\nlaHuS7G4ewKBgBHn7q8frTqfCL1+NOF3YnngT+mKAUpm1yHTtIARH3Vy0vTbhWcR\nORP5+5QEUlyb4EBvTkIameHl314+NApLuVU9XhOJ/yUdKv0YCJ2iamKKpdjhr+1Z\nuG1GEJDLQOIMJ0MFk7P7WdoKLpqdJYT7KaM1OYGvBF4hrZL5wxf2ijNtAoGAEvXi\nV+4Me9E2BeCkGdortRp3GQihrqx5OJXUZMK+UrTU2FA84NYJ9+i6CnQMy5JnCdKH\nuRcCfPDQJxvo09G+5Sp/8ZN6NjTTi+lnIHWdDYdoMt6Q7bH5d+cW5dPIJpxXCicy\nUFj4UbhrQBmtKQpCXCdyDV7Ssm2uz6xkyThAXWUCgYEAj2RQtb28K9AicnOrIGUb\nrevDKh9aMxXkJGPIZuWbJzz80qMSatLSmCM7FbQ9XruP+ZyPDzrg3S8dX5PxxU2v\nZjiwUlle58c0JOnAAWCXyujlifEf+A+N+qNLIN6OB0WOON0gZ3gEZC3JhQQlpjOV\nwQwFmj8WQv2ceWtipbLfB7I=\n-----END PRIVATE KEY-----\n",
  "client_email": "testclound-7eb7b@appspot.gserviceaccount.com",
  "client_id": "110751224277913103188",
  "auth_uri": "https://accounts.google.com/o/oauth2/auth",
  "token_uri": "https://oauth2.googleapis.com/token",
  "auth_provider_x509_cert_url": "https://www.googleapis.com/oauth2/v1/certs",
  "client_x509_cert_url": "https://www.googleapis.com/robot/v1/metadata/x509/testclound-7eb7b%40appspot.gserviceaccount.com"
}
