%!PS-Adobe-3.0 EPSF-3.0
%%Creator: MATLAB, The MathWorks, Inc. Version 8.1.0.604 (R2013a). Operating System: Microsoft Windows 7.
%%Title: D:\git\itce2011\graph-dp\matlab\eps\total-variance.eps
%%CreationDate: 10/31/2016  10:23:01
%%DocumentNeededFonts: Helvetica
%%DocumentProcessColors: Cyan Magenta Yellow Black
%%LanguageLevel: 2
%%Pages: 1
%%BoundingBox:    96   240   515   551
%%EndComments

%%BeginProlog
% MathWorks dictionary
/MathWorks 160 dict begin
% definition operators
/bdef {bind def} bind def
/ldef {load def} bind def
/xdef {exch def} bdef
/xstore {exch store} bdef
% operator abbreviations
/c  /clip ldef
/cc /concat ldef
/cp /closepath ldef
/gr /grestore ldef
/gs /gsave ldef
/mt /moveto ldef
/np /newpath ldef
/cm /currentmatrix ldef
/sm /setmatrix ldef
/rm /rmoveto ldef
/rl /rlineto ldef
/s {show newpath} bdef
/sc {setcmykcolor} bdef
/sr /setrgbcolor ldef
/sg /setgray ldef
/w /setlinewidth ldef
/j /setlinejoin ldef
/cap /setlinecap ldef
/rc {rectclip} bdef
/rf {rectfill} bdef
% page state control
/pgsv () def
/bpage {/pgsv save def} bdef
/epage {pgsv restore} bdef
/bplot /gsave ldef
/eplot {stroke grestore} bdef
% orientation switch
/portraitMode 0 def /landscapeMode 1 def /rotateMode 2 def
% coordinate system mappings
/dpi2point 0 def
% font control
/FontSize 0 def
/FMS {/FontSize xstore findfont [FontSize 0 0 FontSize neg 0 0]
  makefont setfont} bdef
/ISOLatin1Encoding where {pop /WindowsLatin1Encoding 256 array bdef
ISOLatin1Encoding WindowsLatin1Encoding copy pop
/.notdef/.notdef/quotesinglbase/florin/quotedblbase/ellipsis/dagger
/daggerdbl/circumflex/perthousand/Scaron/guilsinglleft/OE/.notdef/.notdef
/.notdef/.notdef/quoteleft/quoteright/quotedblleft/quotedblright/bullet
/endash/emdash/tilde/trademark/scaron/guilsinglright/oe/.notdef/.notdef
/Ydieresis WindowsLatin1Encoding 128 32 getinterval astore pop}
{/WindowsLatin1Encoding StandardEncoding bdef} ifelse
/reencode {exch dup where {pop load} {pop StandardEncoding} ifelse
  exch dup 3 1 roll findfont dup length dict begin
  { 1 index /FID ne {def}{pop pop} ifelse } forall
  /Encoding exch def currentdict end definefont pop} bdef
/isroman {findfont /CharStrings get /Agrave known} bdef
/FMSR {3 1 roll 1 index dup isroman {reencode} {pop pop} ifelse
  exch FMS} bdef
/csm {1 dpi2point div -1 dpi2point div scale neg translate
 dup landscapeMode eq {pop -90 rotate}
  {rotateMode eq {90 rotate} if} ifelse} bdef
% line types: solid, dotted, dashed, dotdash
/SO { [] 0 setdash } bdef
/DO { [.5 dpi2point mul 4 dpi2point mul] 0 setdash } bdef
/DA { [6 dpi2point mul] 0 setdash } bdef
/DD { [.5 dpi2point mul 4 dpi2point mul 6 dpi2point mul 4
  dpi2point mul] 0 setdash } bdef
% macros for lines and objects
/L {lineto stroke} bdef
/MP {3 1 roll moveto 1 sub {rlineto} repeat} bdef
/AP {{rlineto} repeat} bdef
/PDlw -1 def
/W {/PDlw currentlinewidth def setlinewidth} def
/PP {closepath eofill} bdef
/DP {closepath stroke} bdef
/MR {4 -2 roll moveto dup  0 exch rlineto exch 0 rlineto
  neg 0 exch rlineto closepath} bdef
/FR {MR stroke} bdef
/PR {MR fill} bdef
/L1i {{currentfile picstr readhexstring pop} image} bdef
/tMatrix matrix def
/MakeOval {newpath tMatrix currentmatrix pop translate scale
0 0 1 0 360 arc tMatrix setmatrix} bdef
/FO {MakeOval stroke} bdef
/PO {MakeOval fill} bdef
/PD {currentlinewidth 2 div 0 360 arc fill
   PDlw -1 eq not {PDlw w /PDlw -1 def} if} def
/FA {newpath tMatrix currentmatrix pop translate scale
  0 0 1 5 -2 roll arc tMatrix setmatrix stroke} bdef
/PA {newpath tMatrix currentmatrix pop	translate 0 0 moveto scale
  0 0 1 5 -2 roll arc closepath tMatrix setmatrix fill} bdef
/FAn {newpath tMatrix currentmatrix pop translate scale
  0 0 1 5 -2 roll arcn tMatrix setmatrix stroke} bdef
/PAn {newpath tMatrix currentmatrix pop translate 0 0 moveto scale
  0 0 1 5 -2 roll arcn closepath tMatrix setmatrix fill} bdef
/vradius 0 def /hradius 0 def /lry 0 def
/lrx 0 def /uly 0 def /ulx 0 def /rad 0 def
/MRR {/vradius xdef /hradius xdef /lry xdef /lrx xdef /uly xdef
  /ulx xdef newpath tMatrix currentmatrix pop ulx hradius add uly
  vradius add translate hradius vradius scale 0 0 1 180 270 arc 
  tMatrix setmatrix lrx hradius sub uly vradius add translate
  hradius vradius scale 0 0 1 270 360 arc tMatrix setmatrix
  lrx hradius sub lry vradius sub translate hradius vradius scale
  0 0 1 0 90 arc tMatrix setmatrix ulx hradius add lry vradius sub
  translate hradius vradius scale 0 0 1 90 180 arc tMatrix setmatrix
  closepath} bdef
/FRR {MRR stroke } bdef
/PRR {MRR fill } bdef
/MlrRR {/lry xdef /lrx xdef /uly xdef /ulx xdef /rad lry uly sub 2 div def
  newpath tMatrix currentmatrix pop ulx rad add uly rad add translate
  rad rad scale 0 0 1 90 270 arc tMatrix setmatrix lrx rad sub lry rad
  sub translate rad rad scale 0 0 1 270 90 arc tMatrix setmatrix
  closepath} bdef
/FlrRR {MlrRR stroke } bdef
/PlrRR {MlrRR fill } bdef
/MtbRR {/lry xdef /lrx xdef /uly xdef /ulx xdef /rad lrx ulx sub 2 div def
  newpath tMatrix currentmatrix pop ulx rad add uly rad add translate
  rad rad scale 0 0 1 180 360 arc tMatrix setmatrix lrx rad sub lry rad
  sub translate rad rad scale 0 0 1 0 180 arc tMatrix setmatrix
  closepath} bdef
/FtbRR {MtbRR stroke } bdef
/PtbRR {MtbRR fill } bdef
/stri 6 array def /dtri 6 array def
/smat 6 array def /dmat 6 array def
/tmat1 6 array def /tmat2 6 array def /dif 3 array def
/asub {/ind2 exch def /ind1 exch def dup dup
  ind1 get exch ind2 get sub exch } bdef
/tri_to_matrix {
  2 0 asub 3 1 asub 4 0 asub 5 1 asub
  dup 0 get exch 1 get 7 -1 roll astore } bdef
/compute_transform {
  dmat dtri tri_to_matrix tmat1 invertmatrix 
  smat stri tri_to_matrix tmat2 concatmatrix } bdef
/ds {stri astore pop} bdef
/dt {dtri astore pop} bdef
/db {2 copy /cols xdef /rows xdef mul dup 3 mul string
  currentfile 
  3 index 0 eq {/ASCIIHexDecode filter}
  {/ASCII85Decode filter 3 index 2 eq {/RunLengthDecode filter} if }
  ifelse exch readstring pop
  dup 0 3 index getinterval /rbmap xdef
  dup 2 index dup getinterval /gbmap xdef
  1 index dup 2 mul exch getinterval /bbmap xdef pop pop}bdef
/it {gs np dtri aload pop moveto lineto lineto cp c
  cols rows 8 compute_transform 
  rbmap gbmap bbmap true 3 colorimage gr}bdef
/il {newpath moveto lineto stroke}bdef
currentdict end def
%%EndProlog

%%BeginSetup
MathWorks begin

0 cap

end
%%EndSetup

%%Page: 1 1
%%BeginPageSetup
%%PageBoundingBox:    96   240   515   551
MathWorks begin
bpage
%%EndPageSetup

%%BeginObject: obj1
bplot

/dpi2point 12 def
portraitMode 1152 6612 csm

    0     0  5039  3726 rc
85 dict begin %Colortable dictionary
/c0 { 0.000000 0.000000 0.000000 sr} bdef
/c1 { 1.000000 1.000000 1.000000 sr} bdef
/c2 { 0.900000 0.000000 0.000000 sr} bdef
/c3 { 0.000000 0.820000 0.000000 sr} bdef
/c4 { 0.000000 0.000000 0.800000 sr} bdef
/c5 { 0.910000 0.820000 0.320000 sr} bdef
/c6 { 1.000000 0.260000 0.820000 sr} bdef
/c7 { 0.000000 0.820000 0.820000 sr} bdef
c0
1 j
1 sg
   0    0 5040 3727 rf
6 w
0 3038 3905 0 0 -3038 655 3316 4 MP
PP
-3905 0 0 3038 3905 0 0 -3038 655 3316 5 MP stroke
4 w
DO
SO
6 w
0 sg
 655  278 mt 4560  278 L
 655 3316 mt 4560 3316 L
4560 3316 mt 4560  278 L
 655 3316 mt  655  278 L
 655 3316 mt 4560 3316 L
 655 3316 mt  655  278 L
 980 3316 mt  980 3276 L
 980  279 mt  980  318 L
%%IncludeResource: font Helvetica
/Helvetica /WindowsLatin1Encoding 120 FMSR

 947 3461 mt 
(1) s
1305 3316 mt 1305 3276 L
1305  279 mt 1305  318 L
1272 3461 mt 
(2) s
1631 3316 mt 1631 3276 L
1631  279 mt 1631  318 L
1598 3461 mt 
(3) s
1956 3316 mt 1956 3276 L
1956  279 mt 1956  318 L
1923 3461 mt 
(4) s
2282 3316 mt 2282 3276 L
2282  279 mt 2282  318 L
2249 3461 mt 
(5) s
2607 3316 mt 2607 3276 L
2607  279 mt 2607  318 L
2574 3461 mt 
(6) s
2932 3316 mt 2932 3276 L
2932  279 mt 2932  318 L
2899 3461 mt 
(7) s
3258 3316 mt 3258 3276 L
3258  279 mt 3258  318 L
3225 3461 mt 
(8) s
3583 3316 mt 3583 3276 L
3583  279 mt 3583  318 L
3550 3461 mt 
(9) s
3909 3316 mt 3909 3276 L
3909  279 mt 3909  318 L
3843 3461 mt 
(10) s
4234 3316 mt 4234 3276 L
4234  279 mt 4234  318 L
4168 3461 mt 
(11) s
 655 3316 mt  694 3316 L
4560 3316 mt 4520 3316 L
 554 3360 mt 
(0) s
 655 2978 mt  694 2978 L
4560 2978 mt 4520 2978 L
 454 3022 mt 
(0.1) s
 655 2641 mt  694 2641 L
4560 2641 mt 4520 2641 L
 454 2685 mt 
(0.2) s
 655 2303 mt  694 2303 L
4560 2303 mt 4520 2303 L
 454 2347 mt 
(0.3) s
 655 1966 mt  694 1966 L
4560 1966 mt 4520 1966 L
 454 2010 mt 
(0.4) s
 655 1628 mt  694 1628 L
4560 1628 mt 4520 1628 L
 454 1672 mt 
(0.5) s
 655 1291 mt  694 1291 L
4560 1291 mt 4520 1291 L
 454 1335 mt 
(0.6) s
 655  953 mt  694  953 L
4560  953 mt 4520  953 L
 454  997 mt 
(0.7) s
 655  616 mt  694  616 L
4560  616 mt 4520  616 L
 454  660 mt 
(0.8) s
 655  279 mt  694  279 L
4560  279 mt 4520  279 L
 454  323 mt 
(0.9) s
 655  278 mt 4560  278 L
 655 3316 mt 4560 3316 L
4560 3316 mt 4560  278 L
 655 3316 mt  655  278 L
gs 655 279 3906 3038 rc
/c8 { 0.000000 0.000000 0.562500 sr} bdef
c8
0 17 47 0 0 -17 910 3316 4 MP
PP
0 sg
-47 0 0 17 47 0 0 -17 910 3316 5 MP stroke
c8
0 43 46 0 0 -43 1236 3316 4 MP
PP
0 sg
-46 0 0 43 46 0 0 -43 1236 3316 5 MP stroke
c8
0 124 47 0 0 -124 1561 3316 4 MP
PP
0 sg
-47 0 0 124 47 0 0 -124 1561 3316 5 MP stroke
c8
0 579 47 0 0 -579 1886 3316 4 MP
PP
0 sg
-47 0 0 579 47 0 0 -579 1886 3316 5 MP stroke
c8
0 964 46 0 0 -964 2212 3316 4 MP
PP
0 sg
-46 0 0 964 46 0 0 -964 2212 3316 5 MP stroke
c8
0 1227 47 0 0 -1227 2537 3316 4 MP
PP
0 sg
-47 0 0 1227 47 0 0 -1227 2537 3316 5 MP stroke
c8
0 1420 46 0 0 -1420 2863 3316 4 MP
PP
0 sg
-46 0 0 1420 46 0 0 -1420 2863 3316 5 MP stroke
c8
0 1568 47 0 0 -1568 3188 3316 4 MP
PP
0 sg
-47 0 0 1568 47 0 0 -1568 3188 3316 5 MP stroke
c8
0 1991 46 0 0 -1991 3514 3316 4 MP
PP
0 sg
-46 0 0 1991 46 0 0 -1991 3514 3316 5 MP stroke
c8
0 2316 46 0 0 -2316 3839 3316 4 MP
PP
0 sg
-46 0 0 2316 46 0 0 -2316 3839 3316 5 MP stroke
c8
0 2750 47 0 0 -2750 4164 3316 4 MP
PP
0 sg
-47 0 0 2750 47 0 0 -2750 4164 3316 5 MP stroke
3905 0 655 3316 2 MP stroke
1 sg
0 17 47 0 0 -17 1003 3316 4 MP
PP
0 sg
-47 0 0 17 47 0 0 -17 1003 3316 5 MP stroke
1 sg
0 35 46 0 0 -35 1329 3316 4 MP
PP
0 sg
-46 0 0 35 46 0 0 -35 1329 3316 5 MP stroke
1 sg
0 85 46 0 0 -85 1654 3316 4 MP
PP
0 sg
-46 0 0 85 46 0 0 -85 1654 3316 5 MP stroke
1 sg
0 718 47 0 0 -718 1979 3316 4 MP
PP
0 sg
-47 0 0 718 47 0 0 -718 1979 3316 5 MP stroke
1 sg
0 1175 46 0 0 -1175 2305 3316 4 MP
PP
0 sg
-46 0 0 1175 46 0 0 -1175 2305 3316 5 MP stroke
1 sg
0 1479 47 0 0 -1479 2630 3316 4 MP
PP
0 sg
-47 0 0 1479 47 0 0 -1479 2630 3316 5 MP stroke
1 sg
0 1698 46 0 0 -1698 2956 3316 4 MP
PP
0 sg
-46 0 0 1698 46 0 0 -1698 2956 3316 5 MP stroke
1 sg
0 1863 47 0 0 -1863 3281 3316 4 MP
PP
0 sg
-47 0 0 1863 47 0 0 -1863 3281 3316 5 MP stroke
1 sg
0 1902 47 0 0 -1902 3606 3316 4 MP
PP
0 sg
-47 0 0 1902 47 0 0 -1902 3606 3316 5 MP stroke
1 sg
0 2221 46 0 0 -2221 3932 3316 4 MP
PP
0 sg
-46 0 0 2221 46 0 0 -2221 3932 3316 5 MP stroke
1 sg
0 2618 47 0 0 -2618 4257 3316 4 MP
PP
0 sg
-47 0 0 2618 47 0 0 -2618 4257 3316 5 MP stroke
gr

%%IncludeResource: font Helvetica
/Helvetica /WindowsLatin1Encoding 168 FMSR

 454 3639 mt 
(k-) s
%%IncludeResource: font Symbol
/Symbol /WindowsLatin1Encoding 168 FMSR

 636 3639 mt 
(e) s
%%IncludeResource: font Helvetica
/Helvetica /WindowsLatin1Encoding 168 FMSR

 709 3639 mt 
(\(1-3\)                 MaxVar \(4-8\)            RandWalk \(9-1\
1\)) s
 362 2967 mt  -90 rotate
(Total variance/number of edges) s
90 rotate
%%IncludeResource: font Helvetica
/Helvetica /WindowsLatin1Encoding 120 FMSR

 638 3359 mt 
( ) s
4544  321 mt 
( ) s
1 sg
0 444 1101 0 0 -444 715 783 4 MP
PP
-1101 0 0 444 1101 0 0 -444 715 783 5 MP stroke
4 w
DO
SO
6 w
0 sg
 715  339 mt 1816  339 L
 715  783 mt 1816  783 L
1816  783 mt 1816  339 L
 715  783 mt  715  339 L
 715  783 mt 1816  783 L
 715  783 mt  715  339 L
 715  339 mt 1816  339 L
 715  783 mt 1816  783 L
1816  783 mt 1816  339 L
 715  783 mt  715  339 L
%%IncludeResource: font Helvetica
/Helvetica /WindowsLatin1Encoding 168 FMSR

1177  520 mt 
(dblp) s
gs 715 339 1102 445 rc
c8
-355 0 0 152 355 0 0 -152 786 535 5 MP
PP
0 sg
0 0 -355 0 0 152 355 0 0 -152 786 535 6 MP stroke
gr

1177  723 mt 
(amazon) s
gs 715 339 1102 445 rc
1 sg
-355 0 0 152 355 0 0 -152 786 738 5 MP
PP
0 sg
0 0 -355 0 0 152 355 0 0 -152 786 738 6 MP stroke
gr

%%IncludeResource: font Helvetica
/Helvetica /WindowsLatin1Encoding 120 FMSR

3552 1182 mt 
(t=2) s
4170  486 mt 
(t=5) s
3838  914 mt 
(t=3) s
2102 1873 mt 
(n) s
%%IncludeResource: font Helvetica
/Helvetica /WindowsLatin1Encoding 96 FMSR

2168 1933 mt 
(p) s
%%IncludeResource: font Helvetica
/Helvetica /WindowsLatin1Encoding 120 FMSR

2102 2065 mt 
(800k) s
%%IncludeResource: font Symbol
/Symbol /WindowsLatin1Encoding 120 FMSR

 802 3010 mt 
(s) s
%%IncludeResource: font Helvetica
/Helvetica /WindowsLatin1Encoding 120 FMSR

 802 3156 mt 
(0.001) s
%%IncludeResource: font Symbol
/Symbol /WindowsLatin1Encoding 120 FMSR

1179 2981 mt 
(s) s
%%IncludeResource: font Helvetica
/Helvetica /WindowsLatin1Encoding 120 FMSR

1179 3127 mt 
(0.01) s
%%IncludeResource: font Symbol
/Symbol /WindowsLatin1Encoding 120 FMSR

1518 2943 mt 
(s) s
%%IncludeResource: font Helvetica
/Helvetica /WindowsLatin1Encoding 120 FMSR

1518 3089 mt 
(0.1) s
1794 2333 mt 
(n) s
%%IncludeResource: font Helvetica
/Helvetica /WindowsLatin1Encoding 96 FMSR

1860 2393 mt 
(p) s
%%IncludeResource: font Helvetica
/Helvetica /WindowsLatin1Encoding 120 FMSR

1794 2525 mt 
(400k) s
2374 1567 mt 
(n) s
%%IncludeResource: font Helvetica
/Helvetica /WindowsLatin1Encoding 96 FMSR

2440 1627 mt 
(p) s
%%IncludeResource: font Helvetica
/Helvetica /WindowsLatin1Encoding 120 FMSR

2374 1759 mt 
(1200k) s
2718 1321 mt 
(n) s
%%IncludeResource: font Helvetica
/Helvetica /WindowsLatin1Encoding 96 FMSR

2784 1381 mt 
(p) s
%%IncludeResource: font Helvetica
/Helvetica /WindowsLatin1Encoding 120 FMSR

2718 1513 mt 
(1600k) s
3085 1137 mt 
(n) s
%%IncludeResource: font Helvetica
/Helvetica /WindowsLatin1Encoding 96 FMSR

3151 1197 mt 
(p) s
%%IncludeResource: font Helvetica
/Helvetica /WindowsLatin1Encoding 120 FMSR

3085 1329 mt 
(2000k) s

end %%Color Dict

eplot
%%EndObject

epage
end

showpage

%%Trailer
%%EOF
