%!PS-Adobe-2.0 EPSF-1.2
%%Creator: MATLAB, The MathWorks, Inc. Version 8.1.0.604 (R2013a). Operating System: Microsoft Windows 7.
%%Title: eps\tradeoff-amazon.eps
%%CreationDate: 10/31/2016  10:37:42
%%DocumentNeededFonts: Helvetica
%%DocumentProcessColors: Cyan Magenta Yellow Black
%%Extensions: CMYK
%%Pages: 1
%%BoundingBox:    19   180   545   591
%%EndComments

%%BeginProlog
% MathWorks dictionary
/MathWorks 160 dict begin
% definition operators
/bdef {bind def} bind def
/ldef {load def} bind def
/xdef {exch def} bdef
/xstore {exch store} bdef
% operator abbreviations
/c  /clip ldef
/cc /concat ldef
/cp /closepath ldef
/gr /grestore ldef
/gs /gsave ldef
/mt /moveto ldef
/np /newpath ldef
/cm /currentmatrix ldef
/sm /setmatrix ldef
/rm /rmoveto ldef
/rl /rlineto ldef
/s {show newpath} bdef
/sc {setcmykcolor} bdef
/sr /setrgbcolor ldef
/sg /setgray ldef
/w /setlinewidth ldef
/j /setlinejoin ldef
/cap /setlinecap ldef
/rc {rectclip} bdef
/rf {rectfill} bdef
% page state control
/pgsv () def
/bpage {/pgsv save def} bdef
/epage {pgsv restore} bdef
/bplot /gsave ldef
/eplot {stroke grestore} bdef
% orientation switch
/portraitMode 0 def /landscapeMode 1 def /rotateMode 2 def
% coordinate system mappings
/dpi2point 0 def
% font control
/FontSize 0 def
/FMS {/FontSize xstore findfont [FontSize 0 0 FontSize neg 0 0]
  makefont setfont} bdef
/ISOLatin1Encoding where {pop /WindowsLatin1Encoding 256 array bdef
ISOLatin1Encoding WindowsLatin1Encoding copy pop
/.notdef/.notdef/quotesinglbase/florin/quotedblbase/ellipsis/dagger
/daggerdbl/circumflex/perthousand/Scaron/guilsinglleft/OE/.notdef/.notdef
/.notdef/.notdef/quoteleft/quoteright/quotedblleft/quotedblright/bullet
/endash/emdash/tilde/trademark/scaron/guilsinglright/oe/.notdef/.notdef
/Ydieresis WindowsLatin1Encoding 128 32 getinterval astore pop}
{/WindowsLatin1Encoding StandardEncoding bdef} ifelse
/reencode {exch dup where {pop load} {pop StandardEncoding} ifelse
  exch dup 3 1 roll findfont dup length dict begin
  { 1 index /FID ne {def}{pop pop} ifelse } forall
  /Encoding exch def currentdict end definefont pop} bdef
/isroman {findfont /CharStrings get /Agrave known} bdef
/FMSR {3 1 roll 1 index dup isroman {reencode} {pop pop} ifelse
  exch FMS} bdef
/csm {1 dpi2point div -1 dpi2point div scale neg translate
 dup landscapeMode eq {pop -90 rotate}
  {rotateMode eq {90 rotate} if} ifelse} bdef
% line types: solid, dotted, dashed, dotdash
/SO { [] 0 setdash } bdef
/DO { [.5 dpi2point mul 4 dpi2point mul] 0 setdash } bdef
/DA { [6 dpi2point mul] 0 setdash } bdef
/DD { [.5 dpi2point mul 4 dpi2point mul 6 dpi2point mul 4
  dpi2point mul] 0 setdash } bdef
% macros for lines and objects
/L {lineto stroke} bdef
/MP {3 1 roll moveto 1 sub {rlineto} repeat} bdef
/AP {{rlineto} repeat} bdef
/PDlw -1 def
/W {/PDlw currentlinewidth def setlinewidth} def
/PP {closepath eofill} bdef
/DP {closepath stroke} bdef
/MR {4 -2 roll moveto dup  0 exch rlineto exch 0 rlineto
  neg 0 exch rlineto closepath} bdef
/FR {MR stroke} bdef
/PR {MR fill} bdef
/L1i {{currentfile picstr readhexstring pop} image} bdef
/tMatrix matrix def
/MakeOval {newpath tMatrix currentmatrix pop translate scale
0 0 1 0 360 arc tMatrix setmatrix} bdef
/FO {MakeOval stroke} bdef
/PO {MakeOval fill} bdef
/PD {currentlinewidth 2 div 0 360 arc fill
   PDlw -1 eq not {PDlw w /PDlw -1 def} if} def
/FA {newpath tMatrix currentmatrix pop translate scale
  0 0 1 5 -2 roll arc tMatrix setmatrix stroke} bdef
/PA {newpath tMatrix currentmatrix pop	translate 0 0 moveto scale
  0 0 1 5 -2 roll arc closepath tMatrix setmatrix fill} bdef
/FAn {newpath tMatrix currentmatrix pop translate scale
  0 0 1 5 -2 roll arcn tMatrix setmatrix stroke} bdef
/PAn {newpath tMatrix currentmatrix pop translate 0 0 moveto scale
  0 0 1 5 -2 roll arcn closepath tMatrix setmatrix fill} bdef
/vradius 0 def /hradius 0 def /lry 0 def
/lrx 0 def /uly 0 def /ulx 0 def /rad 0 def
/MRR {/vradius xdef /hradius xdef /lry xdef /lrx xdef /uly xdef
  /ulx xdef newpath tMatrix currentmatrix pop ulx hradius add uly
  vradius add translate hradius vradius scale 0 0 1 180 270 arc 
  tMatrix setmatrix lrx hradius sub uly vradius add translate
  hradius vradius scale 0 0 1 270 360 arc tMatrix setmatrix
  lrx hradius sub lry vradius sub translate hradius vradius scale
  0 0 1 0 90 arc tMatrix setmatrix ulx hradius add lry vradius sub
  translate hradius vradius scale 0 0 1 90 180 arc tMatrix setmatrix
  closepath} bdef
/FRR {MRR stroke } bdef
/PRR {MRR fill } bdef
/MlrRR {/lry xdef /lrx xdef /uly xdef /ulx xdef /rad lry uly sub 2 div def
  newpath tMatrix currentmatrix pop ulx rad add uly rad add translate
  rad rad scale 0 0 1 90 270 arc tMatrix setmatrix lrx rad sub lry rad
  sub translate rad rad scale 0 0 1 270 90 arc tMatrix setmatrix
  closepath} bdef
/FlrRR {MlrRR stroke } bdef
/PlrRR {MlrRR fill } bdef
/MtbRR {/lry xdef /lrx xdef /uly xdef /ulx xdef /rad lrx ulx sub 2 div def
  newpath tMatrix currentmatrix pop ulx rad add uly rad add translate
  rad rad scale 0 0 1 180 360 arc tMatrix setmatrix lrx rad sub lry rad
  sub translate rad rad scale 0 0 1 0 180 arc tMatrix setmatrix
  closepath} bdef
/FtbRR {MtbRR stroke } bdef
/PtbRR {MtbRR fill } bdef
/stri 6 array def /dtri 6 array def
/smat 6 array def /dmat 6 array def
/tmat1 6 array def /tmat2 6 array def /dif 3 array def
/asub {/ind2 exch def /ind1 exch def dup dup
  ind1 get exch ind2 get sub exch } bdef
/tri_to_matrix {
  2 0 asub 3 1 asub 4 0 asub 5 1 asub
  dup 0 get exch 1 get 7 -1 roll astore } bdef
/compute_transform {
  dmat dtri tri_to_matrix tmat1 invertmatrix 
  smat stri tri_to_matrix tmat2 concatmatrix } bdef
/ds {stri astore pop} bdef
/dt {dtri astore pop} bdef
/db {2 copy /cols xdef /rows xdef mul dup 3 mul string
  currentfile exch readhexstring pop
  dup 0 3 index getinterval /rbmap xdef
  dup 2 index dup getinterval /gbmap xdef
  1 index dup 2 mul exch getinterval /bbmap xdef pop pop}bdef
/it {gs np dtri aload pop moveto lineto lineto cp c
  cols rows 8 compute_transform 
  rbmap gbmap bbmap true 3 colorimage gr}bdef
/il {newpath moveto lineto stroke}bdef
currentdict end def
%%EndProlog

%%BeginSetup
MathWorks begin

0 cap

end
%%EndSetup

%%Page: 1 1
%%BeginPageSetup
%%PageBoundingBox:    19   180   545   591
MathWorks begin
bpage
%%EndPageSetup

%%BeginObject: obj1
bplot

/dpi2point 12 def
portraitMode 0204 7344 csm

   25   247  6320  4937 MR c np
85 dict begin %Colortable dictionary
/c0 { 0.000000 0.000000 0.000000 sr} bdef
/c1 { 1.000000 1.000000 1.000000 sr} bdef
/c2 { 0.900000 0.000000 0.000000 sr} bdef
/c3 { 0.000000 0.820000 0.000000 sr} bdef
/c4 { 0.000000 0.000000 0.800000 sr} bdef
/c5 { 0.910000 0.820000 0.320000 sr} bdef
/c6 { 1.000000 0.260000 0.820000 sr} bdef
/c7 { 0.000000 0.820000 0.820000 sr} bdef
c0
1 j
1 sg
   0    0 6913 5185 PR
6 w
0 4178 5357 0 0 -4178 898 4567 4 MP
PP
-5357 0 0 4178 5357 0 0 -4178 898 4567 5 MP stroke
4 w
DO
SO
6 w
0 sg
 898  389 mt 6255  389 L
 898 4567 mt 6255 4567 L
6255 4567 mt 6255  389 L
 898 4567 mt  898  389 L
 898 4567 mt 6255 4567 L
 898 4567 mt  898  389 L
3576 4567 mt 3576 4540 L
3576  389 mt 3576  415 L
3401 4567 mt 3401 4540 L
3401  389 mt 3401  415 L
3205 4567 mt 3205 4540 L
3205  389 mt 3205  415 L
2983 4567 mt 2983 4540 L
2983  389 mt 2983  415 L
2727 4567 mt 2727 4540 L
2727  389 mt 2727  415 L
2423 4567 mt 2423 4540 L
2423  389 mt 2423  415 L
2052 4567 mt 2052 4540 L
2052  389 mt 2052  415 L
1573 4567 mt 1573 4540 L
1573  389 mt 1573  415 L
 898 4567 mt  898 4540 L
 898  389 mt  898  415 L
3576 4567 mt 3576 4513 L
3576  389 mt 3576  442 L
%%IncludeResource: font Helvetica
/Helvetica /WindowsLatin1Encoding 240 FMSR

3352 4897 mt 
(10) s
%%IncludeResource: font Helvetica
/Helvetica /WindowsLatin1Encoding 160 FMSR

3618 4749 mt 
(-1) s
4730 4567 mt 4730 4540 L
4730  389 mt 4730  415 L
5405 4567 mt 5405 4540 L
5405  389 mt 5405  415 L
5883 4567 mt 5883 4540 L
5883  389 mt 5883  415 L
6255 4567 mt 6255 4540 L
6255  389 mt 6255  415 L
 898 4567 mt  925 4567 L
6255 4567 mt 6228 4567 L
 898 4567 mt  952 4567 L
6255 4567 mt 6201 4567 L
%%IncludeResource: font Helvetica
/Helvetica /WindowsLatin1Encoding 240 FMSR

 510 4656 mt 
(10) s
%%IncludeResource: font Helvetica
/Helvetica /WindowsLatin1Encoding 160 FMSR

 776 4508 mt 
(0) s
 898 4059 mt  925 4059 L
6255 4059 mt 6228 4059 L
 898 3762 mt  925 3762 L
6255 3762 mt 6228 3762 L
 898 3551 mt  925 3551 L
6255 3551 mt 6228 3551 L
 898 3388 mt  925 3388 L
6255 3388 mt 6228 3388 L
 898 3254 mt  925 3254 L
6255 3254 mt 6228 3254 L
 898 3141 mt  925 3141 L
6255 3141 mt 6228 3141 L
 898 3043 mt  925 3043 L
6255 3043 mt 6228 3043 L
 898 2957 mt  925 2957 L
6255 2957 mt 6228 2957 L
 898 2880 mt  925 2880 L
6255 2880 mt 6228 2880 L
 898 2880 mt  952 2880 L
6255 2880 mt 6201 2880 L
%%IncludeResource: font Helvetica
/Helvetica /WindowsLatin1Encoding 240 FMSR

 510 2969 mt 
(10) s
%%IncludeResource: font Helvetica
/Helvetica /WindowsLatin1Encoding 160 FMSR

 776 2821 mt 
(1) s
 898 2372 mt  925 2372 L
6255 2372 mt 6228 2372 L
 898 2075 mt  925 2075 L
6255 2075 mt 6228 2075 L
 898 1864 mt  925 1864 L
6255 1864 mt 6228 1864 L
 898 1701 mt  925 1701 L
6255 1701 mt 6228 1701 L
 898 1567 mt  925 1567 L
6255 1567 mt 6228 1567 L
 898 1454 mt  925 1454 L
6255 1454 mt 6228 1454 L
 898 1357 mt  925 1357 L
6255 1357 mt 6228 1357 L
 898 1270 mt  925 1270 L
6255 1270 mt 6228 1270 L
 898 1193 mt  925 1193 L
6255 1193 mt 6228 1193 L
 898 1193 mt  952 1193 L
6255 1193 mt 6201 1193 L
%%IncludeResource: font Helvetica
/Helvetica /WindowsLatin1Encoding 240 FMSR

 510 1282 mt 
(10) s
%%IncludeResource: font Helvetica
/Helvetica /WindowsLatin1Encoding 160 FMSR

 776 1134 mt 
(2) s
 898  686 mt  925  686 L
6255  686 mt 6228  686 L
 898  389 mt  925  389 L
6255  389 mt 6228  389 L
 898  389 mt 6255  389 L
 898 4567 mt 6255 4567 L
6255 4567 mt 6255  389 L
 898 4567 mt  898  389 L
gs 898 389 5358 4179 MR c np
/c8 { 0.000000 0.000000 1.000000 sr} bdef
c8
494 325 1048 123 2641 565 3 MP stroke
gr

c8
  36   36 2641  565 FO
  36   36 3689  688 FO
  36   36 4183 1013 FO
gs 898 389 5358 4179 MR c np
/c9 { 0.000000 0.500000 0.000000 sr} bdef
c9
-1366 -581 -462 -321 -460 -169 -313 -134 -62 -74 -254 -101 -102 -51 -72 -51 
-136 -34 4284 3262 10 MP stroke
gr

c9
0 j
0 -58 -58 0 0 58 58 0 4255 3233 5 MP
DP
0 -58 -58 0 0 58 58 0 4119 3199 5 MP
DP
0 -58 -58 0 0 58 58 0 4047 3148 5 MP
DP
0 -58 -58 0 0 58 58 0 3945 3097 5 MP
DP
0 -58 -58 0 0 58 58 0 3691 2996 5 MP
DP
0 -58 -58 0 0 58 58 0 3629 2922 5 MP
DP
0 -58 -58 0 0 58 58 0 3316 2788 5 MP
DP
0 -58 -58 0 0 58 58 0 2856 2619 5 MP
DP
0 -58 -58 0 0 58 58 0 2394 2298 5 MP
DP
0 -58 -58 0 0 58 58 0 1028 1717 5 MP
DP
gs 898 389 5358 4179 MR c np
/c10 { 1.000000 0.000000 0.000000 sr} bdef
c10
427 230 464 238 -455 -409 4555 3949 4 MP stroke
gr

c10
4519 3949 mt 4591 3949 L
4555 3913 mt 4555 3985 L
4064 3540 mt 4136 3540 L
4100 3504 mt 4100 3576 L
4528 3778 mt 4600 3778 L
4564 3742 mt 4564 3814 L
4955 4008 mt 5027 4008 L
4991 3972 mt 4991 4044 L
gs 898 389 5358 4179 MR c np
gr

0 sg
%%IncludeResource: font Helvetica
/Helvetica /WindowsLatin1Encoding 240 FMSR

2271 5128 mt 
(Relative error \(log scale\)) s
%%IncludeResource: font Symbol
/Symbol /WindowsLatin1Encoding 240 FMSR

 292 3494 mt  -90 rotate
(\326) s
90 rotate
%%IncludeResource: font Helvetica
/Helvetica /WindowsLatin1Encoding 240 FMSR

 292 3363 mt  -90 rotate
(H2) s
90 rotate
%%IncludeResource: font Helvetica
/Helvetica /WindowsLatin1Encoding 192 FMSR

 412 3057 mt  -90 rotate
(open) s
90 rotate
%%IncludeResource: font Helvetica
/Helvetica /WindowsLatin1Encoding 240 FMSR

 292 2630 mt  -90 rotate
( \(log scale\)) s
90 rotate
%%IncludeResource: font Helvetica
/Helvetica /WindowsLatin1Encoding 120 FMSR

 881 4610 mt 
( ) s
6239  431 mt 
( ) s
1 sg
0 932 1603 0 0 -932 4592 1381 4 MP
PP
-1603 0 0 932 1603 0 0 -932 4592 1381 5 MP stroke
4 w
DO
SO
6 w
0 sg
4592  449 mt 6195  449 L
4592 1381 mt 6195 1381 L
6195 1381 mt 6195  449 L
4592 1381 mt 4592  449 L
4592 1381 mt 6195 1381 L
4592 1381 mt 4592  449 L
4592  449 mt 6195  449 L
4592 1381 mt 6195 1381 L
6195 1381 mt 6195  449 L
4592 1381 mt 4592  449 L
%%IncludeResource: font Helvetica
/Helvetica /WindowsLatin1Encoding 240 FMSR

5040  709 mt 
(\(k,) s
%%IncludeResource: font Symbol
/Symbol /WindowsLatin1Encoding 240 FMSR

5306  709 mt 
(e) s
%%IncludeResource: font Helvetica
/Helvetica /WindowsLatin1Encoding 240 FMSR

5411  709 mt 
(\)-obf) s
gs 4592 449 1604 933 MR c np
c8
345 0 4660 623 2 MP stroke
gs 4760 550 147 147 MR c np
  36   36 4833  623 FO
gr

gr

c8
0 sg
5040 1009 mt 
(MaxVar) s
gs 4592 449 1604 933 MR c np
c9
345 0 4660 923 2 MP stroke
gs 4760 850 147 147 MR c np
0 -58 -58 0 0 58 58 0 4804 894 5 MP
DP
gr

gr

c9
0 sg
5040 1301 mt 
(RandWalk) s
gs 4592 449 1604 933 MR c np
c10
345 0 4660 1215 2 MP stroke
gs 4760 1142 147 147 MR c np
4797 1215 mt 4869 1215 L
4833 1179 mt 4833 1251 L
gr

gr

c10

end %%Color Dict

eplot
%%EndObject

epage
end

showpage

%%Trailer
%%EOF
