%!PS-Adobe-2.0 EPSF-1.2
%%Creator: MATLAB, The MathWorks, Inc. Version 8.1.0.604 (R2013a). Operating System: Microsoft Windows 7.
%%Title: eps\tradeoff-youtube.eps
%%CreationDate: 10/31/2016  10:37:42
%%DocumentNeededFonts: Helvetica
%%DocumentProcessColors: Cyan Magenta Yellow Black
%%Extensions: CMYK
%%Pages: 1
%%BoundingBox:    19   180   557   591
%%EndComments

%%BeginProlog
% MathWorks dictionary
/MathWorks 160 dict begin
% definition operators
/bdef {bind def} bind def
/ldef {load def} bind def
/xdef {exch def} bdef
/xstore {exch store} bdef
% operator abbreviations
/c  /clip ldef
/cc /concat ldef
/cp /closepath ldef
/gr /grestore ldef
/gs /gsave ldef
/mt /moveto ldef
/np /newpath ldef
/cm /currentmatrix ldef
/sm /setmatrix ldef
/rm /rmoveto ldef
/rl /rlineto ldef
/s {show newpath} bdef
/sc {setcmykcolor} bdef
/sr /setrgbcolor ldef
/sg /setgray ldef
/w /setlinewidth ldef
/j /setlinejoin ldef
/cap /setlinecap ldef
/rc {rectclip} bdef
/rf {rectfill} bdef
% page state control
/pgsv () def
/bpage {/pgsv save def} bdef
/epage {pgsv restore} bdef
/bplot /gsave ldef
/eplot {stroke grestore} bdef
% orientation switch
/portraitMode 0 def /landscapeMode 1 def /rotateMode 2 def
% coordinate system mappings
/dpi2point 0 def
% font control
/FontSize 0 def
/FMS {/FontSize xstore findfont [FontSize 0 0 FontSize neg 0 0]
  makefont setfont} bdef
/ISOLatin1Encoding where {pop /WindowsLatin1Encoding 256 array bdef
ISOLatin1Encoding WindowsLatin1Encoding copy pop
/.notdef/.notdef/quotesinglbase/florin/quotedblbase/ellipsis/dagger
/daggerdbl/circumflex/perthousand/Scaron/guilsinglleft/OE/.notdef/.notdef
/.notdef/.notdef/quoteleft/quoteright/quotedblleft/quotedblright/bullet
/endash/emdash/tilde/trademark/scaron/guilsinglright/oe/.notdef/.notdef
/Ydieresis WindowsLatin1Encoding 128 32 getinterval astore pop}
{/WindowsLatin1Encoding StandardEncoding bdef} ifelse
/reencode {exch dup where {pop load} {pop StandardEncoding} ifelse
  exch dup 3 1 roll findfont dup length dict begin
  { 1 index /FID ne {def}{pop pop} ifelse } forall
  /Encoding exch def currentdict end definefont pop} bdef
/isroman {findfont /CharStrings get /Agrave known} bdef
/FMSR {3 1 roll 1 index dup isroman {reencode} {pop pop} ifelse
  exch FMS} bdef
/csm {1 dpi2point div -1 dpi2point div scale neg translate
 dup landscapeMode eq {pop -90 rotate}
  {rotateMode eq {90 rotate} if} ifelse} bdef
% line types: solid, dotted, dashed, dotdash
/SO { [] 0 setdash } bdef
/DO { [.5 dpi2point mul 4 dpi2point mul] 0 setdash } bdef
/DA { [6 dpi2point mul] 0 setdash } bdef
/DD { [.5 dpi2point mul 4 dpi2point mul 6 dpi2point mul 4
  dpi2point mul] 0 setdash } bdef
% macros for lines and objects
/L {lineto stroke} bdef
/MP {3 1 roll moveto 1 sub {rlineto} repeat} bdef
/AP {{rlineto} repeat} bdef
/PDlw -1 def
/W {/PDlw currentlinewidth def setlinewidth} def
/PP {closepath eofill} bdef
/DP {closepath stroke} bdef
/MR {4 -2 roll moveto dup  0 exch rlineto exch 0 rlineto
  neg 0 exch rlineto closepath} bdef
/FR {MR stroke} bdef
/PR {MR fill} bdef
/L1i {{currentfile picstr readhexstring pop} image} bdef
/tMatrix matrix def
/MakeOval {newpath tMatrix currentmatrix pop translate scale
0 0 1 0 360 arc tMatrix setmatrix} bdef
/FO {MakeOval stroke} bdef
/PO {MakeOval fill} bdef
/PD {currentlinewidth 2 div 0 360 arc fill
   PDlw -1 eq not {PDlw w /PDlw -1 def} if} def
/FA {newpath tMatrix currentmatrix pop translate scale
  0 0 1 5 -2 roll arc tMatrix setmatrix stroke} bdef
/PA {newpath tMatrix currentmatrix pop	translate 0 0 moveto scale
  0 0 1 5 -2 roll arc closepath tMatrix setmatrix fill} bdef
/FAn {newpath tMatrix currentmatrix pop translate scale
  0 0 1 5 -2 roll arcn tMatrix setmatrix stroke} bdef
/PAn {newpath tMatrix currentmatrix pop translate 0 0 moveto scale
  0 0 1 5 -2 roll arcn closepath tMatrix setmatrix fill} bdef
/vradius 0 def /hradius 0 def /lry 0 def
/lrx 0 def /uly 0 def /ulx 0 def /rad 0 def
/MRR {/vradius xdef /hradius xdef /lry xdef /lrx xdef /uly xdef
  /ulx xdef newpath tMatrix currentmatrix pop ulx hradius add uly
  vradius add translate hradius vradius scale 0 0 1 180 270 arc 
  tMatrix setmatrix lrx hradius sub uly vradius add translate
  hradius vradius scale 0 0 1 270 360 arc tMatrix setmatrix
  lrx hradius sub lry vradius sub translate hradius vradius scale
  0 0 1 0 90 arc tMatrix setmatrix ulx hradius add lry vradius sub
  translate hradius vradius scale 0 0 1 90 180 arc tMatrix setmatrix
  closepath} bdef
/FRR {MRR stroke } bdef
/PRR {MRR fill } bdef
/MlrRR {/lry xdef /lrx xdef /uly xdef /ulx xdef /rad lry uly sub 2 div def
  newpath tMatrix currentmatrix pop ulx rad add uly rad add translate
  rad rad scale 0 0 1 90 270 arc tMatrix setmatrix lrx rad sub lry rad
  sub translate rad rad scale 0 0 1 270 90 arc tMatrix setmatrix
  closepath} bdef
/FlrRR {MlrRR stroke } bdef
/PlrRR {MlrRR fill } bdef
/MtbRR {/lry xdef /lrx xdef /uly xdef /ulx xdef /rad lrx ulx sub 2 div def
  newpath tMatrix currentmatrix pop ulx rad add uly rad add translate
  rad rad scale 0 0 1 180 360 arc tMatrix setmatrix lrx rad sub lry rad
  sub translate rad rad scale 0 0 1 0 180 arc tMatrix setmatrix
  closepath} bdef
/FtbRR {MtbRR stroke } bdef
/PtbRR {MtbRR fill } bdef
/stri 6 array def /dtri 6 array def
/smat 6 array def /dmat 6 array def
/tmat1 6 array def /tmat2 6 array def /dif 3 array def
/asub {/ind2 exch def /ind1 exch def dup dup
  ind1 get exch ind2 get sub exch } bdef
/tri_to_matrix {
  2 0 asub 3 1 asub 4 0 asub 5 1 asub
  dup 0 get exch 1 get 7 -1 roll astore } bdef
/compute_transform {
  dmat dtri tri_to_matrix tmat1 invertmatrix 
  smat stri tri_to_matrix tmat2 concatmatrix } bdef
/ds {stri astore pop} bdef
/dt {dtri astore pop} bdef
/db {2 copy /cols xdef /rows xdef mul dup 3 mul string
  currentfile exch readhexstring pop
  dup 0 3 index getinterval /rbmap xdef
  dup 2 index dup getinterval /gbmap xdef
  1 index dup 2 mul exch getinterval /bbmap xdef pop pop}bdef
/it {gs np dtri aload pop moveto lineto lineto cp c
  cols rows 8 compute_transform 
  rbmap gbmap bbmap true 3 colorimage gr}bdef
/il {newpath moveto lineto stroke}bdef
currentdict end def
%%EndProlog

%%BeginSetup
MathWorks begin

0 cap

end
%%EndSetup

%%Page: 1 1
%%BeginPageSetup
%%PageBoundingBox:    19   180   557   591
MathWorks begin
bpage
%%EndPageSetup

%%BeginObject: obj1
bplot

/dpi2point 12 def
portraitMode 0204 7344 csm

   25   247  6456  4937 MR c np
85 dict begin %Colortable dictionary
/c0 { 0.000000 0.000000 0.000000 sr} bdef
/c1 { 1.000000 1.000000 1.000000 sr} bdef
/c2 { 0.900000 0.000000 0.000000 sr} bdef
/c3 { 0.000000 0.820000 0.000000 sr} bdef
/c4 { 0.000000 0.000000 0.800000 sr} bdef
/c5 { 0.910000 0.820000 0.320000 sr} bdef
/c6 { 1.000000 0.260000 0.820000 sr} bdef
/c7 { 0.000000 0.820000 0.820000 sr} bdef
c0
1 j
1 sg
   0    0 6913 5185 PR
6 w
0 4178 5356 0 0 -4178 899 4567 4 MP
PP
-5356 0 0 4178 5356 0 0 -4178 899 4567 5 MP stroke
4 w
DO
SO
6 w
0 sg
 899  389 mt 6255  389 L
 899 4567 mt 6255 4567 L
6255 4567 mt 6255  389 L
 899 4567 mt  899  389 L
 899 4567 mt 6255 4567 L
 899 4567 mt  899  389 L
3102 4567 mt 3102 4540 L
3102  389 mt 3102  415 L
2958 4567 mt 2958 4540 L
2958  389 mt 2958  415 L
2796 4567 mt 2796 4540 L
2796  389 mt 2796  415 L
2614 4567 mt 2614 4540 L
2614  389 mt 2614  415 L
2403 4567 mt 2403 4540 L
2403  389 mt 2403  415 L
2153 4567 mt 2153 4540 L
2153  389 mt 2153  415 L
1847 4567 mt 1847 4540 L
1847  389 mt 1847  415 L
1454 4567 mt 1454 4540 L
1454  389 mt 1454  415 L
3102 4567 mt 3102 4513 L
3102  389 mt 3102  442 L
%%IncludeResource: font Helvetica
/Helvetica /WindowsLatin1Encoding 240 FMSR

2878 4897 mt 
(10) s
%%IncludeResource: font Helvetica
/Helvetica /WindowsLatin1Encoding 160 FMSR

3144 4749 mt 
(-1) s
4051 4567 mt 4051 4540 L
4051  389 mt 4051  415 L
4606 4567 mt 4606 4540 L
4606  389 mt 4606  415 L
5000 4567 mt 5000 4540 L
5000  389 mt 5000  415 L
5306 4567 mt 5306 4540 L
5306  389 mt 5306  415 L
5555 4567 mt 5555 4540 L
5555  389 mt 5555  415 L
5766 4567 mt 5766 4540 L
5766  389 mt 5766  415 L
5949 4567 mt 5949 4540 L
5949  389 mt 5949  415 L
6110 4567 mt 6110 4540 L
6110  389 mt 6110  415 L
6255 4567 mt 6255 4540 L
6255  389 mt 6255  415 L
6255 4567 mt 6255 4513 L
6255  389 mt 6255  442 L
%%IncludeResource: font Helvetica
/Helvetica /WindowsLatin1Encoding 240 FMSR

6078 4897 mt 
(10) s
%%IncludeResource: font Helvetica
/Helvetica /WindowsLatin1Encoding 160 FMSR

6344 4749 mt 
(0) s
 899 4567 mt  925 4567 L
6255 4567 mt 6228 4567 L
 899 4567 mt  952 4567 L
6255 4567 mt 6201 4567 L
%%IncludeResource: font Helvetica
/Helvetica /WindowsLatin1Encoding 240 FMSR

 510 4656 mt 
(10) s
%%IncludeResource: font Helvetica
/Helvetica /WindowsLatin1Encoding 160 FMSR

 776 4508 mt 
(0) s
 899 4059 mt  925 4059 L
6255 4059 mt 6228 4059 L
 899 3762 mt  925 3762 L
6255 3762 mt 6228 3762 L
 899 3551 mt  925 3551 L
6255 3551 mt 6228 3551 L
 899 3388 mt  925 3388 L
6255 3388 mt 6228 3388 L
 899 3254 mt  925 3254 L
6255 3254 mt 6228 3254 L
 899 3141 mt  925 3141 L
6255 3141 mt 6228 3141 L
 899 3043 mt  925 3043 L
6255 3043 mt 6228 3043 L
 899 2957 mt  925 2957 L
6255 2957 mt 6228 2957 L
 899 2880 mt  925 2880 L
6255 2880 mt 6228 2880 L
 899 2880 mt  952 2880 L
6255 2880 mt 6201 2880 L
%%IncludeResource: font Helvetica
/Helvetica /WindowsLatin1Encoding 240 FMSR

 510 2969 mt 
(10) s
%%IncludeResource: font Helvetica
/Helvetica /WindowsLatin1Encoding 160 FMSR

 776 2821 mt 
(1) s
 899 2372 mt  925 2372 L
6255 2372 mt 6228 2372 L
 899 2075 mt  925 2075 L
6255 2075 mt 6228 2075 L
 899 1864 mt  925 1864 L
6255 1864 mt 6228 1864 L
 899 1701 mt  925 1701 L
6255 1701 mt 6228 1701 L
 899 1567 mt  925 1567 L
6255 1567 mt 6228 1567 L
 899 1454 mt  925 1454 L
6255 1454 mt 6228 1454 L
 899 1357 mt  925 1357 L
6255 1357 mt 6228 1357 L
 899 1270 mt  925 1270 L
6255 1270 mt 6228 1270 L
 899 1193 mt  925 1193 L
6255 1193 mt 6228 1193 L
 899 1193 mt  952 1193 L
6255 1193 mt 6201 1193 L
%%IncludeResource: font Helvetica
/Helvetica /WindowsLatin1Encoding 240 FMSR

 510 1282 mt 
(10) s
%%IncludeResource: font Helvetica
/Helvetica /WindowsLatin1Encoding 160 FMSR

 776 1134 mt 
(2) s
 899  686 mt  925  686 L
6255  686 mt 6228  686 L
 899  389 mt  925  389 L
6255  389 mt 6228  389 L
 899  389 mt 6255  389 L
 899 4567 mt 6255 4567 L
6255 4567 mt 6255  389 L
 899 4567 mt  899  389 L
gs 899 389 5357 4179 MR c np
/c8 { 0.000000 0.000000 1.000000 sr} bdef
c8
1798 494 918 181 1029 717 3 MP stroke
gr

c8
  36   36 1029  717 FO
  36   36 1947  898 FO
  36   36 3745 1392 FO
gs 899 389 5357 4179 MR c np
/c9 { 0.000000 0.500000 0.000000 sr} bdef
c9
-460 -416 -211 -204 -183 -114 -140 -55 -43 -68 -161 -44 -92 -28 -18 -23 
-68 -35 2830 2479 10 MP stroke
gr

c9
0 j
0 -58 -58 0 0 58 58 0 2801 2450 5 MP
DP
0 -58 -58 0 0 58 58 0 2733 2415 5 MP
DP
0 -58 -58 0 0 58 58 0 2715 2392 5 MP
DP
0 -58 -58 0 0 58 58 0 2623 2364 5 MP
DP
0 -58 -58 0 0 58 58 0 2462 2320 5 MP
DP
0 -58 -58 0 0 58 58 0 2419 2252 5 MP
DP
0 -58 -58 0 0 58 58 0 2279 2197 5 MP
DP
0 -58 -58 0 0 58 58 0 2096 2083 5 MP
DP
0 -58 -58 0 0 58 58 0 1885 1879 5 MP
DP
0 -58 -58 0 0 58 58 0 1425 1463 5 MP
DP
gs 899 389 5357 4179 MR c np
/c10 { 1.000000 0.000000 0.000000 sr} bdef
c10
259 564 210 271 -1868 -902 5010 4418 4 MP stroke
gr

c10
4974 4418 mt 5046 4418 L
5010 4382 mt 5010 4454 L
3106 3516 mt 3178 3516 L
3142 3480 mt 3142 3552 L
3316 3787 mt 3388 3787 L
3352 3751 mt 3352 3823 L
3575 4351 mt 3647 4351 L
3611 4315 mt 3611 4387 L
gs 899 389 5357 4179 MR c np
gr

0 sg
%%IncludeResource: font Helvetica
/Helvetica /WindowsLatin1Encoding 240 FMSR

2272 5128 mt 
(Relative error \(log scale\)) s
%%IncludeResource: font Symbol
/Symbol /WindowsLatin1Encoding 240 FMSR

 292 3494 mt  -90 rotate
(\326) s
90 rotate
%%IncludeResource: font Helvetica
/Helvetica /WindowsLatin1Encoding 240 FMSR

 292 3363 mt  -90 rotate
(H2) s
90 rotate
%%IncludeResource: font Helvetica
/Helvetica /WindowsLatin1Encoding 192 FMSR

 412 3057 mt  -90 rotate
(open) s
90 rotate
%%IncludeResource: font Helvetica
/Helvetica /WindowsLatin1Encoding 240 FMSR

 292 2630 mt  -90 rotate
( \(log scale\)) s
90 rotate
%%IncludeResource: font Helvetica
/Helvetica /WindowsLatin1Encoding 120 FMSR

 882 4610 mt 
( ) s
6239  431 mt 
( ) s
1 sg
0 932 1603 0 0 -932 4592 1381 4 MP
PP
-1603 0 0 932 1603 0 0 -932 4592 1381 5 MP stroke
4 w
DO
SO
6 w
0 sg
4592  449 mt 6195  449 L
4592 1381 mt 6195 1381 L
6195 1381 mt 6195  449 L
4592 1381 mt 4592  449 L
4592 1381 mt 6195 1381 L
4592 1381 mt 4592  449 L
4592  449 mt 6195  449 L
4592 1381 mt 6195 1381 L
6195 1381 mt 6195  449 L
4592 1381 mt 4592  449 L
%%IncludeResource: font Helvetica
/Helvetica /WindowsLatin1Encoding 240 FMSR

5040  709 mt 
(\(k,) s
%%IncludeResource: font Symbol
/Symbol /WindowsLatin1Encoding 240 FMSR

5306  709 mt 
(e) s
%%IncludeResource: font Helvetica
/Helvetica /WindowsLatin1Encoding 240 FMSR

5411  709 mt 
(\)-obf) s
gs 4592 449 1604 933 MR c np
c8
345 0 4660 623 2 MP stroke
gs 4760 550 147 147 MR c np
  36   36 4833  623 FO
gr

gr

c8
0 sg
5040 1009 mt 
(MaxVar) s
gs 4592 449 1604 933 MR c np
c9
345 0 4660 923 2 MP stroke
gs 4760 850 147 147 MR c np
0 -58 -58 0 0 58 58 0 4804 894 5 MP
DP
gr

gr

c9
0 sg
5040 1301 mt 
(RandWalk) s
gs 4592 449 1604 933 MR c np
c10
345 0 4660 1215 2 MP stroke
gs 4760 1142 147 147 MR c np
4797 1215 mt 4869 1215 L
4833 1179 mt 4833 1251 L
gr

gr

c10

end %%Color Dict

eplot
%%EndObject

epage
end

showpage

%%Trailer
%%EOF
