@relation vote-converted
@attribute A0 {'0','1','2'}
@attribute A1 {'0','1','2'}
@attribute A2 {'0','1','2'}
@attribute A3 {'0','1','2'}
@attribute A4 {'0','1','2'}
@attribute A5 {'0','1','2'}
@attribute A6 {'0','1','2'}
@attribute A7 {'0','1','2'}
@attribute A8 {'0','1','2'}
@attribute A9 {'0','1','2'}
@attribute A10 {'0','1','2'}
@attribute A11 {'0','1','2'}
@attribute A12 {'0','1','2'}
@attribute A13 {'0','1','2'}
@attribute A14 {'0','1','2'}
@attribute A15 {'0','1','2'}
@attribute Class {'0','1'}
@data
'1','2','1','2','2','2','1','1','1','2','0','2','2','2','1','2','0'
'1','2','1','2','2','2','1','1','1','1','1','2','2','2','1','0','0'
'0','2','2','0','2','2','1','1','1','1','2','1','2','2','1','1','1'
'1','2','2','1','0','2','1','1','1','1','2','1','2','1','1','2','1'
'2','2','2','1','2','2','1','1','1','1','2','0','2','2','2','2','1'
'1','2','2','1','2','2','1','1','1','1','1','1','2','2','2','2','1'
'1','2','1','2','2','2','1','1','1','1','1','1','0','2','2','2','1'
'1','2','1','2','2','2','1','1','1','1','1','1','2','2','0','2','0'
'1','2','1','2','2','2','1','1','1','1','1','2','2','2','1','2','0'
'2','2','2','1','1','1','2','2','2','1','1','1','1','1','0','0','1'
'1','2','1','2','2','1','1','1','1','1','0','0','2','2','1','1','0'
'1','2','1','2','2','2','1','1','1','1','2','0','2','2','0','0','0'
'1','2','2','1','1','1','2','2','2','1','1','1','2','1','0','0','1'
'2','2','2','1','1','2','2','2','0','2','2','0','1','1','2','0','1'
'1','2','1','2','2','2','1','1','1','1','1','2','0','0','1','0','0'
'1','2','1','2','2','2','1','1','1','2','1','2','2','0','1','0','0'
'2','1','2','1','1','2','1','2','0','2','2','2','0','1','1','2','1'
'2','0','2','1','1','1','2','2','2','1','1','1','2','1','2','2','1'
'1','2','1','2','2','2','1','1','1','1','1','0','2','2','1','1','0'
'2','2','2','1','1','1','2','2','2','1','2','1','1','1','2','2','1'
'2','2','2','1','1','0','2','2','1','1','2','1','1','1','2','2','1'
'2','2','2','1','1','1','2','2','2','1','1','1','0','0','2','2','1'
'2','0','2','1','1','1','2','2','2','1','1','0','1','1','2','2','1'
'2','2','2','1','1','1','2','2','2','1','1','1','1','1','2','2','1'
'2','1','2','1','1','1','2','2','2','1','1','1','1','1','2','0','1'
'2','1','2','1','1','1','2','2','2','2','1','1','1','1','2','2','1'
'2','1','2','1','1','1','2','2','2','1','2','1','1','1','2','2','1'
'2','2','2','1','1','1','2','2','2','1','2','1','1','1','2','2','1'
'2','1','1','2','2','1','2','2','2','1','1','2','2','2','1','2','0'
'2','2','2','1','1','1','2','2','2','1','2','1','1','1','2','2','1'
'1','2','1','2','2','2','1','1','1','1','1','2','2','2','1','1','0'
'2','2','2','1','1','1','2','2','2','1','2','1','1','1','2','0','1'
'2','2','2','1','1','1','2','2','2','2','1','1','2','1','2','2','1'
'1','2','1','2','2','2','1','1','1','1','1','2','2','2','1','2','0'
'2','2','2','1','1','1','2','2','2','1','1','1','1','1','2','2','1'
'1','2','1','2','2','2','1','1','1','1','1','2','2','2','1','1','0'
'2','0','1','2','2','2','1','1','1','2','1','2','0','2','1','2','0'
'2','2','1','2','2','2','1','1','1','1','1','1','2','2','1','2','0'
'1','2','1','2','2','2','1','1','1','2','1','2','2','2','1','1','0'
'2','1','2','1','1','1','2','2','2','2','2','1','2','1','2','2','1'
'2','2','2','1','1','1','2','2','2','1','0','1','1','1','1','0','1'
'2','2','2','1','1','1','2','2','2','1','1','1','1','1','2','0','1'
'2','1','2','1','1','1','2','2','2','1','1','1','1','1','1','2','1'
'2','1','2','1','1','1','2','2','2','1','1','1','1','1','2','2','1'
'2','2','2','1','1','1','2','2','2','1','2','1','1','1','1','0','1'
'2','2','2','1','1','1','2','2','0','1','2','1','1','1','2','0','1'
'2','2','2','1','1','1','2','2','2','1','1','1','1','1','1','2','1'
'2','1','2','1','1','1','2','2','0','1','1','1','1','1','1','0','1'
'2','2','2','1','1','1','2','2','1','1','1','1','1','2','1','2','1'
'1','0','1','2','2','2','1','1','1','1','1','2','2','2','1','1','0'
'2','2','2','1','1','1','2','2','2','1','2','1','1','1','2','2','1'
'1','2','1','2','2','2','1','0','1','1','1','2','2','2','1','2','0'
'2','2','2','1','1','1','2','2','2','1','1','1','1','1','0','0','1'
'2','2','1','2','2','2','1','1','1','2','1','2','2','2','1','1','0'
'2','2','2','1','1','2','0','2','1','1','2','2','1','2','1','0','1'
'1','2','1','2','2','2','1','1','1','2','2','2','2','2','1','1','0'
'1','2','1','2','2','2','1','1','1','2','2','2','2','2','1','2','0'
'1','2','1','2','2','2','1','1','1','2','1','2','2','2','1','2','0'
'1','2','1','2','2','2','1','1','1','2','1','2','2','2','1','2','0'
'1','2','1','2','2','2','1','1','1','2','1','2','2','2','1','0','0'
'2','2','2','1','1','0','2','2','2','2','1','1','1','1','2','0','1'
'1','2','1','2','2','2','1','1','1','1','1','2','2','2','1','1','0'
'2','2','2','1','1','1','2','2','2','1','1','1','1','1','1','0','1'
'2','2','2','1','1','1','2','2','2','1','2','1','1','1','1','2','1'
'2','2','2','1','1','1','2','2','2','1','2','0','1','1','1','2','1'
'2','2','1','2','2','2','2','1','1','1','1','2','2','2','1','2','0'
'1','2','1','2','2','2','2','1','1','1','2','2','2','2','1','2','0'
'1','2','1','2','2','2','1','1','1','2','1','2','2','2','1','1','0'
'2','0','2','1','1','1','2','2','2','1','1','1','2','1','2','2','1'
'2','2','2','1','1','1','2','2','2','1','1','1','1','1','2','2','1'
'2','1','2','1','1','1','2','2','2','1','1','1','2','1','2','0','1'
'2','2','2','2','1','1','2','2','2','2','2','1','1','2','1','2','0'
'2','2','2','1','1','1','2','2','2','1','2','1','1','1','2','0','1'
'2','1','2','2','2','1','2','1','2','2','1','1','2','2','1','2','0'
'2','1','2','1','1','2','2','2','2','2','2','1','1','2','2','2','1'
'1','2','2','2','2','2','1','1','1','2','2','1','2','2','1','1','1'
'1','2','2','1','2','2','1','1','1','2','2','2','2','2','1','0','1'
'1','2','2','2','2','2','1','2','2','2','2','2','2','2','1','2','1'
'2','2','2','1','2','2','1','1','1','2','2','1','2','2','1','2','1'
'1','1','1','2','2','1','1','1','1','2','1','2','2','2','1','1','0'
'2','1','2','1','1','2','2','2','2','2','1','2','1','2','1','0','1'
'2','1','2','1','1','1','2','2','0','2','2','2','1','2','1','2','1'
'1','1','1','2','2','2','1','1','1','2','1','2','2','2','1','2','0'
'1','1','1','2','2','2','1','1','1','1','1','2','2','2','1','1','0'
'1','0','1','2','2','2','1','1','1','2','1','2','2','2','1','1','0'
'1','1','2','1','2','2','1','1','1','2','2','2','2','2','1','2','1'
'1','1','1','2','2','2','1','1','1','2','1','2','2','2','1','1','0'
'1','1','1','2','2','2','1','1','1','1','1','2','2','2','1','1','0'
'1','2','2','1','2','2','2','1','2','2','2','1','2','2','1','2','1'
'1','1','1','2','2','2','1','1','1','2','1','0','2','2','1','0','0'
'2','1','2','1','1','1','2','2','2','2','1','1','1','1','2','2','1'
'2','1','2','1','1','1','2','2','2','2','2','1','1','1','2','2','1'
'2','2','2','1','1','1','2','2','1','2','2','1','1','0','2','2','1'
'2','1','2','1','1','1','2','1','2','2','2','1','1','1','2','2','1'
'2','1','2','1','2','2','1','1','1','1','1','1','1','1','1','2','1'
'2','1','2','1','2','2','1','0','0','1','2','0','0','0','2','2','1'
'1','1','0','1','2','2','1','1','1','1','2','2','2','2','1','2','1'
'2','1','1','1','2','2','2','1','1','2','2','1','1','2','1','2','1'
'2','2','2','1','1','2','2','2','2','2','1','1','1','1','1','2','1'
'1','1','1','2','2','2','1','1','1','2','0','2','2','2','1','1','0'
'2','1','1','1','2','2','1','1','1','1','2','2','1','2','1','2','1'
'2','1','2','1','2','2','2','1','1','1','2','1','1','2','1','2','1'
'2','1','2','1','2','2','2','1','0','1','2','1','2','2','2','0','1'
'2','1','1','1','2','2','0','1','0','1','1','1','1','2','0','1','1'
'0','0','0','0','1','2','2','2','2','2','0','1','2','2','1','0','1'
'2','2','2','1','1','1','1','2','2','1','2','1','1','1','2','2','1'
'1','2','1','2','2','2','1','1','1','1','1','2','2','2','1','2','0'
'1','0','0','0','0','0','0','0','0','0','0','0','0','2','0','0','0'
'2','0','2','1','1','1','2','2','2','1','1','1','1','1','2','0','1'
'2','0','2','1','1','1','2','2','2','1','1','1','1','1','2','0','1'
'1','1','2','1','1','1','2','2','2','2','1','1','1','1','2','2','1'
'1','0','1','2','2','2','1','1','1','2','1','2','2','2','1','2','0'
'1','0','2','1','1','2','2','2','1','2','1','1','1','1','2','0','1'
'1','0','1','2','2','2','1','1','1','2','1','2','2','2','1','1','0'
'2','0','2','1','1','1','2','2','2','1','1','1','1','1','2','0','1'
'1','0','2','1','0','0','2','2','2','2','0','0','1','1','2','2','1'
'2','1','2','1','1','1','2','2','2','1','2','1','1','1','2','2','1'
'2','2','2','2','2','1','2','1','1','1','1','2','2','2','1','2','0'
'1','2','2','1','1','1','1','2','2','2','2','1','1','1','2','2','1'
'1','1','1','2','2','2','1','1','1','1','1','2','2','2','1','1','0'
'1','0','0','2','2','2','1','1','1','2','1','2','2','2','0','2','0'
'1','0','1','2','2','2','1','1','1','2','1','2','2','2','1','2','0'
'1','1','1','2','2','2','1','1','1','2','1','2','1','2','1','2','0'
'2','0','1','2','2','2','1','2','1','1','1','2','2','2','1','2','0'
'1','0','2','1','1','1','2','2','2','1','1','1','1','1','2','2','1'
'1','0','1','2','2','2','1','1','1','2','1','2','2','2','1','2','0'
'1','0','1','2','2','2','1','1','1','1','1','2','2','2','1','1','0'
'1','0','2','1','1','1','2','2','2','2','2','1','1','2','2','2','1'
'1','0','2','1','1','2','1','2','1','2','2','1','1','1','2','2','1'
'0','0','2','1','1','1','2','2','0','1','0','0','0','0','0','0','1'
'2','0','2','1','0','0','2','2','2','1','1','1','1','1','2','0','1'
'1','1','2','1','1','2','1','2','2','2','1','1','1','2','1','2','1'
'1','1','1','2','2','2','1','1','1','2','1','2','2','2','1','0','0'
'1','1','1','2','2','2','1','1','1','2','1','2','2','2','1','2','0'
'1','1','1','2','2','2','1','1','1','1','1','2','2','2','1','0','0'
'1','1','1','2','2','2','1','1','1','2','1','2','2','2','1','1','0'
'1','2','1','2','2','2','1','1','1','2','2','2','2','1','1','2','0'
'1','0','2','1','1','2','2','2','2','2','1','1','1','2','2','2','1'
'1','1','2','1','1','2','2','2','2','2','1','1','1','2','1','2','1'
'2','1','2','1','1','2','2','2','2','1','1','1','1','1','2','2','1'
'1','1','1','2','1','1','2','2','2','2','1','1','2','2','1','2','0'
'1','1','1','2','2','2','2','2','2','2','1','2','2','2','0','2','0'
'1','1','1','2','2','2','2','2','2','2','1','2','2','2','1','2','0'
'0','2','1','1','1','1','2','2','2','2','2','1','1','2','2','2','1'
'1','0','1','1','1','2','2','2','2','2','1','1','1','2','1','0','1'
'1','1','2','1','1','2','2','2','2','2','1','1','1','2','0','2','1'
'1','2','1','2','2','2','1','1','1','1','1','2','2','2','1','2','0'
'1','1','1','1','1','1','2','2','2','2','1','2','2','2','2','2','1'
'1','2','1','2','2','2','1','1','1','2','2','2','2','2','1','2','0'
'1','1','2','1','1','1','2','2','2','2','1','1','2','1','2','2','1'
'2','2','1','2','2','2','1','1','1','2','1','2','2','2','1','2','0'
'2','2','0','2','2','2','1','1','2','1','2','0','2','2','1','1','1'
'1','2','2','1','1','2','1','2','2','2','2','1','2','1','2','2','1'
'1','1','2','1','1','2','2','2','2','2','2','1','2','2','1','2','1'
'1','2','1','2','2','2','1','1','1','1','1','2','2','2','1','1','0'
'2','2','1','2','2','2','1','0','1','1','2','2','2','2','1','1','0'
'2','2','1','2','2','2','2','1','1','1','1','2','2','2','1','1','0'
'1','2','2','1','1','2','1','2','2','1','2','1','0','0','0','0','1'
'1','2','1','2','2','2','1','1','1','2','1','2','2','2','1','1','0'
'1','2','2','1','0','2','2','2','2','2','2','1','1','0','1','0','1'
'1','2','1','1','2','2','1','1','1','1','1','2','2','2','2','2','1'
'1','1','1','1','2','2','2','1','1','1','1','2','2','2','1','2','1'
'1','2','2','1','2','2','2','1','1','1','2','2','2','2','1','2','1'
'1','2','1','2','2','2','2','1','1','1','1','2','2','2','1','2','0'
'2','2','1','1','2','2','1','1','1','2','2','2','2','2','1','0','1'
'1','2','2','1','1','2','2','2','2','2','2','1','2','1','2','0','1'
'2','1','2','2','2','2','2','2','1','2','1','2','1','2','2','2','0'
'2','1','2','2','2','2','2','2','1','2','2','2','1','2','2','2','0'
'1','1','2','2','2','2','1','1','2','1','1','1','2','2','2','0','1'
'2','1','2','1','1','1','2','2','2','2','2','1','1','2','1','2','1'
'2','1','2','1','1','1','0','2','2','0','1','1','1','1','2','0','1'
'1','0','1','2','2','2','1','1','1','2','1','2','2','2','1','2','0'
'1','2','2','1','1','1','2','2','2','2','1','1','0','1','2','2','1'
'1','1','1','1','2','2','1','1','1','2','2','2','2','2','1','2','1'
'2','0','2','1','1','1','2','2','2','1','1','1','1','1','2','0','1'
'1','2','2','1','1','1','2','2','2','2','1','1','1','1','2','2','1'
'1','1','2','2','1','1','2','2','2','2','1','1','1','2','2','2','0'
'1','1','2','1','1','1','2','2','2','2','2','0','1','1','2','2','1'
'0','1','2','1','1','1','2','2','2','2','2','0','1','1','2','0','1'
'2','1','2','1','1','1','2','2','2','2','1','1','1','1','2','2','1'
'0','0','2','1','1','1','2','2','2','0','0','1','1','1','0','0','1'
'1','1','2','1','1','1','2','2','2','2','2','1','1','1','2','2','1'
'2','0','2','1','1','1','2','2','2','1','1','1','1','1','2','2','1'
'0','0','0','0','0','0','0','0','2','0','0','0','0','0','0','0','1'
'1','1','2','1','1','1','2','2','2','2','2','1','1','1','2','2','1'
'2','1','2','1','1','1','2','2','2','2','1','0','1','1','2','2','1'
'1','2','2','1','1','1','2','2','2','2','2','1','1','1','2','2','1'
'2','1','2','1','1','1','2','2','2','1','1','1','1','1','2','0','1'
'2','0','1','2','2','2','2','2','1','1','1','2','0','2','0','0','0'
'2','1','2','1','1','1','2','2','2','1','1','1','1','1','2','2','1'
'1','0','1','2','2','2','1','1','1','1','1','2','2','2','1','0','0'
'1','2','1','2','2','2','1','0','1','2','1','2','2','2','1','0','0'
'1','1','1','1','1','2','2','2','2','1','2','1','1','2','2','2','1'
'1','1','2','1','1','1','2','2','2','1','1','1','1','1','2','2','1'
'1','1','2','1','1','2','2','0','2','2','2','1','1','1','2','2','1'
'1','1','1','2','2','2','1','1','1','1','1','2','2','2','1','0','0'
'1','1','2','1','1','2','2','2','2','1','2','2','1','2','2','0','1'
'1','0','2','2','2','2','1','1','1','2','1','1','1','2','1','2','0'
'1','1','2','1','1','1','2','2','2','2','2','1','0','1','2','0','1'
'2','2','1','1','1','1','2','2','0','1','2','1','1','1','2','0','1'
'1','1','2','1','1','1','2','2','2','1','1','1','1','2','2','2','1'
'2','2','2','1','1','1','2','2','2','1','1','1','1','1','2','2','1'
'2','1','2','1','1','2','2','2','2','2','2','1','1','1','2','2','1'
'2','1','2','1','1','1','2','2','2','2','1','1','1','1','2','2','1'
'1','1','2','2','2','2','2','1','1','1','1','2','2','2','1','2','0'
'1','1','2','1','1','2','2','2','2','2','1','2','1','1','1','2','1'
'1','1','1','2','2','2','1','1','1','2','1','2','1','2','1','2','0'
'2','0','1','2','2','2','2','1','1','2','1','2','2','2','1','2','0'
'1','1','2','1','1','1','2','2','2','1','1','0','1','1','2','2','1'
'2','2','2','1','1','1','2','2','2','2','2','1','1','1','1','2','1'
'1','1','2','1','1','2','2','2','2','1','1','1','1','1','2','2','1'
'1','2','1','2','2','2','1','1','1','2','1','2','2','2','1','2','0'
'1','1','2','1','1','1','2','2','2','1','2','1','1','1','2','2','1'
'1','2','2','1','1','2','1','2','2','1','2','1','2','1','2','2','1'
'2','2','1','2','2','2','1','1','1','2','1','2','2','2','1','2','0'
'1','2','2','2','2','2','1','1','1','2','2','2','2','2','2','0','1'
'2','2','2','1','2','2','1','1','0','2','1','1','1','2','2','0','1'
'1','2','1','2','2','2','1','1','1','2','1','2','2','2','1','1','0'
'2','0','2','1','1','1','2','2','2','1','0','1','1','1','2','0','1'
'1','2','2','1','1','1','1','2','2','1','2','1','1','2','2','2','1'
'1','1','2','1','1','1','2','2','2','1','1','1','1','1','2','0','1'
'1','2','2','1','2','2','1','1','1','1','2','1','1','1','2','0','1'
'2','1','2','1','1','1','2','2','2','1','2','1','1','1','2','0','1'
'1','1','1','2','2','1','1','1','1','1','1','2','2','2','1','2','0'
'1','2','1','2','2','2','1','1','1','2','1','0','2','2','1','1','0'
'1','0','1','2','2','2','1','1','1','1','1','2','2','2','1','2','0'
'1','1','2','1','1','2','2','2','2','1','2','1','1','2','2','2','1'
'2','1','2','1','1','1','2','2','2','1','1','1','1','1','0','2','1'
'1','2','1','2','2','2','1','1','1','1','1','2','2','0','1','2','0'
'1','2','2','2','2','2','2','1','2','2','1','2','2','2','1','2','0'
'1','2','1','2','2','2','1','1','1','1','1','2','2','2','1','2','0'
'1','2','1','2','2','2','1','1','2','2','1','2','2','2','1','2','0'
'1','2','2','1','1','1','2','2','1','1','2','1','1','1','2','0','1'
'1','2','1','2','2','2','1','1','1','2','1','2','2','2','1','2','0'
'1','1','2','1','1','2','2','2','2','2','1','2','1','2','2','0','1'
'1','1','1','2','2','2','1','1','1','2','1','2','1','2','1','2','0'
'1','1','2','1','1','1','2','2','2','1','1','1','1','1','2','2','1'
'2','1','2','1','1','2','2','2','1','1','1','2','2','1','1','2','1'
'2','2','2','1','1','1','2','2','0','2','1','1','1','1','2','0','1'
'1','1','1','2','2','2','2','1','1','2','1','1','1','2','2','2','0'
'1','1','1','2','1','2','2','0','2','1','1','2','2','2','1','2','0'
'2','1','2','1','1','1','2','2','2','2','2','1','1','2','2','2','1'
'1','1','1','1','2','2','2','1','1','1','1','0','1','2','2','2','0'
'1','2','2','1','1','1','2','2','0','2','1','1','2','1','2','2','1'
'2','1','2','1','1','1','1','2','2','2','1','1','1','1','2','2','1'
'2','1','2','1','1','1','2','2','2','2','2','1','1','1','2','2','1'
'1','1','2','1','2','1','2','2','2','1','1','1','1','2','0','2','1'
'1','2','1','2','2','2','0','1','1','1','1','0','2','2','1','1','0'
'0','0','0','0','0','0','0','0','0','0','0','0','0','0','0','0','0'
'2','1','2','1','1','1','2','2','0','1','2','1','1','1','2','2','1'
'1','2','1','2','2','2','1','1','1','1','1','2','2','2','1','1','0'
'1','2','1','2','2','2','1','1','1','1','1','2','2','2','1','1','0'
'2','2','2','1','1','2','2','2','2','1','1','1','1','1','2','2','1'
'1','2','1','2','2','2','1','1','1','1','1','2','2','2','1','2','0'
'2','1','2','1','1','1','2','2','2','2','1','1','1','1','1','2','1'
'2','1','2','1','1','1','2','2','2','2','1','1','1','2','2','2','1'
'1','1','1','2','2','1','1','1','1','1','1','2','1','2','1','1','0'
'1','1','1','2','2','1','1','1','1','1','1','2','1','2','0','2','0'
'1','1','2','1','1','1','2','2','2','1','2','1','1','1','2','2','1'
'2','1','2','1','1','1','2','2','2','1','1','1','1','1','1','2','1'
'2','1','2','1','1','1','2','2','2','2','1','1','1','1','1','2','1'
'2','1','2','1','1','0','2','2','2','1','0','0','1','0','0','0','1'
'2','1','2','1','1','1','2','2','2','2','1','1','0','1','2','2','1'
'2','1','2','1','1','1','2','2','2','1','1','1','1','1','2','0','1'
'2','1','2','1','1','1','2','2','2','1','1','1','1','1','2','0','1'
'2','1','2','1','1','1','2','2','2','2','1','1','1','1','1','2','1'
'1','1','1','2','2','2','1','1','1','2','1','2','1','2','1','2','0'
'2','1','1','1','1','1','2','2','2','2','1','1','1','2','1','2','0'
'2','1','2','1','1','1','2','2','2','1','1','1','1','1','2','0','1'
'2','1','2','1','1','1','2','2','2','1','1','1','1','1','1','2','1'
'2','2','2','1','1','1','2','2','2','1','1','1','1','1','2','2','1'
'1','2','2','1','1','2','2','2','2','1','0','1','1','1','1','2','1'
'2','1','2','1','1','1','2','2','2','2','1','1','1','1','2','0','1'
'1','1','1','2','2','1','2','2','1','2','1','2','2','2','0','2','0'
'2','1','1','2','2','1','2','1','1','2','1','1','1','2','2','2','0'
'1','1','2','1','2','2','1','1','1','1','0','1','2','2','1','1','1'
'1','1','1','2','2','2','1','1','1','1','1','2','2','2','2','1','0'
'1','1','2','2','2','2','2','2','1','2','1','1','1','2','1','2','0'
'1','1','1','2','2','2','1','1','1','1','1','2','2','2','1','2','0'
'1','1','1','2','2','2','1','1','1','2','1','2','2','2','1','1','0'
'1','1','2','1','1','1','2','2','2','2','1','1','1','2','1','2','1'
'2','1','2','2','2','2','2','2','1','1','1','1','1','2','1','0','0'
'2','1','1','2','2','2','1','1','1','2','1','0','2','2','1','1','0'
'1','1','1','2','2','2','1','1','1','1','1','2','2','2','1','2','0'
'1','1','2','1','1','2','2','2','2','2','2','1','1','1','0','2','1'
'1','1','2','1','1','2','2','2','2','2','2','1','1','1','2','2','1'
'1','1','2','1','1','2','0','2','0','2','2','2','1','2','2','0','1'
'2','2','2','0','1','2','2','2','2','1','2','1','2','1','0','2','1'
'2','2','2','1','2','2','1','2','1','2','2','1','2','2','2','2','1'
'2','2','2','1','2','2','1','2','1','2','2','1','2','2','1','0','1'
'2','1','2','1','0','2','0','2','2','2','1','1','2','2','1','2','1'
'2','1','2','1','1','2','2','2','2','2','1','0','1','2','1','2','1'
'2','1','2','1','1','2','2','2','1','2','2','1','2','2','2','2','1'
'2','2','2','1','1','2','2','2','2','2','2','1','2','2','2','2','1'
'1','2','2','1','1','2','2','2','1','2','2','1','2','2','1','0','1'
'1','2','1','2','2','2','0','0','1','2','1','2','0','0','0','0','0'
'1','1','2','2','2','2','1','1','1','2','1','2','2','2','2','2','0'
'2','2','2','1','1','2','2','2','2','2','1','1','0','1','2','0','1'
'1','2','1','1','1','1','2','2','2','2','2','1','1','1','2','2','1'
'1','2','2','1','1','2','2','2','2','2','1','1','2','2','2','2','1'
'1','1','1','2','2','1','2','2','2','2','1','2','2','2','1','2','0'
'1','1','0','1','1','2','2','2','2','1','1','1','1','1','2','2','1'
'1','1','1','2','2','2','2','1','1','2','1','2','2','2','1','2','0'
'1','1','1','2','2','2','1','1','1','1','1','2','2','2','1','1','0'
'1','2','1','2','2','2','1','1','1','2','1','2','2','2','1','0','0'
'1','1','1','2','2','2','1','1','1','2','1','2','2','2','1','1','0'
'1','1','1','2','2','2','1','1','1','1','1','2','2','2','1','1','0'
'2','1','2','1','1','2','2','2','2','1','1','1','1','2','1','0','1'
'1','1','1','2','2','2','1','1','1','2','1','2','2','2','1','1','0'
'2','1','1','1','1','2','2','2','2','2','1','1','1','2','2','2','1'
'1','1','1','2','2','2','1','1','1','2','1','2','2','2','2','1','0'
'1','1','2','1','1','2','2','2','2','2','1','1','2','1','1','2','1'
'2','2','2','1','1','1','2','2','2','2','1','1','1','1','2','2','1'
'1','2','2','2','2','2','1','1','1','2','1','2','2','2','1','2','0'
'1','2','1','2','2','2','2','2','1','1','2','2','2','2','2','2','0'
'1','2','2','2','2','2','2','0','1','1','1','1','0','0','2','0','0'
'1','1','1','1','1','2','1','2','2','1','2','2','2','2','2','1','1'
'2','1','1','1','1','1','2','2','2','2','1','1','1','1','2','2','1'
'1','1','2','1','1','1','2','2','2','1','1','1','1','1','2','0','1'
'2','1','2','1','1','1','2','2','2','1','1','1','1','1','2','0','1'
'1','2','2','1','1','2','1','2','2','2','1','1','2','2','1','2','1'
'2','2','2','1','1','1','2','2','2','2','1','1','2','1','1','2','1'
'2','2','2','1','0','2','1','0','1','1','2','1','2','2','1','0','1'
'2','2','2','1','2','2','1','2','0','2','1','1','2','2','1','0','1'
'1','2','1','2','2','2','1','1','1','1','2','2','2','2','1','1','0'
'1','2','1','1','2','2','1','1','0','1','1','2','2','2','1','2','1'
'2','2','1','2','1','1','2','2','2','1','2','1','1','2','1','2','1'
'1','2','1','2','2','2','1','1','1','1','1','2','2','2','1','2','0'
'2','2','2','1','1','1','2','2','2','1','2','1','1','1','1','2','1'
'2','0','2','1','1','2','2','2','2','2','1','1','1','1','2','0','1'
'1','2','1','2','2','2','1','1','1','2','1','2','2','2','1','1','0'
'2','0','2','1','1','1','2','2','2','1','1','1','1','1','2','0','1'
'2','1','2','1','1','1','2','2','2','1','2','1','1','1','2','0','1'
'1','1','2','1','1','1','2','2','2','1','1','1','1','1','2','2','1'
'1','2','2','1','1','2','2','2','0','1','2','2','1','1','2','2','1'
'1','1','1','2','2','2','1','1','1','2','2','2','2','2','1','0','0'
'1','1','2','1','1','2','2','2','1','1','2','1','1','2','0','2','1'
'2','1','2','1','1','1','2','2','2','1','1','1','1','1','2','2','1'
'2','1','2','1','1','1','2','2','2','2','1','1','1','2','2','2','1'
'2','1','1','2','2','2','1','1','1','1','2','2','2','2','1','1','0'
'1','1','1','2','2','2','1','1','1','2','2','2','1','2','1','2','0'
'1','0','2','0','1','2','2','2','2','2','2','1','0','0','2','2','1'
'1','2','2','1','2','0','2','1','1','2','2','1','2','1','2','2','1'
'1','1','1','2','2','1','2','1','2','2','1','1','1','2','1','2','0'
'1','1','2','1','1','1','2','2','2','2','2','1','1','1','2','2','1'
'1','1','1','2','2','2','2','1','1','2','1','2','1','2','2','2','0'
'1','1','1','2','2','2','1','1','1','2','1','2','2','2','1','2','0'
'2','1','1','2','2','2','1','1','1','2','1','2','2','2','1','1','0'
'2','1','2','1','1','1','2','2','2','2','1','2','1','1','2','0','1'
'1','2','2','2','2','2','2','2','2','1','1','2','2','2','1','2','0'
'1','2','1','1','1','2','2','1','2','1','2','1','1','1','2','2','1'
'1','1','2','2','2','2','2','2','2','2','1','2','2','2','2','2','0'
'1','2','1','2','1','2','2','2','2','1','2','1','2','1','2','0','1'
'1','1','2','2','2','2','2','1','1','2','2','2','2','2','1','2','0'
'1','2','2','1','1','2','2','2','2','2','1','0','1','1','2','2','1'
'2','1','2','2','1','1','1','2','2','2','1','1','1','2','2','2','0'
'1','1','1','2','2','2','1','1','1','1','1','2','2','2','1','1','0'
'1','1','1','2','2','2','1','1','1','1','1','2','2','2','1','1','0'
'2','2','2','1','1','2','2','2','2','2','2','2','2','2','1','0','1'
'1','1','1','2','2','2','1','1','1','2','0','2','2','2','1','2','0'
'2','1','2','1','1','2','2','2','2','2','1','1','2','1','1','2','1'
'2','1','2','1','2','2','2','1','2','2','1','1','2','2','1','0','1'
'2','2','2','1','1','2','2','2','2','2','2','2','2','1','1','2','1'
'2','2','1','2','2','2','1','1','1','2','2','1','2','1','1','1','0'
'2','2','1','2','2','2','1','1','1','1','2','1','2','2','1','2','0'
'1','2','1','1','2','2','1','1','1','2','2','1','2','2','1','1','1'
'2','1','2','1','1','1','2','2','1','2','2','1','1','1','1','0','1'
'2','2','2','1','2','2','2','2','1','2','2','1','1','1','2','0','1'
'1','2','2','1','1','2','2','2','1','2','1','1','1','1','2','2','1'
'1','2','1','2','2','2','1','1','1','1','1','1','2','2','1','2','0'
'2','2','2','1','0','2','2','2','1','2','0','0','1','1','2','2','1'
'2','2','2','1','0','1','2','2','2','2','1','1','1','1','2','0','1'
'1','2','2','2','2','2','1','1','1','1','2','2','0','2','1','1','1'
'1','2','2','0','2','2','1','2','1','2','0','1','2','2','0','2','1'
'1','2','1','2','2','2','1','1','1','1','1','2','2','2','1','2','0'
'1','2','1','2','2','2','1','1','1','1','2','2','1','2','1','1','1'
'2','0','2','1','1','1','2','2','2','1','2','1','1','1','2','2','1'
'1','2','1','2','2','2','0','0','1','1','0','0','2','0','0','0','0'
'1','1','1','2','2','2','1','1','1','1','1','2','2','2','1','2','0'
'1','1','1','2','2','2','1','1','1','1','1','2','2','2','1','2','0'
'2','2','2','1','1','2','0','2','2','1','2','1','2','1','2','2','1'
'2','2','2','1','2','2','2','2','2','2','2','1','2','2','1','0','1'
'2','2','1','2','2','2','1','1','1','1','2','1','2','2','1','0','1'
'2','2','2','1','2','2','1','2','2','2','2','1','1','1','1','2','1'
'2','2','2','2','2','2','1','1','1','1','2','2','2','2','1','2','1'
'2','2','1','1','2','2','1','1','1','1','2','2','2','2','2','1','1'
'1','0','2','1','2','2','1','2','1','1','2','1','1','1','1','0','1'
'2','2','2','1','2','2','1','2','2','1','2','1','1','2','1','0','1'
'1','2','2','2','2','2','1','1','1','1','1','2','2','2','1','0','1'
'2','1','2','1','1','1','2','2','2','0','2','1','1','1','2','0','1'
'0','0','1','1','0','2','0','1','1','1','2','2','1','2','1','0','1'
'2','2','1','1','1','1','1','2','2','1','2','1','1','1','2','1','1'
'2','2','1','2','2','2','1','1','1','1','2','2','2','2','1','2','0'
'0','0','0','0','1','2','1','2','2','1','1','2','2','1','1','0','0'
'2','2','0','0','0','2','1','1','1','1','2','1','2','1','1','2','1'
'2','2','2','0','1','1','1','2','1','1','2','0','1','1','2','2','1'
'2','2','2','1','2','2','1','2','1','1','2','1','2','1','2','2','1'
'2','2','1','1','2','0','1','1','1','1','2','1','2','2','1','2','1'
'1','2','2','1','2','2','1','2','1','1','1','1','1','1','1','2','1'
'1','2','1','2','0','2','1','1','1','2','1','2','2','2','1','1','0'
'1','2','1','2','2','2','1','0','1','1','0','0','0','2','1','0','0'
'1','2','1','2','2','2','1','1','1','2','2','2','2','2','1','1','0'
'0','1','2','2','1','2','2','2','2','2','1','2','1','2','1','2','0'
'1','2','1','2','2','2','1','1','1','2','1','2','0','2','1','1','0'
'2','2','1','2','2','2','1','1','1','2','1','2','2','2','1','2','0'
'1','1','1','2','2','2','1','1','1','1','1','2','2','2','1','2','0'
'2','1','2','1','2','2','1','1','2','2','1','1','2','2','1','2','1'
'1','1','1','2','2','2','1','1','1','1','2','2','2','2','1','1','1'
'2','1','2','1','1','2','2','2','2','1','1','2','0','2','2','2','1'
'1','1','1','2','2','2','1','1','1','1','1','2','2','2','1','1','0'
'1','1','1','2','2','2','1','1','1','1','2','2','2','2','1','2','0'
'2','1','2','1','1','2','2','2','2','2','2','1','1','1','1','2','1'
'1','1','1','2','2','2','1','1','1','2','1','2','2','2','1','2','0'
'2','2','2','2','2','2','2','2','1','2','0','0','0','2','1','2','0'
'2','2','2','1','1','1','2','2','2','1','1','1','1','1','1','2','1'
'1','2','2','1','1','2','2','2','0','2','1','1','1','1','1','2','1'
'2','2','1','2','2','2','1','1','1','2','1','1','2','2','1','2','0'
'2','2','2','1','1','1','2','2','2','2','2','1','2','1','1','2','1'
'2','2','2','1','1','1','2','2','1','2','1','1','1','1','1','2','1'
'2','2','2','1','1','1','2','2','2','1','1','1','1','1','1','2','1'
'2','2','2','2','2','2','2','2','1','2','1','1','2','2','1','2','0'
'1','2','2','1','2','2','2','2','1','1','2','1','2','1','2','2','1'
'1','1','2','1','1','2','2','2','2','1','2','1','1','1','2','2','1'
'1','2','2','1','1','2','2','2','2','1','2','1','1','2','2','2','1'
'1','2','2','1','1','0','2','2','2','2','2','1','0','2','2','2','1'
'1','1','2','1','1','1','2','2','1','2','2','1','1','1','2','0','1'
'2','1','2','1','1','1','2','2','2','2','1','1','1','1','2','2','1'
'1','1','1','2','2','2','2','2','1','2','1','2','2','2','1','2','0'
'0','0','0','1','1','1','2','2','2','2','1','1','2','1','2','2','1'
'2','1','2','1','0','1','2','2','2','2','1','2','1','0','2','2','1'
'1','1','2','2','2','2','1','1','2','2','1','2','2','2','1','2','0'
'1','1','2','1','1','1','2','2','2','2','1','1','1','1','1','2','1'
'1','0','1','2','2','2','1','1','1','1','2','2','2','2','1','2','0'
'1','1','1','2','2','2','0','0','0','0','1','2','2','2','1','2','0'
'1','2','1','2','2','2','1','1','1','2','1','2','2','2','0','1','0'
