%YAML 1.1
%TAG !u! tag:unity3d.com,2011:
--- !u!1045 &1
EditorBuildSettings:
  m_ObjectHideFlags: 0
  serializedVersion: 2
  m_Scenes:
  - enabled: 1
    path: Assets/Scenes/Levels/Home.unity
    guid: eb696bc22d3c50544b95fd72c5d3d536
  - enabled: 1
    path: Assets/Scenes/Levels/Level01.unity
    guid: 3c02ebac510aea443a371c734c9d7aac
  - enabled: 1
    path: Assets/Scenes/Levels/Level02.unity
    guid: b931a0c1ea2dae74a8433e5446365c00
  - enabled: 1
    path: Assets/Scenes/Levels/Level03.unity
    guid: 0ebb542d65a59664fab74876c1a58294
  - enabled: 1
    path: Assets/Scenes/Levels/Level04.unity
    guid: c9411dd0e20e08f469b45fff0a4f146f
  - enabled: 1
    path: Assets/Scenes/Levels/Level05.unity
    guid: d089e37344bdb624ca5479178efcd44c
  - enabled: 1
    path: Assets/Scenes/Levels/Level06.unity
    guid: dc53770cb6e41ff489e2cc447f5ea4df
  - enabled: 1
    path: Assets/Scenes/Levels/Level07.unity
    guid: 21ea969c5cfe07540bc78703f823dc00
  - enabled: 1
    path: Assets/Scenes/Levels/Level08.unity
    guid: fed635f72b57020459c25dac2bba1ea4
  - enabled: 1
    path: Assets/Scenes/Levels/Level09.unity
    guid: 5e967dddd39948042bce0ba5695cbf1f
  - enabled: 1
    path: Assets/Scenes/Levels/Level10.unity
    guid: e828c491c49ed97418da7809015c619d
  - enabled: 1
    path: Assets/Scenes/Levels/SelectLevel.unity
    guid: dc807325d84cfec478e75133ad034f46
  m_configObjects: {}
