{
  "name": "Documentation madu-api",
  "version": "1.0.0",
  "description": "API CRUD Documentation.",
  "title": "Documentation madu-api",
  "url": "http://localhost:8080",
  "sampleUrl": false,
  "defaultVersion": "0.0.0",
  "apidoc": "0.3.0",
  "generator": {
    "name": "apidoc",
    "time": "2020-07-08T12:57:26.861Z",
    "url": "http://apidocjs.com",
    "version": "0.23.0"
  }
}
