<?xml version="1.0" encoding="iso-8859-1"?>
<!-- Uploaded to: SVG Repo, www.svgrepo.com, Generator: SVG Repo Mixer Tools -->
<svg fill="#005e35" height="800px" width="800px" version="1.1" id="Layer_1" xmlns="http://www.w3.org/2000/svg" xmlns:xlink="http://www.w3.org/1999/xlink" 
	 viewBox="0 0 512 512" xml:space="preserve">
<g>
	<g>
		<g>
			<path d="M426.667,170.667C426.667,76.41,350.257,0,256,0S85.333,76.41,85.333,170.667c0,87.031,65.146,158.843,149.333,169.342
				v150.658c0,11.782,9.551,21.333,21.333,21.333s21.333-9.551,21.333-21.333V340.008
				C361.521,329.51,426.667,257.698,426.667,170.667z M256,298.667c-70.693,0-128-57.307-128-128s57.307-128,128-128
				s128,57.307,128,128S326.693,298.667,256,298.667z"/>
			<path d="M256,85.333c-47.131,0-85.333,38.202-85.333,85.333c0,11.782,9.551,21.333,21.333,21.333
				c11.782,0,21.333-9.551,21.333-21.333C213.333,147.099,232.433,128,256,128c11.782,0,21.333-9.551,21.333-21.333
				C277.333,94.885,267.782,85.333,256,85.333z"/>
		</g>
	</g>
</g>
</svg>