<svg width="25" height="24" viewBox="0 0 25 24" fill="none" xmlns="http://www.w3.org/2000/svg">
<rect x="1" y="1" width="23" height="22" rx="5" stroke="white" stroke-width="2"/>
<circle cx="12.5" cy="12" r="5.5" stroke="white" stroke-width="2"/>
<circle cx="19.5" cy="5" r="1.5" fill="white"/>
</svg>
