<svg width="18" height="18" viewBox="0 0 18 18" fill="none" xmlns="http://www.w3.org/2000/svg">
    <path fill-rule="evenodd" clip-rule="evenodd" d="M14.3997 0C13.9803 0 13.6167 0.288893 13.5222 0.697484L12.6457 4.49989H0.900041C0.622847 4.49989 0.360954 4.62859 0.190858 4.84639C0.0198617 5.06508 -0.0404369 5.34947 0.0270615 5.61857L1.82702 12.8184C1.92692 13.2189 2.28691 13.4997 2.7 13.4997H11.6998C12.1192 13.4997 12.4828 13.2108 12.5773 12.8031L15.1152 1.79996H17.9996V0H14.3997Z"/>
    <path fill-rule="evenodd" clip-rule="evenodd" d="M3.60001 14.4C2.60643 14.4 1.80005 15.2064 1.80005 16.2C1.80005 17.1954 2.60643 17.9999 3.60001 17.9999C4.59358 17.9999 5.39996 17.1954 5.39996 16.2C5.39996 15.2064 4.59358 14.4 3.60001 14.4Z"/>
    <path fill-rule="evenodd" clip-rule="evenodd" d="M10.7998 14.4C9.80626 14.4 8.99988 15.2064 8.99988 16.2C8.99988 17.1954 9.80626 17.9999 10.7998 17.9999C11.7934 17.9999 12.5998 17.1954 12.5998 16.2C12.5998 15.2064 11.7934 14.4 10.7998 14.4Z"/>
</svg>
