
<svg width="46" height="40" viewBox="0 0 46 40" fill="none" xmlns="http://www.w3.org/2000/svg">
<path fill-rule="evenodd" clip-rule="evenodd" d="M44.2038 7.95689C43.0057 6.75509 41.5606 6.15401 39.8674 6.15401H34.5007L33.279 2.88504C32.9754 2.09992 32.4207 1.42273 31.6136 0.853574C30.8069 0.284665 29.9805 0 29.1338 0H16.8668C16.0203 0 15.1936 0.284665 14.387 0.853574C13.5803 1.42273 13.0254 2.09992 12.7219 2.88504L11.5001 6.15401H6.13336C4.44001 6.15401 2.99481 6.75509 1.79673 7.95689C0.598911 9.15878 0 10.609 0 12.3078V33.8461C0 35.545 0.598911 36.9953 1.79673 38.1969C2.99481 39.3989 4.4401 40 6.13336 40H39.8668C41.56 40 43.005 39.3989 44.2032 38.1969C45.4009 36.9953 46 35.545 46 33.8461V12.3078C46.0003 10.609 45.4013 9.15878 44.2038 7.95689ZM30.7712 30.7708C28.6187 32.9234 26.0285 33.9999 23 33.9999C19.9715 33.9999 17.3815 32.9234 15.2289 30.7708C13.0762 28.6186 12.0001 26.0278 12.0001 23C12.0001 19.9713 13.0765 17.3814 15.2289 15.2287C17.3813 13.076 19.9716 11.9999 23 11.9999C26.0284 11.9999 28.6187 13.0763 30.7712 15.2287C32.9238 17.3811 34.0001 19.9713 34.0001 23C34.0001 26.0278 32.9239 28.6183 30.7712 30.7708ZM18.0538 18.054C19.423 16.6846 21.0717 16 23 16C24.928 16 26.577 16.6847 27.9461 18.054C29.3153 19.4234 30 21.0718 30 23.0005C30 24.9285 29.3153 26.5771 27.9461 27.9464C26.5769 29.3154 24.928 30 23 30C21.0717 30 19.423 29.3154 18.0538 27.9464C16.6846 26.5771 16 24.9284 16 23.0005C16 21.0717 16.6846 19.4233 18.0538 18.054Z" fill="#3F4CB1"/>
</svg>
