<svg width="22" height="13" viewBox="0 0 22 13" fill="none" xmlns="http://www.w3.org/2000/svg">
<path d="M18.8944 8.22968C19.6226 8.97038 20.3913 9.66727 21.0444 10.4827C21.3329 10.845 21.6061 11.2189 21.8151 11.6394C22.1112 12.2372 21.843 12.895 21.3285 12.9307L18.1302 12.9292C17.3053 13.0005 16.6472 12.6546 16.0939 12.067C15.6511 11.5971 15.241 11.097 14.8152 10.6113C14.6407 10.4128 14.458 10.226 14.2397 10.0783C13.8031 9.78306 13.4241 9.87346 13.1746 10.3478C12.9205 10.8304 12.8629 11.3646 12.8379 11.9024C12.8036 12.6869 12.576 12.8932 11.8195 12.9291C10.2027 13.0086 8.66837 12.7538 7.24299 11.9041C5.98632 11.1551 5.01183 10.0976 4.16363 8.90049C2.51219 6.56943 1.24752 4.00798 0.110874 1.37477C-0.144975 0.781503 0.0421333 0.46304 0.670468 0.451769C1.71384 0.430653 2.75708 0.432156 3.80168 0.450266C4.22574 0.456728 4.50647 0.710116 4.67021 1.12747C5.23471 2.57347 5.92544 3.94922 6.79245 5.22442C7.02335 5.56392 7.25878 5.90343 7.59405 6.14239C7.96495 6.40697 8.24734 6.31928 8.42183 5.88885C8.53255 5.61592 8.58102 5.32196 8.60598 5.02965C8.68864 4.02399 8.69953 3.02006 8.55455 2.01793C8.46554 1.3925 8.12739 0.987624 7.52834 0.869272C7.22264 0.808931 7.26816 0.690428 7.41617 0.508653C7.67325 0.19515 7.91503 0 8.39701 0H12.0116C12.5806 0.117 12.707 0.383312 12.7849 0.979809L12.788 5.16258C12.7818 5.3935 12.8987 6.07874 13.298 6.23158C13.6175 6.34039 13.8281 6.07408 14.0199 5.863C14.8853 4.90611 15.5029 3.77526 16.0547 2.60428C16.2996 2.08939 16.5102 1.55466 16.7142 1.02039C16.8654 0.623925 17.1027 0.42885 17.5313 0.437491L21.0102 0.440723C21.1133 0.440723 21.2177 0.442301 21.3176 0.46011C21.9038 0.564185 22.0644 0.82689 21.8834 1.42324C21.5981 2.35886 21.043 3.13856 20.5003 3.92187C19.9202 4.75815 19.2997 5.5658 18.7244 6.40705C18.1958 7.17525 18.2378 7.56247 18.8944 8.22968Z" fill="white"/>
</svg>
