Date : 2024-02-22 20:20:21
Directory : /home/julien/Code/[7] HHO_nl/hho_nl_advdiff/ho
Total : 1 files,  369 codes, 73 comments, 158 blanks, all 600 lines

Languages
+----------+------------+------------+------------+------------+------------+
| language | files      | code       | comment    | blank      | total      |
+----------+------------+------------+------------+------------+------------+
| C++      |          1 |        369 |         73 |        158 |        600 |
+----------+------------+------------+------------+------------+------------+

Directories
+----------------------------------------------------------+------------+------------+------------+------------+------------+
| path                                                     | files      | code       | comment    | blank      | total      |
+----------------------------------------------------------+------------+------------+------------+------------+------------+
| .                                                        |          1 |        369 |         73 |        158 |        600 |
+----------------------------------------------------------+------------+------------+------------+------------+------------+

Files
+----------------------------------------------------------+----------+------------+------------+------------+------------+
| filename                                                 | language | code       | comment    | blank      | total      |
+----------------------------------------------------------+----------+------------+------------+------------+------------+
| /home/julien/Code/[7] HHO_nl/hho_nl_advdiff/ho/ho_nl.cpp | C++      |        369 |         73 |        158 |        600 |
| Total                                                    |          |        369 |         73 |        158 |        600 |
+----------------------------------------------------------+----------+------------+------------+------------+------------+