<?xml version="1.0" encoding="UTF-8" standalone="no"?>
<!-- Created with matplotlib (http://matplotlib.org/) -->

<svg
   xmlns:dc="http://purl.org/dc/elements/1.1/"
   xmlns:cc="http://creativecommons.org/ns#"
   xmlns:rdf="http://www.w3.org/1999/02/22-rdf-syntax-ns#"
   xmlns:svg="http://www.w3.org/2000/svg"
   xmlns="http://www.w3.org/2000/svg"
   xmlns:xlink="http://www.w3.org/1999/xlink"
   xmlns:sodipodi="http://sodipodi.sourceforge.net/DTD/sodipodi-0.dtd"
   xmlns:inkscape="http://www.inkscape.org/namespaces/inkscape"
   height="639pt"
   version="1.1"
   viewBox="0 0 1170 639"
   width="1170pt"
   id="svg508"
   sodipodi:docname="kitti_06.svg"
   inkscape:version="0.92.3 (unknown)">
  <metadata
     id="metadata512">
    <rdf:RDF>
      <cc:Work
         rdf:about="">
        <dc:format>image/svg+xml</dc:format>
        <dc:type
           rdf:resource="http://purl.org/dc/dcmitype/StillImage" />
      </cc:Work>
    </rdf:RDF>
  </metadata>
  <sodipodi:namedview
     pagecolor="#ffffff"
     bordercolor="#666666"
     borderopacity="1"
     objecttolerance="10"
     gridtolerance="10"
     guidetolerance="10"
     inkscape:pageopacity="0"
     inkscape:pageshadow="2"
     inkscape:window-width="1301"
     inkscape:window-height="744"
     id="namedview510"
     showgrid="false"
     inkscape:zoom="0.37051282"
     inkscape:cx="943.38359"
     inkscape:cy="304.67162"
     inkscape:window-x="65"
     inkscape:window-y="24"
     inkscape:window-maximized="1"
     inkscape:current-layer="svg508" />
  <defs
     id="defs4">
    <style
       type="text/css"
       id="style2">
*{stroke-linecap:butt;stroke-linejoin:round;stroke-miterlimit:100000;}
  </style>
  </defs>
  <g
     style="stroke-linecap:butt;stroke-linejoin:round;stroke-miterlimit:100000"
     id="axes_1">
    <g
       style="stroke-linecap:butt;stroke-linejoin:round;stroke-miterlimit:100000"
       id="patch_2">
      <path
         inkscape:connector-curvature="0"
         id="path9"
         style="fill:#ffffff;stroke-linecap:butt;stroke-linejoin:round;stroke-miterlimit:100000"
         d="m 387.08625,575.1 h 426 V 63.9 h -426 z" />
    </g>
    <g
       style="stroke-linecap:butt;stroke-linejoin:round;stroke-miterlimit:100000"
       id="line2d_1">
      <path
         inkscape:connector-curvature="0"
         id="path12"
         style="fill:none;stroke:#ff0000;stroke-width:1.5;stroke-linecap:square;stroke-linejoin:round;stroke-miterlimit:100000"
         d="m 600.08625,404.7 -0.50307,-33.57348 -0.62169,-31.63927 0.0231,-7.95442 0.24442,-7.86026 0.64099,-16.22198 -0.0254,-8.38402 -0.47821,-34.42711 -1.08128,-54.52092 -0.33909,-9.80295 -0.0147,-9.78351 0.10857,-7.58084 0.28193,-6.44623 0.47121,-9.425 0.0882,-5.46004 -0.11187,-4.01471 -0.24611,-2.01217 -0.45447,-1.8174 -0.69067,-1.56521 -0.67343,-1.0345 -0.81255,-0.88292 -1.26244,-0.8601 -1.03578,-0.3857 -1.04767,-0.19204 -0.72117,0.003 -0.7541,0.0466 -1.94129,0.67776 -1.53642,1.0673 -1.1597,1.07625 -1.10602,1.39183 -1.00786,1.64836 -0.88027,1.93421 -0.71851,2.19365 -0.5074,2.44737 -0.28085,2.65116 -0.0598,2.85182 0.14314,3.01139 1.15355,15.44463 0.20587,6.89703 0.92913,59.48255 -0.0383,10.62827 -0.40285,34.96276 0.0852,7.02849 0.29663,6.67167 1.05826,18.36594 0.35081,10.81751 0.20984,13.77601 0.32804,20.97493 0.32519,27.20531 1.0069,90.85005 -0.007,29.02049 0.0547,9.00589 0.27601,1.70443 0.45223,1.47004 0.63984,1.25551 0.84274,1.05852 0.66043,0.56624 0.72612,0.44764 1.15838,0.46818 0.79397,0.19527 1.22708,0.0136 0.83746,-0.0908 1.23182,-0.44304 0.79244,-0.4007 1.12241,-0.91181 0.98798,-1.14423 0.57273,-0.92042 0.66328,-1.57109 0.4225,-1.79269 0.30622,-2.7143 0.052,-3.01608 -0.0523,-19.9673 -0.10443,-10.36015 -0.47676,-33.07446 -0.25705,-15.03647 -0.30921,-19.56781 -0.37854,-47.69479 -0.34984,-23.24063 -0.51832,-23.56286 -0.0205,-14.61418 -0.3232,-6.5189 -0.13008,-4.82633 0.10704,-4.97534 0.46048,-8.32847 0.33808,-6.62251 0.0762,-5.77392 -0.14502,-12.09908 -0.57001,-31.31884 -0.33621,-26.79761 -0.3758,-13.63004 0.0167,-11.86385 0.41272,-12.77122 0.12124,-7.14922 0.0232,-16.45766 v 0"
         clip-path="url(#pb80181bbb1)" />
    </g>
    <g
       style="stroke-linecap:butt;stroke-linejoin:round;stroke-miterlimit:100000"
       id="line2d_2">
      <path
         inkscape:connector-curvature="0"
         id="path15"
         style="fill:none;stroke:#ff0000;stroke-linecap:square;stroke-linejoin:round;stroke-miterlimit:100000"
         d="M 600.08625,404.7"
         clip-path="url(#pb80181bbb1)" />
      <defs
         id="defs18">
        <path
           inkscape:connector-curvature="0"
           style="stroke:#000000;stroke-width:0.5;stroke-linecap:butt;stroke-linejoin:miter;stroke-miterlimit:100000"
           id="m9ebc67aa75"
           d="M 0,4 4,-4 H -4 Z" />
      </defs>
      <g
         style="stroke-linecap:butt;stroke-linejoin:round;stroke-miterlimit:100000"
         id="g22"
         clip-path="url(#pb80181bbb1)">
        <use
           height="100%"
           width="100%"
           id="use20"
           y="404.70001"
           xlink:href="#m9ebc67aa75"
           x="600.08624"
           style="fill:#ff0000;stroke:#000000;stroke-width:0.5;stroke-linecap:butt;stroke-linejoin:miter;stroke-miterlimit:100000" />
      </g>
    </g>
    <g
       style="stroke-linecap:butt;stroke-linejoin:round;stroke-miterlimit:100000"
       id="line2d_3">
      <path
         inkscape:connector-curvature="0"
         id="path25"
         style="fill:none;stroke:#0072bd;stroke-width:1.5;stroke-linecap:square;stroke-linejoin:round;stroke-miterlimit:100000"
         d="m 600.08625,404.7 -0.008,-7.20431 0.007,-4.07139 -0.41221,-34.05777 -0.1993,-17.62884 0.0215,-11.06745 0.17671,-5.92417 0.84279,-21.68488 -0.24855,-20.46776 -0.0513,-6.54635 -0.28783,-24.06035 -0.29526,-16.08394 -0.22843,-25.31898 -0.36459,-11.00721 -0.0282,-7.83207 0.18126,-10.65976 0.5354,-10.15019 0.43478,-8.7538 0.0589,-6.34469 -0.20318,-2.61309 -0.38237,-1.87003 -0.60938,-1.67362 -0.55181,-1.0009 -0.78647,-1.00099 -0.91085,-0.69623 -1.34758,-0.67234 -1.65583,-0.36441 -1.45012,0.13298 -0.80115,0.2166 -1.1974,0.6094 -1.15824,0.83115 -1.14977,1.09496 -1.1189,1.3798 -1.00649,1.63949 -0.88468,1.94832 -0.68449,2.18172 -0.48338,2.45122 -0.28028,2.69083 -0.0667,2.8863 0.17644,3.05635 0.34883,4.23408 0.56773,6.88941 0.37957,7.01608 0.1873,5.98642 0.12363,7.15668 0.12011,7.30756 0.92616,37.83651 0.14277,13.48662 -0.0569,9.09298 -0.0333,11.01635 -0.0124,7.86068 0.0129,15.77139 0.28712,7.87741 1.383,21.41477 0.37381,9.57305 0.12525,6.40554 0.6732,29.14567 0.24614,14.66595 0.0722,4.73528 0.33732,14.25255 1.53531,96.0783 0.20558,30.31122 0.48689,2.06828 0.56506,1.29364 0.7365,1.00791 0.81505,0.78377 0.97305,0.65754 1.16832,0.36281 1.56519,-0.0103 0.79505,-0.0571 0.79238,-0.23995 1.10931,-0.53058 0.76786,-0.5295 0.69744,-0.65576 0.9604,-1.2324 0.80304,-1.52422 0.49734,-1.74125 0.28,-1.97381 0.12319,-2.17967 -0.33368,-13.15776 -0.43814,-14.06734 -0.78783,-18.86299 -0.47793,-12.91212 -0.22444,-6.42062 -1.15226,-26.61613 -1.37184,-38.46836 -0.20168,-4.72294 -0.95986,-26.66731 -0.71285,-15.37262 -0.8187,-16.8197 -0.54988,-18.50093 -0.83566,-12.5209 0.0983,-9.33629 0.22826,-9.94337 -0.11043,-6.97577 -0.69086,-14.7608 -0.48478,-8.64126 -0.39705,-8.55673 -0.43783,-11.9483 -0.10193,-3.6022 -0.26707,-6.9636 -0.19839,-5.76146 -0.72414,-12.21987 -0.51465,-8.28928 -0.27345,-9.7417 -0.11914,-9.77972 0.0447,-8.53397 -0.16733,-8.73659 -0.36301,-15.31211 v 0"
         clip-path="url(#pb80181bbb1)" />
    </g>
    <g
       style="stroke-linecap:butt;stroke-linejoin:round;stroke-miterlimit:100000"
       id="line2d_4">
      <path
         inkscape:connector-curvature="0"
         id="path28"
         style="fill:none;stroke:#0072bd;stroke-linecap:square;stroke-linejoin:round;stroke-miterlimit:100000"
         d="M 600.08625,404.7"
         clip-path="url(#pb80181bbb1)" />
      <defs
         id="defs31">
        <path
           inkscape:connector-curvature="0"
           style="stroke:#000000;stroke-width:0.5;stroke-linecap:butt;stroke-linejoin:miter;stroke-miterlimit:100000"
           id="m7efe78ac0b"
           d="M 0,4 4,-4 H -4 Z" />
      </defs>
      <g
         style="stroke-linecap:butt;stroke-linejoin:round;stroke-miterlimit:100000"
         id="g35"
         clip-path="url(#pb80181bbb1)">
        <use
           height="100%"
           width="100%"
           id="use33"
           y="404.70001"
           xlink:href="#m7efe78ac0b"
           x="600.08624"
           style="fill:#0072bd;stroke:#000000;stroke-width:0.5;stroke-linecap:butt;stroke-linejoin:miter;stroke-miterlimit:100000" />
      </g>
    </g>
    <g
       style="stroke-linecap:butt;stroke-linejoin:round;stroke-miterlimit:100000"
       id="line2d_5">
      <path
         inkscape:connector-curvature="0"
         id="path38"
         style="fill:none;stroke:#d95319;stroke-width:1.5;stroke-linecap:square;stroke-linejoin:round;stroke-miterlimit:100000"
         d="m 600.08625,404.7 -0.31458,-37.10435 -0.32791,-32.9143 0.21143,-7.92147 0.42778,-9.04183 0.28427,-5.19792 0.21213,-10.45268 -0.10127,-9.68886 -0.0595,-8.70018 -0.91971,-76.6244 -0.1982,-6.85363 -0.006,-8.39181 0.31601,-12.82142 1.01517,-21.28272 -0.12653,-3.36911 -0.40662,-2.45385 -0.39488,-1.32664 -0.5016,-1.10206 -0.65297,-1.02529 -1.09194,-1.2135 -0.99363,-0.4981 -1.31114,-0.51126 -1.01896,-0.16966 -1.91098,0.20421 -0.78861,0.30055 -1.15254,0.66367 -1.19684,0.92699 -1.13741,1.18517 -1.07197,1.4595 -0.98674,1.78658 -0.84128,2.05444 -0.65076,2.32352 -0.30628,1.68001 -0.3406,3.6847 0.0405,2.93067 0.20998,3.11153 0.6881,7.82371 0.38082,5.80082 0.3105,8.19299 0.8099,39.03934 0.2005,10.05826 0.035,32.29835 -0.0716,10.22667 0.0874,22.84151 0.89785,14.7112 0.51568,8.69527 0.49334,14.63683 0.19872,12.65315 0.27535,14.9233 0.9202,54.07408 0.0969,6.11851 0.37017,20.86204 0.1987,10.90834 0.10907,9.56697 0.27261,16.29497 0.11897,10.13273 0.0962,16.18317 -0.009,5.08952 -0.0836,12.69215 0.29468,2.37011 0.34758,1.52138 0.55857,1.27744 0.51551,0.73438 0.83774,0.88363 0.89612,0.73402 0.72533,0.3282 1.17146,0.29183 1.56371,-0.0536 0.77472,-0.12276 1.86847,-0.61071 0.78501,-0.54885 1.05324,-1.09159 0.90281,-1.37166 0.61973,-1.60949 0.294,-1.18273 0.32064,-2.67039 0.0578,-2.23325 -0.0843,-4.90237 -0.23433,-9.48078 -1.81625,-55.47794 -0.845,-21.42688 -0.47917,-14.67791 -0.31035,-9.62594 -2.25438,-63.90984 -0.69667,-17.26538 -0.16843,-11.99785 -0.86101,-18.37518 0.30692,-10.67673 0.15086,-7.9316 -0.11426,-5.9151 -0.67967,-16.10932 -0.4168,-8.61645 -1.48047,-44.02477 -0.64949,-11.20586 -0.14923,-7.06491 -0.14104,-34.4262 -0.10513,-3.57247 0.006,-3.46798 -0.0687,-2.79131 v 0"
         clip-path="url(#pb80181bbb1)" />
    </g>
    <g
       style="stroke-linecap:butt;stroke-linejoin:round;stroke-miterlimit:100000"
       id="line2d_6">
      <path
         inkscape:connector-curvature="0"
         id="path41"
         style="fill:none;stroke:#d95319;stroke-linecap:square;stroke-linejoin:round;stroke-miterlimit:100000"
         d="M 600.08625,404.7"
         clip-path="url(#pb80181bbb1)" />
      <defs
         id="defs44">
        <path
           inkscape:connector-curvature="0"
           style="stroke:#000000;stroke-width:0.5;stroke-linecap:butt;stroke-linejoin:miter;stroke-miterlimit:100000"
           id="mae8caf12ed"
           d="M 0,4 4,-4 H -4 Z" />
      </defs>
      <g
         style="stroke-linecap:butt;stroke-linejoin:round;stroke-miterlimit:100000"
         id="g48"
         clip-path="url(#pb80181bbb1)">
        <use
           height="100%"
           width="100%"
           id="use46"
           y="404.70001"
           xlink:href="#mae8caf12ed"
           x="600.08624"
           style="fill:#d95319;stroke:#000000;stroke-width:0.5;stroke-linecap:butt;stroke-linejoin:miter;stroke-miterlimit:100000" />
      </g>
    </g>
    <g
       style="stroke-linecap:butt;stroke-linejoin:round;stroke-miterlimit:100000"
       id="patch_3">
      <path
         inkscape:connector-curvature="0"
         id="path51"
         style="fill:none;stroke:#000000;stroke-linecap:square;stroke-linejoin:miter;stroke-miterlimit:100000"
         d="m 387.08625,63.9 h 426" />
    </g>
    <g
       style="stroke-linecap:butt;stroke-linejoin:round;stroke-miterlimit:100000"
       id="patch_4">
      <path
         inkscape:connector-curvature="0"
         id="path54"
         style="fill:none;stroke:#000000;stroke-linecap:square;stroke-linejoin:miter;stroke-miterlimit:100000"
         d="M 813.08625,575.1 V 63.9" />
    </g>
    <g
       style="stroke-linecap:butt;stroke-linejoin:round;stroke-miterlimit:100000"
       id="patch_5">
      <path
         inkscape:connector-curvature="0"
         id="path57"
         style="fill:none;stroke:#000000;stroke-linecap:square;stroke-linejoin:miter;stroke-miterlimit:100000"
         d="m 387.08625,575.1 h 426" />
    </g>
    <g
       style="stroke-linecap:butt;stroke-linejoin:round;stroke-miterlimit:100000"
       id="patch_6">
      <path
         inkscape:connector-curvature="0"
         id="path60"
         style="fill:none;stroke:#000000;stroke-linecap:square;stroke-linejoin:miter;stroke-miterlimit:100000"
         d="M 387.08625,575.1 V 63.9" />
    </g>
    <g
       style="stroke-linecap:butt;stroke-linejoin:round;stroke-miterlimit:100000"
       id="matplotlib.axis_1">
      <g
         style="stroke-linecap:butt;stroke-linejoin:round;stroke-miterlimit:100000"
         id="xtick_1">
        <g
           style="stroke-linecap:butt;stroke-linejoin:round;stroke-miterlimit:100000"
           id="line2d_7">
          <defs
             id="defs64">
            <path
               inkscape:connector-curvature="0"
               style="stroke:#000000;stroke-width:0.5;stroke-linecap:butt;stroke-linejoin:round;stroke-miterlimit:100000"
               id="ma610be6e60"
               d="M 0,0 V -4" />
          </defs>
          <g
             style="stroke-linecap:butt;stroke-linejoin:round;stroke-miterlimit:100000"
             id="g68">
            <use
               height="100%"
               width="100%"
               id="use66"
               y="575.09998"
               xlink:href="#ma610be6e60"
               x="429.68625"
               style="stroke:#000000;stroke-width:0.5;stroke-linecap:butt;stroke-linejoin:round;stroke-miterlimit:100000" />
          </g>
        </g>
        <g
           style="stroke-linecap:butt;stroke-linejoin:round;stroke-miterlimit:100000"
           id="line2d_8">
          <defs
             id="defs72">
            <path
               inkscape:connector-curvature="0"
               style="stroke:#000000;stroke-width:0.5;stroke-linecap:butt;stroke-linejoin:round;stroke-miterlimit:100000"
               id="m50bd928941"
               d="M 0,0 V 4" />
          </defs>
          <g
             style="stroke-linecap:butt;stroke-linejoin:round;stroke-miterlimit:100000"
             id="g76">
            <use
               height="100%"
               width="100%"
               id="use74"
               y="63.900002"
               xlink:href="#m50bd928941"
               x="429.68625"
               style="stroke:#000000;stroke-width:0.5;stroke-linecap:butt;stroke-linejoin:round;stroke-miterlimit:100000" />
          </g>
        </g>
        <g
           style="stroke-linecap:butt;stroke-linejoin:round;stroke-miterlimit:100000"
           id="text_1">
          <!-- −200 -->
          <defs
             id="defs82">
            <path
               style="stroke-linecap:butt;stroke-linejoin:round;stroke-miterlimit:100000"
               inkscape:connector-curvature="0"
               id="BitstreamVeraSans-Roman-2212"
               d="M 10.59375,35.5 H 73.1875 V 27.203125 H 10.59375 Z" />
            <path
               style="stroke-linecap:butt;stroke-linejoin:round;stroke-miterlimit:100000"
               inkscape:connector-curvature="0"
               id="BitstreamVeraSans-Roman-32"
               d="M 19.1875,8.296875 H 53.609375 V 0 H 7.328125 v 8.296875 q 5.609375,5.8125 15.296875,15.59375 9.703125,9.796875 12.1875,12.640625 4.734375,5.3125 6.609375,9 1.890625,3.6875 1.890625,7.25 0,5.8125 -4.078125,9.46875 -4.078125,3.671875 -10.625,3.671875 -4.640625,0 -9.796875,-1.609375 -5.140625,-1.609375 -11,-4.890625 v 9.96875 Q 13.765625,71.78125 18.9375,73 q 5.1875,1.21875 9.484375,1.21875 11.328125,0 18.0625,-5.671875 6.734375,-5.65625 6.734375,-15.125 0,-4.5 -1.6875,-8.53125 Q 49.859375,40.875 45.40625,35.40625 44.1875,33.984375 37.640625,27.21875 31.109375,20.453125 19.1875,8.296875" />
            <path
               style="stroke-linecap:butt;stroke-linejoin:round;stroke-miterlimit:100000"
               inkscape:connector-curvature="0"
               id="BitstreamVeraSans-Roman-30"
               d="m 31.78125,66.40625 q -7.609375,0 -11.453125,-7.5 Q 16.5,51.421875 16.5,36.375 q 0,-14.984375 3.828125,-22.484375 3.84375,-7.5 11.453125,-7.5 7.671875,0 11.5,7.5 3.84375,7.5 3.84375,22.484375 0,15.046875 -3.84375,22.53125 -3.828125,7.5 -11.5,7.5 m 0,7.8125 q 12.265625,0 18.734375,-9.703125 6.46875,-9.6875 6.46875,-28.140625 0,-18.40625 -6.46875,-28.109375 -6.46875,-9.6875 -18.734375,-9.6875 -12.25,0 -18.71875,9.6875 Q 6.59375,17.96875 6.59375,36.375 q 0,18.453125 6.46875,28.140625 6.46875,9.703125 18.71875,9.703125" />
          </defs>
          <g
             style="stroke-linecap:butt;stroke-linejoin:round;stroke-miterlimit:100000"
             id="g92"
             transform="matrix(0.12,0,0,-0.12,413.20594,588.21812)">
            <use
               height="100%"
               width="100%"
               y="0"
               x="0"
               style="stroke-linecap:butt;stroke-linejoin:round;stroke-miterlimit:100000"
               id="use84"
               xlink:href="#BitstreamVeraSans-Roman-2212" />
            <use
               height="100%"
               width="100%"
               y="0"
               style="stroke-linecap:butt;stroke-linejoin:round;stroke-miterlimit:100000"
               id="use86"
               xlink:href="#BitstreamVeraSans-Roman-32"
               x="83.789062" />
            <use
               height="100%"
               width="100%"
               y="0"
               style="stroke-linecap:butt;stroke-linejoin:round;stroke-miterlimit:100000"
               id="use88"
               xlink:href="#BitstreamVeraSans-Roman-30"
               x="147.41211" />
            <use
               height="100%"
               width="100%"
               y="0"
               style="stroke-linecap:butt;stroke-linejoin:round;stroke-miterlimit:100000"
               id="use90"
               xlink:href="#BitstreamVeraSans-Roman-30"
               x="211.03516" />
          </g>
        </g>
      </g>
      <g
         style="stroke-linecap:butt;stroke-linejoin:round;stroke-miterlimit:100000"
         id="xtick_2">
        <g
           style="stroke-linecap:butt;stroke-linejoin:round;stroke-miterlimit:100000"
           id="line2d_9">
          <g
             style="stroke-linecap:butt;stroke-linejoin:round;stroke-miterlimit:100000"
             id="g98">
            <use
               height="100%"
               width="100%"
               id="use96"
               y="575.09998"
               xlink:href="#ma610be6e60"
               x="514.88623"
               style="stroke:#000000;stroke-width:0.5;stroke-linecap:butt;stroke-linejoin:round;stroke-miterlimit:100000" />
          </g>
        </g>
        <g
           style="stroke-linecap:butt;stroke-linejoin:round;stroke-miterlimit:100000"
           id="line2d_10">
          <g
             style="stroke-linecap:butt;stroke-linejoin:round;stroke-miterlimit:100000"
             id="g103">
            <use
               height="100%"
               width="100%"
               id="use101"
               y="63.900002"
               xlink:href="#m50bd928941"
               x="514.88623"
               style="stroke:#000000;stroke-width:0.5;stroke-linecap:butt;stroke-linejoin:round;stroke-miterlimit:100000" />
          </g>
        </g>
        <g
           style="stroke-linecap:butt;stroke-linejoin:round;stroke-miterlimit:100000"
           id="text_2">
          <!-- −100 -->
          <defs
             id="defs107">
            <path
               style="stroke-linecap:butt;stroke-linejoin:round;stroke-miterlimit:100000"
               inkscape:connector-curvature="0"
               id="BitstreamVeraSans-Roman-31"
               d="m 12.40625,8.296875 h 16.109375 v 55.625 L 10.984375,60.40625 v 8.984375 l 17.4375,3.515625 H 38.28125 V 8.296875 H 54.390625 V 0 H 12.40625 Z" />
          </defs>
          <g
             style="stroke-linecap:butt;stroke-linejoin:round;stroke-miterlimit:100000"
             id="g117"
             transform="matrix(0.12,0,0,-0.12,498.40594,588.21812)">
            <use
               height="100%"
               width="100%"
               y="0"
               x="0"
               style="stroke-linecap:butt;stroke-linejoin:round;stroke-miterlimit:100000"
               id="use109"
               xlink:href="#BitstreamVeraSans-Roman-2212" />
            <use
               height="100%"
               width="100%"
               y="0"
               style="stroke-linecap:butt;stroke-linejoin:round;stroke-miterlimit:100000"
               id="use111"
               xlink:href="#BitstreamVeraSans-Roman-31"
               x="83.789062" />
            <use
               height="100%"
               width="100%"
               y="0"
               style="stroke-linecap:butt;stroke-linejoin:round;stroke-miterlimit:100000"
               id="use113"
               xlink:href="#BitstreamVeraSans-Roman-30"
               x="147.41211" />
            <use
               height="100%"
               width="100%"
               y="0"
               style="stroke-linecap:butt;stroke-linejoin:round;stroke-miterlimit:100000"
               id="use115"
               xlink:href="#BitstreamVeraSans-Roman-30"
               x="211.03516" />
          </g>
        </g>
      </g>
      <g
         style="stroke-linecap:butt;stroke-linejoin:round;stroke-miterlimit:100000"
         id="xtick_3">
        <g
           style="stroke-linecap:butt;stroke-linejoin:round;stroke-miterlimit:100000"
           id="line2d_11">
          <g
             style="stroke-linecap:butt;stroke-linejoin:round;stroke-miterlimit:100000"
             id="g123">
            <use
               height="100%"
               width="100%"
               id="use121"
               y="575.09998"
               xlink:href="#ma610be6e60"
               x="600.08624"
               style="stroke:#000000;stroke-width:0.5;stroke-linecap:butt;stroke-linejoin:round;stroke-miterlimit:100000" />
          </g>
        </g>
        <g
           style="stroke-linecap:butt;stroke-linejoin:round;stroke-miterlimit:100000"
           id="line2d_12">
          <g
             style="stroke-linecap:butt;stroke-linejoin:round;stroke-miterlimit:100000"
             id="g128">
            <use
               height="100%"
               width="100%"
               id="use126"
               y="63.900002"
               xlink:href="#m50bd928941"
               x="600.08624"
               style="stroke:#000000;stroke-width:0.5;stroke-linecap:butt;stroke-linejoin:round;stroke-miterlimit:100000" />
          </g>
        </g>
        <g
           style="stroke-linecap:butt;stroke-linejoin:round;stroke-miterlimit:100000"
           id="text_3">
          <!-- 0 -->
          <g
             style="stroke-linecap:butt;stroke-linejoin:round;stroke-miterlimit:100000"
             id="g133"
             transform="matrix(0.12,0,0,-0.12,596.26875,588.21812)">
            <use
               height="100%"
               width="100%"
               y="0"
               x="0"
               style="stroke-linecap:butt;stroke-linejoin:round;stroke-miterlimit:100000"
               id="use131"
               xlink:href="#BitstreamVeraSans-Roman-30" />
          </g>
        </g>
      </g>
      <g
         style="stroke-linecap:butt;stroke-linejoin:round;stroke-miterlimit:100000"
         id="xtick_4">
        <g
           style="stroke-linecap:butt;stroke-linejoin:round;stroke-miterlimit:100000"
           id="line2d_13">
          <g
             style="stroke-linecap:butt;stroke-linejoin:round;stroke-miterlimit:100000"
             id="g139">
            <use
               height="100%"
               width="100%"
               id="use137"
               y="575.09998"
               xlink:href="#ma610be6e60"
               x="685.28625"
               style="stroke:#000000;stroke-width:0.5;stroke-linecap:butt;stroke-linejoin:round;stroke-miterlimit:100000" />
          </g>
        </g>
        <g
           style="stroke-linecap:butt;stroke-linejoin:round;stroke-miterlimit:100000"
           id="line2d_14">
          <g
             style="stroke-linecap:butt;stroke-linejoin:round;stroke-miterlimit:100000"
             id="g144">
            <use
               height="100%"
               width="100%"
               id="use142"
               y="63.900002"
               xlink:href="#m50bd928941"
               x="685.28625"
               style="stroke:#000000;stroke-width:0.5;stroke-linecap:butt;stroke-linejoin:round;stroke-miterlimit:100000" />
          </g>
        </g>
        <g
           style="stroke-linecap:butt;stroke-linejoin:round;stroke-miterlimit:100000"
           id="text_4">
          <!-- 100 -->
          <g
             style="stroke-linecap:butt;stroke-linejoin:round;stroke-miterlimit:100000"
             id="g153"
             transform="matrix(0.12,0,0,-0.12,673.83375,588.21812)">
            <use
               height="100%"
               width="100%"
               y="0"
               x="0"
               style="stroke-linecap:butt;stroke-linejoin:round;stroke-miterlimit:100000"
               id="use147"
               xlink:href="#BitstreamVeraSans-Roman-31" />
            <use
               height="100%"
               width="100%"
               y="0"
               style="stroke-linecap:butt;stroke-linejoin:round;stroke-miterlimit:100000"
               id="use149"
               xlink:href="#BitstreamVeraSans-Roman-30"
               x="63.623047" />
            <use
               height="100%"
               width="100%"
               y="0"
               style="stroke-linecap:butt;stroke-linejoin:round;stroke-miterlimit:100000"
               id="use151"
               xlink:href="#BitstreamVeraSans-Roman-30"
               x="127.24609" />
          </g>
        </g>
      </g>
      <g
         style="stroke-linecap:butt;stroke-linejoin:round;stroke-miterlimit:100000"
         id="xtick_5">
        <g
           style="stroke-linecap:butt;stroke-linejoin:round;stroke-miterlimit:100000"
           id="line2d_15">
          <g
             style="stroke-linecap:butt;stroke-linejoin:round;stroke-miterlimit:100000"
             id="g159">
            <use
               height="100%"
               width="100%"
               id="use157"
               y="575.09998"
               xlink:href="#ma610be6e60"
               x="770.48627"
               style="stroke:#000000;stroke-width:0.5;stroke-linecap:butt;stroke-linejoin:round;stroke-miterlimit:100000" />
          </g>
        </g>
        <g
           style="stroke-linecap:butt;stroke-linejoin:round;stroke-miterlimit:100000"
           id="line2d_16">
          <g
             style="stroke-linecap:butt;stroke-linejoin:round;stroke-miterlimit:100000"
             id="g164">
            <use
               height="100%"
               width="100%"
               id="use162"
               y="63.900002"
               xlink:href="#m50bd928941"
               x="770.48627"
               style="stroke:#000000;stroke-width:0.5;stroke-linecap:butt;stroke-linejoin:round;stroke-miterlimit:100000" />
          </g>
        </g>
        <g
           style="stroke-linecap:butt;stroke-linejoin:round;stroke-miterlimit:100000"
           id="text_5">
          <!-- 200 -->
          <g
             style="stroke-linecap:butt;stroke-linejoin:round;stroke-miterlimit:100000"
             id="g173"
             transform="matrix(0.12,0,0,-0.12,759.03375,588.21812)">
            <use
               height="100%"
               width="100%"
               y="0"
               x="0"
               style="stroke-linecap:butt;stroke-linejoin:round;stroke-miterlimit:100000"
               id="use167"
               xlink:href="#BitstreamVeraSans-Roman-32" />
            <use
               height="100%"
               width="100%"
               y="0"
               style="stroke-linecap:butt;stroke-linejoin:round;stroke-miterlimit:100000"
               id="use169"
               xlink:href="#BitstreamVeraSans-Roman-30"
               x="63.623047" />
            <use
               height="100%"
               width="100%"
               y="0"
               style="stroke-linecap:butt;stroke-linejoin:round;stroke-miterlimit:100000"
               id="use171"
               xlink:href="#BitstreamVeraSans-Roman-30"
               x="127.24609" />
          </g>
        </g>
      </g>
      <g
         style="stroke-linecap:butt;stroke-linejoin:round;stroke-miterlimit:100000"
         id="text_6">
        <!-- x (m) -->
        <defs
           id="defs182">
          <path
             style="stroke-linecap:butt;stroke-linejoin:round;stroke-miterlimit:100000"
             inkscape:connector-curvature="0"
             id="BitstreamVeraSans-Roman-29"
             d="m 8.015625,75.875 h 7.8125 q 7.3125,-11.515625 10.953125,-22.5625 3.640625,-11.03125 3.640625,-21.921875 0,-10.9375 -3.640625,-22.015625 -3.640625,-11.078125 -10.953125,-22.5625 h -7.8125 Q 14.5,-2 17.703125,9.0625 20.90625,20.125 20.90625,31.390625 q 0,11.28125 -3.203125,22.265625 -3.203125,11 -9.6875,22.21875" />
          <path
             style="stroke-linecap:butt;stroke-linejoin:round;stroke-miterlimit:100000"
             inkscape:connector-curvature="0"
             d=""
             id="BitstreamVeraSans-Roman-20" />
          <path
             style="stroke-linecap:butt;stroke-linejoin:round;stroke-miterlimit:100000"
             inkscape:connector-curvature="0"
             id="BitstreamVeraSans-Roman-6d"
             d="M 52,44.1875 Q 55.375,50.25 60.0625,53.125 64.75,56 71.09375,56 q 8.546875,0 13.1875,-5.984375 4.640625,-5.96875 4.640625,-17 V 0 h -9.03125 v 32.71875 q 0,7.859375 -2.796875,11.65625 -2.78125,3.8125 -8.484375,3.8125 -6.984375,0 -11.046875,-4.640625 -4.046875,-4.625 -4.046875,-12.640625 V 0 h -9.03125 v 32.71875 q 0,7.90625 -2.78125,11.6875 -2.78125,3.78125 -8.59375,3.78125 -6.890625,0 -10.953125,-4.65625 -4.046875,-4.65625 -4.046875,-12.625 V 0 h -9.03125 v 54.6875 h 9.03125 v -8.5 q 3.078125,5.03125 7.375,7.421875 Q 29.78125,56 35.6875,56 41.65625,56 45.828125,52.96875 50,49.953125 52,44.1875" />
          <path
             style="stroke-linecap:butt;stroke-linejoin:round;stroke-miterlimit:100000"
             inkscape:connector-curvature="0"
             id="BitstreamVeraSans-Roman-78"
             d="M 54.890625,54.6875 35.109375,28.078125 55.90625,0 H 45.3125 L 29.390625,21.484375 13.484375,0 H 2.875 L 24.125,28.609375 4.6875,54.6875 h 10.59375 l 14.5,-19.484375 14.5,19.484375 z" />
          <path
             style="stroke-linecap:butt;stroke-linejoin:round;stroke-miterlimit:100000"
             inkscape:connector-curvature="0"
             id="BitstreamVeraSans-Roman-28"
             d="M 31,75.875 Q 24.46875,64.65625 21.28125,53.65625 18.109375,42.671875 18.109375,31.390625 18.109375,20.125 21.3125,9.0625 24.515625,-2 31,-13.1875 H 23.1875 Q 15.875,-1.703125 12.234375,9.375 8.59375,20.453125 8.59375,31.390625 q 0,10.890625 3.609375,21.921875 3.625,11.046875 10.984375,22.5625 z" />
        </defs>
        <g
           style="stroke-linecap:butt;stroke-linejoin:round;stroke-miterlimit:100000"
           id="g194"
           transform="matrix(0.12,0,0,-0.12,584.10188,604.83187)">
          <use
             height="100%"
             width="100%"
             y="0"
             x="0"
             style="stroke-linecap:butt;stroke-linejoin:round;stroke-miterlimit:100000"
             id="use184"
             xlink:href="#BitstreamVeraSans-Roman-78" />
          <use
             height="100%"
             width="100%"
             y="0"
             style="stroke-linecap:butt;stroke-linejoin:round;stroke-miterlimit:100000"
             id="use186"
             xlink:href="#BitstreamVeraSans-Roman-20"
             x="59.179688" />
          <use
             height="100%"
             width="100%"
             y="0"
             style="stroke-linecap:butt;stroke-linejoin:round;stroke-miterlimit:100000"
             id="use188"
             xlink:href="#BitstreamVeraSans-Roman-28"
             x="90.966797" />
          <use
             height="100%"
             width="100%"
             y="0"
             style="stroke-linecap:butt;stroke-linejoin:round;stroke-miterlimit:100000"
             id="use190"
             xlink:href="#BitstreamVeraSans-Roman-6d"
             x="129.98047" />
          <use
             height="100%"
             width="100%"
             y="0"
             style="stroke-linecap:butt;stroke-linejoin:round;stroke-miterlimit:100000"
             id="use192"
             xlink:href="#BitstreamVeraSans-Roman-29"
             x="227.39258" />
        </g>
      </g>
    </g>
    <g
       style="stroke-linecap:butt;stroke-linejoin:round;stroke-miterlimit:100000"
       id="matplotlib.axis_2">
      <g
         style="stroke-linecap:butt;stroke-linejoin:round;stroke-miterlimit:100000"
         id="ytick_1">
        <g
           style="stroke-linecap:butt;stroke-linejoin:round;stroke-miterlimit:100000"
           id="line2d_17">
          <defs
             id="defs199">
            <path
               inkscape:connector-curvature="0"
               style="stroke:#000000;stroke-width:0.5;stroke-linecap:butt;stroke-linejoin:round;stroke-miterlimit:100000"
               id="m9ce1e167d3"
               d="M 0,0 H 4" />
          </defs>
          <g
             style="stroke-linecap:butt;stroke-linejoin:round;stroke-miterlimit:100000"
             id="g203">
            <use
               height="100%"
               width="100%"
               id="use201"
               y="575.09998"
               xlink:href="#m9ce1e167d3"
               x="387.08624"
               style="stroke:#000000;stroke-width:0.5;stroke-linecap:butt;stroke-linejoin:round;stroke-miterlimit:100000" />
          </g>
        </g>
        <g
           style="stroke-linecap:butt;stroke-linejoin:round;stroke-miterlimit:100000"
           id="line2d_18">
          <defs
             id="defs207">
            <path
               inkscape:connector-curvature="0"
               style="stroke:#000000;stroke-width:0.5;stroke-linecap:butt;stroke-linejoin:round;stroke-miterlimit:100000"
               id="m2b4034a784"
               d="M 0,0 H -4" />
          </defs>
          <g
             style="stroke-linecap:butt;stroke-linejoin:round;stroke-miterlimit:100000"
             id="g211">
            <use
               height="100%"
               width="100%"
               id="use209"
               y="575.09998"
               xlink:href="#m2b4034a784"
               x="813.08624"
               style="stroke:#000000;stroke-width:0.5;stroke-linecap:butt;stroke-linejoin:round;stroke-miterlimit:100000" />
          </g>
        </g>
        <g
           style="stroke-linecap:butt;stroke-linejoin:round;stroke-miterlimit:100000"
           id="text_7">
          <!-- −200 -->
          <g
             style="stroke-linecap:butt;stroke-linejoin:round;stroke-miterlimit:100000"
             id="g222"
             transform="matrix(0.12,0,0,-0.12,350.12563,578.41125)">
            <use
               height="100%"
               width="100%"
               y="0"
               x="0"
               style="stroke-linecap:butt;stroke-linejoin:round;stroke-miterlimit:100000"
               id="use214"
               xlink:href="#BitstreamVeraSans-Roman-2212" />
            <use
               height="100%"
               width="100%"
               y="0"
               style="stroke-linecap:butt;stroke-linejoin:round;stroke-miterlimit:100000"
               id="use216"
               xlink:href="#BitstreamVeraSans-Roman-32"
               x="83.789062" />
            <use
               height="100%"
               width="100%"
               y="0"
               style="stroke-linecap:butt;stroke-linejoin:round;stroke-miterlimit:100000"
               id="use218"
               xlink:href="#BitstreamVeraSans-Roman-30"
               x="147.41211" />
            <use
               height="100%"
               width="100%"
               y="0"
               style="stroke-linecap:butt;stroke-linejoin:round;stroke-miterlimit:100000"
               id="use220"
               xlink:href="#BitstreamVeraSans-Roman-30"
               x="211.03516" />
          </g>
        </g>
      </g>
      <g
         style="stroke-linecap:butt;stroke-linejoin:round;stroke-miterlimit:100000"
         id="ytick_2">
        <g
           style="stroke-linecap:butt;stroke-linejoin:round;stroke-miterlimit:100000"
           id="line2d_19">
          <g
             style="stroke-linecap:butt;stroke-linejoin:round;stroke-miterlimit:100000"
             id="g228">
            <use
               height="100%"
               width="100%"
               id="use226"
               y="489.89999"
               xlink:href="#m9ce1e167d3"
               x="387.08624"
               style="stroke:#000000;stroke-width:0.5;stroke-linecap:butt;stroke-linejoin:round;stroke-miterlimit:100000" />
          </g>
        </g>
        <g
           style="stroke-linecap:butt;stroke-linejoin:round;stroke-miterlimit:100000"
           id="line2d_20">
          <g
             style="stroke-linecap:butt;stroke-linejoin:round;stroke-miterlimit:100000"
             id="g233">
            <use
               height="100%"
               width="100%"
               id="use231"
               y="489.89999"
               xlink:href="#m2b4034a784"
               x="813.08624"
               style="stroke:#000000;stroke-width:0.5;stroke-linecap:butt;stroke-linejoin:round;stroke-miterlimit:100000" />
          </g>
        </g>
        <g
           style="stroke-linecap:butt;stroke-linejoin:round;stroke-miterlimit:100000"
           id="text_8">
          <!-- −100 -->
          <g
             style="stroke-linecap:butt;stroke-linejoin:round;stroke-miterlimit:100000"
             id="g244"
             transform="matrix(0.12,0,0,-0.12,350.12563,493.21125)">
            <use
               height="100%"
               width="100%"
               y="0"
               x="0"
               style="stroke-linecap:butt;stroke-linejoin:round;stroke-miterlimit:100000"
               id="use236"
               xlink:href="#BitstreamVeraSans-Roman-2212" />
            <use
               height="100%"
               width="100%"
               y="0"
               style="stroke-linecap:butt;stroke-linejoin:round;stroke-miterlimit:100000"
               id="use238"
               xlink:href="#BitstreamVeraSans-Roman-31"
               x="83.789062" />
            <use
               height="100%"
               width="100%"
               y="0"
               style="stroke-linecap:butt;stroke-linejoin:round;stroke-miterlimit:100000"
               id="use240"
               xlink:href="#BitstreamVeraSans-Roman-30"
               x="147.41211" />
            <use
               height="100%"
               width="100%"
               y="0"
               style="stroke-linecap:butt;stroke-linejoin:round;stroke-miterlimit:100000"
               id="use242"
               xlink:href="#BitstreamVeraSans-Roman-30"
               x="211.03516" />
          </g>
        </g>
      </g>
      <g
         style="stroke-linecap:butt;stroke-linejoin:round;stroke-miterlimit:100000"
         id="ytick_3">
        <g
           style="stroke-linecap:butt;stroke-linejoin:round;stroke-miterlimit:100000"
           id="line2d_21">
          <g
             style="stroke-linecap:butt;stroke-linejoin:round;stroke-miterlimit:100000"
             id="g250">
            <use
               height="100%"
               width="100%"
               id="use248"
               y="404.70001"
               xlink:href="#m9ce1e167d3"
               x="387.08624"
               style="stroke:#000000;stroke-width:0.5;stroke-linecap:butt;stroke-linejoin:round;stroke-miterlimit:100000" />
          </g>
        </g>
        <g
           style="stroke-linecap:butt;stroke-linejoin:round;stroke-miterlimit:100000"
           id="line2d_22">
          <g
             style="stroke-linecap:butt;stroke-linejoin:round;stroke-miterlimit:100000"
             id="g255">
            <use
               height="100%"
               width="100%"
               id="use253"
               y="404.70001"
               xlink:href="#m2b4034a784"
               x="813.08624"
               style="stroke:#000000;stroke-width:0.5;stroke-linecap:butt;stroke-linejoin:round;stroke-miterlimit:100000" />
          </g>
        </g>
        <g
           style="stroke-linecap:butt;stroke-linejoin:round;stroke-miterlimit:100000"
           id="text_9">
          <!-- 0 -->
          <g
             style="stroke-linecap:butt;stroke-linejoin:round;stroke-miterlimit:100000"
             id="g260"
             transform="matrix(0.12,0,0,-0.12,375.45125,408.01125)">
            <use
               height="100%"
               width="100%"
               y="0"
               x="0"
               style="stroke-linecap:butt;stroke-linejoin:round;stroke-miterlimit:100000"
               id="use258"
               xlink:href="#BitstreamVeraSans-Roman-30" />
          </g>
        </g>
      </g>
      <g
         style="stroke-linecap:butt;stroke-linejoin:round;stroke-miterlimit:100000"
         id="ytick_4">
        <g
           style="stroke-linecap:butt;stroke-linejoin:round;stroke-miterlimit:100000"
           id="line2d_23">
          <g
             style="stroke-linecap:butt;stroke-linejoin:round;stroke-miterlimit:100000"
             id="g266">
            <use
               height="100%"
               width="100%"
               id="use264"
               y="319.5"
               xlink:href="#m9ce1e167d3"
               x="387.08624"
               style="stroke:#000000;stroke-width:0.5;stroke-linecap:butt;stroke-linejoin:round;stroke-miterlimit:100000" />
          </g>
        </g>
        <g
           style="stroke-linecap:butt;stroke-linejoin:round;stroke-miterlimit:100000"
           id="line2d_24">
          <g
             style="stroke-linecap:butt;stroke-linejoin:round;stroke-miterlimit:100000"
             id="g271">
            <use
               height="100%"
               width="100%"
               id="use269"
               y="319.5"
               xlink:href="#m2b4034a784"
               x="813.08624"
               style="stroke:#000000;stroke-width:0.5;stroke-linecap:butt;stroke-linejoin:round;stroke-miterlimit:100000" />
          </g>
        </g>
        <g
           style="stroke-linecap:butt;stroke-linejoin:round;stroke-miterlimit:100000"
           id="text_10">
          <!-- 100 -->
          <g
             style="stroke-linecap:butt;stroke-linejoin:round;stroke-miterlimit:100000"
             id="g280"
             transform="matrix(0.12,0,0,-0.12,360.18125,322.81125)">
            <use
               height="100%"
               width="100%"
               y="0"
               x="0"
               style="stroke-linecap:butt;stroke-linejoin:round;stroke-miterlimit:100000"
               id="use274"
               xlink:href="#BitstreamVeraSans-Roman-31" />
            <use
               height="100%"
               width="100%"
               y="0"
               style="stroke-linecap:butt;stroke-linejoin:round;stroke-miterlimit:100000"
               id="use276"
               xlink:href="#BitstreamVeraSans-Roman-30"
               x="63.623047" />
            <use
               height="100%"
               width="100%"
               y="0"
               style="stroke-linecap:butt;stroke-linejoin:round;stroke-miterlimit:100000"
               id="use278"
               xlink:href="#BitstreamVeraSans-Roman-30"
               x="127.24609" />
          </g>
        </g>
      </g>
      <g
         style="stroke-linecap:butt;stroke-linejoin:round;stroke-miterlimit:100000"
         id="ytick_5">
        <g
           style="stroke-linecap:butt;stroke-linejoin:round;stroke-miterlimit:100000"
           id="line2d_25">
          <g
             style="stroke-linecap:butt;stroke-linejoin:round;stroke-miterlimit:100000"
             id="g286">
            <use
               height="100%"
               width="100%"
               id="use284"
               y="234.3"
               xlink:href="#m9ce1e167d3"
               x="387.08624"
               style="stroke:#000000;stroke-width:0.5;stroke-linecap:butt;stroke-linejoin:round;stroke-miterlimit:100000" />
          </g>
        </g>
        <g
           style="stroke-linecap:butt;stroke-linejoin:round;stroke-miterlimit:100000"
           id="line2d_26">
          <g
             style="stroke-linecap:butt;stroke-linejoin:round;stroke-miterlimit:100000"
             id="g291">
            <use
               height="100%"
               width="100%"
               id="use289"
               y="234.3"
               xlink:href="#m2b4034a784"
               x="813.08624"
               style="stroke:#000000;stroke-width:0.5;stroke-linecap:butt;stroke-linejoin:round;stroke-miterlimit:100000" />
          </g>
        </g>
        <g
           style="stroke-linecap:butt;stroke-linejoin:round;stroke-miterlimit:100000"
           id="text_11">
          <!-- 200 -->
          <g
             style="stroke-linecap:butt;stroke-linejoin:round;stroke-miterlimit:100000"
             id="g300"
             transform="matrix(0.12,0,0,-0.12,360.18125,237.61125)">
            <use
               height="100%"
               width="100%"
               y="0"
               x="0"
               style="stroke-linecap:butt;stroke-linejoin:round;stroke-miterlimit:100000"
               id="use294"
               xlink:href="#BitstreamVeraSans-Roman-32" />
            <use
               height="100%"
               width="100%"
               y="0"
               style="stroke-linecap:butt;stroke-linejoin:round;stroke-miterlimit:100000"
               id="use296"
               xlink:href="#BitstreamVeraSans-Roman-30"
               x="63.623047" />
            <use
               height="100%"
               width="100%"
               y="0"
               style="stroke-linecap:butt;stroke-linejoin:round;stroke-miterlimit:100000"
               id="use298"
               xlink:href="#BitstreamVeraSans-Roman-30"
               x="127.24609" />
          </g>
        </g>
      </g>
      <g
         style="stroke-linecap:butt;stroke-linejoin:round;stroke-miterlimit:100000"
         id="ytick_6">
        <g
           style="stroke-linecap:butt;stroke-linejoin:round;stroke-miterlimit:100000"
           id="line2d_27">
          <g
             style="stroke-linecap:butt;stroke-linejoin:round;stroke-miterlimit:100000"
             id="g306">
            <use
               height="100%"
               width="100%"
               id="use304"
               y="149.10001"
               xlink:href="#m9ce1e167d3"
               x="387.08624"
               style="stroke:#000000;stroke-width:0.5;stroke-linecap:butt;stroke-linejoin:round;stroke-miterlimit:100000" />
          </g>
        </g>
        <g
           style="stroke-linecap:butt;stroke-linejoin:round;stroke-miterlimit:100000"
           id="line2d_28">
          <g
             style="stroke-linecap:butt;stroke-linejoin:round;stroke-miterlimit:100000"
             id="g311">
            <use
               height="100%"
               width="100%"
               id="use309"
               y="149.10001"
               xlink:href="#m2b4034a784"
               x="813.08624"
               style="stroke:#000000;stroke-width:0.5;stroke-linecap:butt;stroke-linejoin:round;stroke-miterlimit:100000" />
          </g>
        </g>
        <g
           style="stroke-linecap:butt;stroke-linejoin:round;stroke-miterlimit:100000"
           id="text_12">
          <!-- 300 -->
          <defs
             id="defs315">
            <path
               style="stroke-linecap:butt;stroke-linejoin:round;stroke-miterlimit:100000"
               inkscape:connector-curvature="0"
               id="BitstreamVeraSans-Roman-33"
               d="M 40.578125,39.3125 Q 47.65625,37.796875 51.625,33 q 3.984375,-4.78125 3.984375,-11.8125 0,-10.78125 -7.421875,-16.703125 -7.421875,-5.90625 -21.09375,-5.90625 -4.578125,0 -9.4375,0.90625 -4.859375,0.90625 -10.03125,2.71875 v 9.515625 q 4.09375,-2.390625 8.96875,-3.609375 4.890625,-1.21875 10.21875,-1.21875 9.265625,0 14.125,3.65625 4.859375,3.65625 4.859375,10.640625 0,6.453125 -4.515625,10.078125 -4.515625,3.640625 -12.5625,3.640625 h -8.5 v 8.109375 h 8.890625 q 7.265625,0 11.125,2.90625 3.859375,2.90625 3.859375,8.375 0,5.609375 -3.984375,8.609375 -3.96875,3.015625 -11.390625,3.015625 -4.0625,0 -8.703125,-0.890625 Q 15.375,64.15625 9.8125,62.3125 v 8.78125 q 5.625,1.5625 10.53125,2.34375 4.90625,0.78125 9.25,0.78125 11.234375,0 17.765625,-5.109375 6.546875,-5.09375 6.546875,-13.78125 0,-6.0625 -3.46875,-10.234375 -3.46875,-4.171875 -9.859375,-5.78125" />
          </defs>
          <g
             style="stroke-linecap:butt;stroke-linejoin:round;stroke-miterlimit:100000"
             id="g323"
             transform="matrix(0.12,0,0,-0.12,360.18125,152.41125)">
            <use
               height="100%"
               width="100%"
               y="0"
               x="0"
               style="stroke-linecap:butt;stroke-linejoin:round;stroke-miterlimit:100000"
               id="use317"
               xlink:href="#BitstreamVeraSans-Roman-33" />
            <use
               height="100%"
               width="100%"
               y="0"
               style="stroke-linecap:butt;stroke-linejoin:round;stroke-miterlimit:100000"
               id="use319"
               xlink:href="#BitstreamVeraSans-Roman-30"
               x="63.623047" />
            <use
               height="100%"
               width="100%"
               y="0"
               style="stroke-linecap:butt;stroke-linejoin:round;stroke-miterlimit:100000"
               id="use321"
               xlink:href="#BitstreamVeraSans-Roman-30"
               x="127.24609" />
          </g>
        </g>
      </g>
      <g
         style="stroke-linecap:butt;stroke-linejoin:round;stroke-miterlimit:100000"
         id="ytick_7">
        <g
           style="stroke-linecap:butt;stroke-linejoin:round;stroke-miterlimit:100000"
           id="line2d_29">
          <g
             style="stroke-linecap:butt;stroke-linejoin:round;stroke-miterlimit:100000"
             id="g329">
            <use
               height="100%"
               width="100%"
               id="use327"
               y="63.900002"
               xlink:href="#m9ce1e167d3"
               x="387.08624"
               style="stroke:#000000;stroke-width:0.5;stroke-linecap:butt;stroke-linejoin:round;stroke-miterlimit:100000" />
          </g>
        </g>
        <g
           style="stroke-linecap:butt;stroke-linejoin:round;stroke-miterlimit:100000"
           id="line2d_30">
          <g
             style="stroke-linecap:butt;stroke-linejoin:round;stroke-miterlimit:100000"
             id="g334">
            <use
               height="100%"
               width="100%"
               id="use332"
               y="63.900002"
               xlink:href="#m2b4034a784"
               x="813.08624"
               style="stroke:#000000;stroke-width:0.5;stroke-linecap:butt;stroke-linejoin:round;stroke-miterlimit:100000" />
          </g>
        </g>
        <g
           style="stroke-linecap:butt;stroke-linejoin:round;stroke-miterlimit:100000"
           id="text_13">
          <!-- 400 -->
          <defs
             id="defs338">
            <path
               style="stroke-linecap:butt;stroke-linejoin:round;stroke-miterlimit:100000"
               inkscape:connector-curvature="0"
               id="BitstreamVeraSans-Roman-34"
               d="M 37.796875,64.3125 12.890625,25.390625 h 24.90625 z m -2.59375,8.59375 h 12.40625 V 25.390625 h 10.40625 V 17.1875 H 47.609375 V 0 h -9.8125 V 17.1875 H 4.890625 v 9.515625 z" />
          </defs>
          <g
             style="stroke-linecap:butt;stroke-linejoin:round;stroke-miterlimit:100000"
             id="g346"
             transform="matrix(0.12,0,0,-0.12,360.18125,67.21125)">
            <use
               height="100%"
               width="100%"
               y="0"
               x="0"
               style="stroke-linecap:butt;stroke-linejoin:round;stroke-miterlimit:100000"
               id="use340"
               xlink:href="#BitstreamVeraSans-Roman-34" />
            <use
               height="100%"
               width="100%"
               y="0"
               style="stroke-linecap:butt;stroke-linejoin:round;stroke-miterlimit:100000"
               id="use342"
               xlink:href="#BitstreamVeraSans-Roman-30"
               x="63.623047" />
            <use
               height="100%"
               width="100%"
               y="0"
               style="stroke-linecap:butt;stroke-linejoin:round;stroke-miterlimit:100000"
               id="use344"
               xlink:href="#BitstreamVeraSans-Roman-30"
               x="127.24609" />
          </g>
        </g>
      </g>
      <g
         style="stroke-linecap:butt;stroke-linejoin:round;stroke-miterlimit:100000"
         id="text_14">
        <!-- z (m) -->
        <defs
           id="defs351">
          <path
             style="stroke-linecap:butt;stroke-linejoin:round;stroke-miterlimit:100000"
             inkscape:connector-curvature="0"
             id="BitstreamVeraSans-Roman-7a"
             d="M 5.515625,54.6875 H 48.1875 V 46.484375 L 14.40625,7.171875 H 48.1875 V 0 H 4.296875 v 8.203125 l 33.796875,39.3125 H 5.515625 Z" />
        </defs>
        <g
           style="stroke-linecap:butt;stroke-linejoin:round;stroke-miterlimit:100000"
           id="g363"
           transform="matrix(0,-0.12,-0.12,0,342.63,335.08219)">
          <use
             height="100%"
             width="100%"
             y="0"
             x="0"
             style="stroke-linecap:butt;stroke-linejoin:round;stroke-miterlimit:100000"
             id="use353"
             xlink:href="#BitstreamVeraSans-Roman-7a" />
          <use
             height="100%"
             width="100%"
             y="0"
             style="stroke-linecap:butt;stroke-linejoin:round;stroke-miterlimit:100000"
             id="use355"
             xlink:href="#BitstreamVeraSans-Roman-20"
             x="52.490234" />
          <use
             height="100%"
             width="100%"
             y="0"
             style="stroke-linecap:butt;stroke-linejoin:round;stroke-miterlimit:100000"
             id="use357"
             xlink:href="#BitstreamVeraSans-Roman-28"
             x="84.277344" />
          <use
             height="100%"
             width="100%"
             y="0"
             style="stroke-linecap:butt;stroke-linejoin:round;stroke-miterlimit:100000"
             id="use359"
             xlink:href="#BitstreamVeraSans-Roman-6d"
             x="123.29102" />
          <use
             height="100%"
             width="100%"
             y="0"
             style="stroke-linecap:butt;stroke-linejoin:round;stroke-miterlimit:100000"
             id="use361"
             xlink:href="#BitstreamVeraSans-Roman-29"
             x="220.70312" />
        </g>
      </g>
    </g>
    <g
       style="stroke-linecap:butt;stroke-linejoin:round;stroke-miterlimit:100000"
       id="legend_1">
      <g
         style="stroke-linecap:butt;stroke-linejoin:round;stroke-miterlimit:100000"
         id="patch_7">
        <path
           inkscape:connector-curvature="0"
           id="path367"
           style="fill:#ffffff;stroke:#000000;stroke-linecap:butt;stroke-linejoin:miter;stroke-miterlimit:100000"
           d="M 496.5135,142.1865 H 678.08625 V 73.656 H 496.5135 Z" />
      </g>
      <g
         style="stroke-linecap:butt;stroke-linejoin:round;stroke-miterlimit:100000"
         id="line2d_31">
        <path
           inkscape:connector-curvature="0"
           id="path370"
           style="fill:none;stroke:#ff0000;stroke-width:1.5;stroke-linecap:square;stroke-linejoin:round;stroke-miterlimit:100000"
           d="m 506.5935,85.31775 h 20.16" />
      </g>
      <g
         style="stroke-linecap:butt;stroke-linejoin:round;stroke-miterlimit:100000"
         id="line2d_32" />
      <g
         style="stroke-linecap:butt;stroke-linejoin:round;stroke-miterlimit:100000"
         id="text_15">
        <!-- ground truth -->
        <defs
           id="defs382">
          <path
             style="stroke-linecap:butt;stroke-linejoin:round;stroke-miterlimit:100000"
             inkscape:connector-curvature="0"
             id="BitstreamVeraSans-Roman-6e"
             d="M 54.890625,33.015625 V 0 H 45.90625 v 32.71875 q 0,7.765625 -3.03125,11.609375 -3.03125,3.859375 -9.078125,3.859375 -7.28125,0 -11.484375,-4.640625 -4.203125,-4.625 -4.203125,-12.640625 V 0 h -9.03125 v 54.6875 h 9.03125 v -8.5 q 3.234375,4.9375 7.59375,7.375 4.375,2.4375 10.09375,2.4375 9.421875,0 14.25,-5.828125 4.84375,-5.828125 4.84375,-17.15625" />
          <path
             style="stroke-linecap:butt;stroke-linejoin:round;stroke-miterlimit:100000"
             inkscape:connector-curvature="0"
             id="BitstreamVeraSans-Roman-6f"
             d="m 30.609375,48.390625 q -7.21875,0 -11.421875,-5.640625 -4.203125,-5.640625 -4.203125,-15.453125 0,-9.8125 4.171875,-15.453125 4.1875,-5.640625 11.453125,-5.640625 7.1875,0 11.375,5.65625 4.203125,5.671875 4.203125,15.4375 0,9.71875 -4.203125,15.40625 -4.1875,5.6875 -11.375,5.6875 m 0,7.609375 q 11.71875,0 18.40625,-7.625 6.703125,-7.609375 6.703125,-21.078125 0,-13.421875 -6.703125,-21.078125 -6.6875,-7.640625 -18.40625,-7.640625 -11.765625,0 -18.4375,7.640625 -6.65625,7.65625 -6.65625,21.078125 0,13.46875 6.65625,21.078125 Q 18.84375,56 30.609375,56" />
          <path
             style="stroke-linecap:butt;stroke-linejoin:round;stroke-miterlimit:100000"
             inkscape:connector-curvature="0"
             id="BitstreamVeraSans-Roman-68"
             d="M 54.890625,33.015625 V 0 H 45.90625 v 32.71875 q 0,7.765625 -3.03125,11.609375 -3.03125,3.859375 -9.078125,3.859375 -7.28125,0 -11.484375,-4.640625 -4.203125,-4.625 -4.203125,-12.640625 V 0 h -9.03125 v 75.984375 h 9.03125 V 46.1875 q 3.234375,4.9375 7.59375,7.375 4.375,2.4375 10.09375,2.4375 9.421875,0 14.25,-5.828125 4.84375,-5.828125 4.84375,-17.15625" />
          <path
             style="stroke-linecap:butt;stroke-linejoin:round;stroke-miterlimit:100000"
             inkscape:connector-curvature="0"
             id="BitstreamVeraSans-Roman-64"
             d="m 45.40625,46.390625 v 29.59375 h 8.984375 V 0 H 45.40625 v 8.203125 q -2.828125,-4.875 -7.15625,-7.25 -4.3125,-2.375 -10.375,-2.375 -9.90625,0 -16.140625,7.90625 -6.21875,7.921875 -6.21875,20.8125 0,12.890625 6.21875,20.796875 Q 17.96875,56 27.875,56 q 6.0625,0 10.375,-2.375 4.328125,-2.359375 7.15625,-7.234375 M 14.796875,27.296875 q 0,-9.90625 4.078125,-15.546875 4.078125,-5.640625 11.203125,-5.640625 7.125,0 11.21875,5.640625 4.109375,5.640625 4.109375,15.546875 0,9.90625 -4.109375,15.546875 -4.09375,5.640625 -11.21875,5.640625 -7.125,0 -11.203125,-5.640625 -4.078125,-5.640625 -4.078125,-15.546875" />
          <path
             style="stroke-linecap:butt;stroke-linejoin:round;stroke-miterlimit:100000"
             inkscape:connector-curvature="0"
             id="BitstreamVeraSans-Roman-67"
             d="m 45.40625,27.984375 q 0,9.765625 -4.03125,15.125 -4.015625,5.375 -11.296875,5.375 -7.21875,0 -11.25,-5.375 -4.03125,-5.359375 -4.03125,-15.125 0,-9.71875 4.03125,-15.09375 4.03125,-5.375 11.25,-5.375 7.28125,0 11.296875,5.375 4.03125,5.375 4.03125,15.09375 M 54.390625,6.78125 q 0,-13.953125 -6.203125,-20.765625 -6.1875,-6.8125 -18.984375,-6.8125 -4.734375,0 -8.9375,0.703125 -4.203125,0.703125 -8.15625,2.171875 V -9.1875 q 3.953125,-2.140625 7.8125,-3.15625 3.859375,-1.03125 7.859375,-1.03125 8.84375,0 13.234375,4.609375 4.390625,4.609375 4.390625,13.9375 V 9.625 Q 42.625,4.78125 38.28125,2.390625 33.9375,0 27.875,0 17.828125,0 11.671875,7.65625 q -6.15625,7.671875 -6.15625,20.328125 0,12.6875 6.15625,20.34375 Q 17.828125,56 27.875,56 q 6.0625,0 10.40625,-2.390625 4.34375,-2.390625 7.125,-7.21875 V 54.6875 h 8.984375 z" />
          <path
             style="stroke-linecap:butt;stroke-linejoin:round;stroke-miterlimit:100000"
             inkscape:connector-curvature="0"
             id="BitstreamVeraSans-Roman-75"
             d="M 8.5,21.578125 V 54.6875 h 8.984375 V 21.921875 q 0,-7.765625 3.015625,-11.65625 3.03125,-3.875 9.09375,-3.875 7.265625,0 11.484375,4.640625 4.234375,4.640625 4.234375,12.65625 v 31 h 8.984375 V 0 H 45.3125 V 8.40625 Q 42.046875,3.421875 37.71875,1 33.40625,-1.421875 27.6875,-1.421875 18.265625,-1.421875 13.375,4.4375 8.5,10.296875 8.5,21.578125" />
          <path
             style="stroke-linecap:butt;stroke-linejoin:round;stroke-miterlimit:100000"
             inkscape:connector-curvature="0"
             id="BitstreamVeraSans-Roman-72"
             d="m 41.109375,46.296875 q -1.515625,0.875 -3.296875,1.28125 Q 36.03125,48 33.890625,48 26.265625,48 22.1875,43.046875 18.109375,38.09375 18.109375,28.8125 V 0 h -9.03125 v 54.6875 h 9.03125 v -8.5 q 2.84375,4.984375 7.375,7.390625 Q 30.03125,56 36.53125,56 q 0.921875,0 2.046875,-0.125 1.125,-0.109375 2.484375,-0.359375 z" />
          <path
             style="stroke-linecap:butt;stroke-linejoin:round;stroke-miterlimit:100000"
             inkscape:connector-curvature="0"
             id="BitstreamVeraSans-Roman-74"
             d="M 18.3125,70.21875 V 54.6875 h 18.5 v -6.984375 h -18.5 v -29.6875 q 0,-6.6875 1.828125,-8.59375 1.828125,-1.90625 7.453125,-1.90625 H 36.8125 V 0 H 27.59375 Q 17.1875,0 13.234375,3.875 9.28125,7.765625 9.28125,18.015625 v 29.6875 H 2.6875 V 54.6875 h 6.59375 v 15.53125 z" />
        </defs>
        <g
           style="stroke-linecap:butt;stroke-linejoin:round;stroke-miterlimit:100000"
           id="g408"
           transform="matrix(0.144,0,0,-0.144,542.5935,90.35775)">
          <use
             height="100%"
             width="100%"
             y="0"
             x="0"
             style="stroke-linecap:butt;stroke-linejoin:round;stroke-miterlimit:100000"
             id="use384"
             xlink:href="#BitstreamVeraSans-Roman-67" />
          <use
             height="100%"
             width="100%"
             y="0"
             style="stroke-linecap:butt;stroke-linejoin:round;stroke-miterlimit:100000"
             id="use386"
             xlink:href="#BitstreamVeraSans-Roman-72"
             x="63.476562" />
          <use
             height="100%"
             width="100%"
             y="0"
             style="stroke-linecap:butt;stroke-linejoin:round;stroke-miterlimit:100000"
             id="use388"
             xlink:href="#BitstreamVeraSans-Roman-6f"
             x="104.55859" />
          <use
             height="100%"
             width="100%"
             y="0"
             style="stroke-linecap:butt;stroke-linejoin:round;stroke-miterlimit:100000"
             id="use390"
             xlink:href="#BitstreamVeraSans-Roman-75"
             x="165.74023" />
          <use
             height="100%"
             width="100%"
             y="0"
             style="stroke-linecap:butt;stroke-linejoin:round;stroke-miterlimit:100000"
             id="use392"
             xlink:href="#BitstreamVeraSans-Roman-6e"
             x="229.11914" />
          <use
             height="100%"
             width="100%"
             y="0"
             style="stroke-linecap:butt;stroke-linejoin:round;stroke-miterlimit:100000"
             id="use394"
             xlink:href="#BitstreamVeraSans-Roman-64"
             x="292.49805" />
          <use
             height="100%"
             width="100%"
             y="0"
             style="stroke-linecap:butt;stroke-linejoin:round;stroke-miterlimit:100000"
             id="use396"
             xlink:href="#BitstreamVeraSans-Roman-20"
             x="355.97461" />
          <use
             height="100%"
             width="100%"
             y="0"
             style="stroke-linecap:butt;stroke-linejoin:round;stroke-miterlimit:100000"
             id="use398"
             xlink:href="#BitstreamVeraSans-Roman-74"
             x="387.76172" />
          <use
             height="100%"
             width="100%"
             y="0"
             style="stroke-linecap:butt;stroke-linejoin:round;stroke-miterlimit:100000"
             id="use400"
             xlink:href="#BitstreamVeraSans-Roman-72"
             x="426.9707" />
          <use
             height="100%"
             width="100%"
             y="0"
             style="stroke-linecap:butt;stroke-linejoin:round;stroke-miterlimit:100000"
             id="use402"
             xlink:href="#BitstreamVeraSans-Roman-75"
             x="468.08398" />
          <use
             height="100%"
             width="100%"
             y="0"
             style="stroke-linecap:butt;stroke-linejoin:round;stroke-miterlimit:100000"
             id="use404"
             xlink:href="#BitstreamVeraSans-Roman-74"
             x="531.46289" />
          <use
             height="100%"
             width="100%"
             y="0"
             style="stroke-linecap:butt;stroke-linejoin:round;stroke-miterlimit:100000"
             id="use406"
             xlink:href="#BitstreamVeraSans-Roman-68"
             x="570.67188" />
        </g>
      </g>
      <g
         style="stroke-linecap:butt;stroke-linejoin:round;stroke-miterlimit:100000"
         id="line2d_33">
        <path
           inkscape:connector-curvature="0"
           id="path411"
           style="fill:none;stroke:#0072bd;stroke-width:1.5;stroke-linecap:square;stroke-linejoin:round;stroke-miterlimit:100000"
           d="m 506.5935,106.45425 h 20.16" />
      </g>
      <g
         style="stroke-linecap:butt;stroke-linejoin:round;stroke-miterlimit:100000"
         id="line2d_34" />
      <g
         style="stroke-linecap:butt;stroke-linejoin:round;stroke-miterlimit:100000"
         id="text_16">
        <!-- fast_anms_ldb.log -->
        <defs
           id="defs422">
          <path
             style="stroke-linecap:butt;stroke-linejoin:round;stroke-miterlimit:100000"
             inkscape:connector-curvature="0"
             id="BitstreamVeraSans-Roman-5f"
             d="m 50.984375,-16.609375 v -6.96875 h -51.96875 v 6.96875 z" />
          <path
             style="stroke-linecap:butt;stroke-linejoin:round;stroke-miterlimit:100000"
             inkscape:connector-curvature="0"
             id="BitstreamVeraSans-Roman-6c"
             d="M 9.421875,75.984375 H 18.40625 V 0 H 9.421875 Z" />
          <path
             style="stroke-linecap:butt;stroke-linejoin:round;stroke-miterlimit:100000"
             inkscape:connector-curvature="0"
             id="BitstreamVeraSans-Roman-2e"
             d="M 10.6875,12.40625 H 21 V 0 H 10.6875 Z" />
          <path
             style="stroke-linecap:butt;stroke-linejoin:round;stroke-miterlimit:100000"
             inkscape:connector-curvature="0"
             id="BitstreamVeraSans-Roman-66"
             d="M 37.109375,75.984375 V 68.5 h -8.59375 q -4.828125,0 -6.71875,-1.953125 -1.875,-1.953125 -1.875,-7.03125 V 54.6875 H 34.71875 V 47.703125 H 19.921875 V 0 h -9.03125 V 47.703125 H 2.296875 V 54.6875 h 8.59375 V 58.5 q 0,9.125 4.25,13.296875 4.25,4.1875 13.46875,4.1875 z" />
          <path
             style="stroke-linecap:butt;stroke-linejoin:round;stroke-miterlimit:100000"
             inkscape:connector-curvature="0"
             id="BitstreamVeraSans-Roman-61"
             d="m 34.28125,27.484375 q -10.890625,0 -15.09375,-2.484375 -4.203125,-2.484375 -4.203125,-8.5 0,-4.78125 3.15625,-7.59375 3.15625,-2.796875 8.5625,-2.796875 7.484375,0 12,5.296875 4.515625,5.296875 4.515625,14.078125 v 2 z m 17.921875,3.71875 V 0 H 43.21875 v 8.296875 q -3.078125,-4.96875 -7.671875,-7.34375 -4.59375,-2.375 -11.234375,-2.375 -8.390625,0 -13.359375,4.71875 Q 6,8.015625 6,15.921875 q 0,9.21875 6.171875,13.90625 6.1875,4.6875 18.4375,4.6875 H 43.21875 v 0.890625 q 0,6.203125 -4.078125,9.59375 -4.078125,3.390625 -11.453125,3.390625 -4.6875,0 -9.140625,-1.125 -4.4375,-1.125 -8.53125,-3.375 v 8.3125 q 4.921875,1.90625 9.5625,2.84375 Q 24.21875,56 28.609375,56 q 11.875,0 17.734375,-6.15625 5.859375,-6.140625 5.859375,-18.640625" />
          <path
             style="stroke-linecap:butt;stroke-linejoin:round;stroke-miterlimit:100000"
             inkscape:connector-curvature="0"
             id="BitstreamVeraSans-Roman-73"
             d="m 44.28125,53.078125 v -8.5 Q 40.484375,46.53125 36.375,47.5 q -4.09375,0.984375 -8.5,0.984375 -6.6875,0 -10.03125,-2.046875 Q 14.5,44.390625 14.5,40.28125 q 0,-3.125 2.390625,-4.90625 2.390625,-1.78125 9.625,-3.390625 l 3.078125,-0.6875 Q 39.15625,29.25 43.1875,25.515625 47.21875,21.78125 47.21875,15.09375 q 0,-7.625 -6.03125,-12.078125 -6.03125,-4.4375 -16.578125,-4.4375 -4.390625,0 -9.15625,0.859375 Q 10.6875,0.296875 5.421875,2 v 9.28125 q 4.984375,-2.59375 9.8125,-3.890625 4.828125,-1.28125 9.578125,-1.28125 6.34375,0 9.75,2.171875 3.421875,2.171875 3.421875,6.125 0,3.65625 -2.46875,5.609375 -2.453125,1.953125 -10.8125,3.765625 l -3.125,0.734375 q -8.34375,1.75 -12.0625,5.390625 -3.703125,3.640625 -3.703125,9.984375 0,7.71875 5.46875,11.90625 Q 16.75,56 26.8125,56 q 4.96875,0 9.359375,-0.734375 4.40625,-0.71875 8.109375,-2.1875" />
          <path
             style="stroke-linecap:butt;stroke-linejoin:round;stroke-miterlimit:100000"
             inkscape:connector-curvature="0"
             id="BitstreamVeraSans-Roman-62"
             d="m 48.6875,27.296875 q 0,9.90625 -4.078125,15.546875 -4.078125,5.640625 -11.203125,5.640625 -7.140625,0 -11.21875,-5.640625 -4.078125,-5.640625 -4.078125,-15.546875 0,-9.90625 4.078125,-15.546875 4.078125,-5.640625 11.21875,-5.640625 7.125,0 11.203125,5.640625 4.078125,5.640625 4.078125,15.546875 m -30.578125,19.09375 q 2.84375,4.875 7.15625,7.234375 Q 29.59375,56 35.59375,56 q 9.96875,0 16.1875,-7.90625 6.234375,-7.90625 6.234375,-20.796875 0,-12.890625 -6.234375,-20.8125 -6.21875,-7.90625 -16.1875,-7.90625 -6,0 -10.328125,2.375 -4.3125,2.375 -7.15625,7.25 V 0 h -9.03125 v 75.984375 h 9.03125 z" />
        </defs>
        <g
           style="stroke-linecap:butt;stroke-linejoin:round;stroke-miterlimit:100000"
           id="g458"
           transform="matrix(0.144,0,0,-0.144,542.5935,111.49425)">
          <use
             height="100%"
             width="100%"
             y="0"
             x="0"
             style="stroke-linecap:butt;stroke-linejoin:round;stroke-miterlimit:100000"
             id="use424"
             xlink:href="#BitstreamVeraSans-Roman-66" />
          <use
             height="100%"
             width="100%"
             y="0"
             style="stroke-linecap:butt;stroke-linejoin:round;stroke-miterlimit:100000"
             id="use426"
             xlink:href="#BitstreamVeraSans-Roman-61"
             x="35.205078" />
          <use
             height="100%"
             width="100%"
             y="0"
             style="stroke-linecap:butt;stroke-linejoin:round;stroke-miterlimit:100000"
             id="use428"
             xlink:href="#BitstreamVeraSans-Roman-73"
             x="96.484375" />
          <use
             height="100%"
             width="100%"
             y="0"
             style="stroke-linecap:butt;stroke-linejoin:round;stroke-miterlimit:100000"
             id="use430"
             xlink:href="#BitstreamVeraSans-Roman-74"
             x="148.58398" />
          <use
             height="100%"
             width="100%"
             y="0"
             style="stroke-linecap:butt;stroke-linejoin:round;stroke-miterlimit:100000"
             id="use432"
             xlink:href="#BitstreamVeraSans-Roman-5f"
             x="187.79297" />
          <use
             height="100%"
             width="100%"
             y="0"
             style="stroke-linecap:butt;stroke-linejoin:round;stroke-miterlimit:100000"
             id="use434"
             xlink:href="#BitstreamVeraSans-Roman-61"
             x="237.79297" />
          <use
             height="100%"
             width="100%"
             y="0"
             style="stroke-linecap:butt;stroke-linejoin:round;stroke-miterlimit:100000"
             id="use436"
             xlink:href="#BitstreamVeraSans-Roman-6e"
             x="299.07227" />
          <use
             height="100%"
             width="100%"
             y="0"
             style="stroke-linecap:butt;stroke-linejoin:round;stroke-miterlimit:100000"
             id="use438"
             xlink:href="#BitstreamVeraSans-Roman-6d"
             x="362.45117" />
          <use
             height="100%"
             width="100%"
             y="0"
             style="stroke-linecap:butt;stroke-linejoin:round;stroke-miterlimit:100000"
             id="use440"
             xlink:href="#BitstreamVeraSans-Roman-73"
             x="459.86328" />
          <use
             height="100%"
             width="100%"
             y="0"
             style="stroke-linecap:butt;stroke-linejoin:round;stroke-miterlimit:100000"
             id="use442"
             xlink:href="#BitstreamVeraSans-Roman-5f"
             x="511.96289" />
          <use
             height="100%"
             width="100%"
             y="0"
             style="stroke-linecap:butt;stroke-linejoin:round;stroke-miterlimit:100000"
             id="use444"
             xlink:href="#BitstreamVeraSans-Roman-6c"
             x="561.96289" />
          <use
             height="100%"
             width="100%"
             y="0"
             style="stroke-linecap:butt;stroke-linejoin:round;stroke-miterlimit:100000"
             id="use446"
             xlink:href="#BitstreamVeraSans-Roman-64"
             x="589.74609" />
          <use
             height="100%"
             width="100%"
             y="0"
             style="stroke-linecap:butt;stroke-linejoin:round;stroke-miterlimit:100000"
             id="use448"
             xlink:href="#BitstreamVeraSans-Roman-62"
             x="653.22266" />
        </g>
      </g>
      <g
         style="stroke-linecap:butt;stroke-linejoin:round;stroke-miterlimit:100000"
         id="line2d_35">
        <path
           inkscape:connector-curvature="0"
           id="path461"
           style="fill:none;stroke:#d95319;stroke-width:1.5;stroke-linecap:square;stroke-linejoin:round;stroke-miterlimit:100000"
           d="m 506.5935,127.99125 h 20.16" />
      </g>
      <g
         style="stroke-linecap:butt;stroke-linejoin:round;stroke-miterlimit:100000"
         id="line2d_36" />
      <g
         style="stroke-linecap:butt;stroke-linejoin:round;stroke-miterlimit:100000"
         id="text_17">
        <!-- gftt_brisk.log -->
        <defs
           id="defs467">
          <path
             style="stroke-linecap:butt;stroke-linejoin:round;stroke-miterlimit:100000"
             inkscape:connector-curvature="0"
             id="BitstreamVeraSans-Roman-69"
             d="M 9.421875,54.6875 H 18.40625 V 0 H 9.421875 Z m 0,21.296875 H 18.40625 V 64.59375 H 9.421875 Z" />
          <path
             style="stroke-linecap:butt;stroke-linejoin:round;stroke-miterlimit:100000"
             inkscape:connector-curvature="0"
             id="BitstreamVeraSans-Roman-6b"
             d="m 9.078125,75.984375 h 9.03125 v -44.875 l 26.8125,23.578125 h 11.46875 l -29,-25.578125 L 57.625,0 H 45.90625 L 18.109375,26.703125 V 0 h -9.03125 z" />
        </defs>
        <g
           style="stroke-linecap:butt;stroke-linejoin:round;stroke-miterlimit:100000"
           id="g497"
           transform="matrix(0.144,0,0,-0.144,542.5935,133.03125)">
          <use
             height="100%"
             width="100%"
             y="0"
             x="0"
             style="stroke-linecap:butt;stroke-linejoin:round;stroke-miterlimit:100000"
             id="use469"
             xlink:href="#BitstreamVeraSans-Roman-67" />
          <use
             height="100%"
             width="100%"
             y="0"
             style="stroke-linecap:butt;stroke-linejoin:round;stroke-miterlimit:100000"
             id="use471"
             xlink:href="#BitstreamVeraSans-Roman-66"
             x="63.476562" />
          <use
             height="100%"
             width="100%"
             y="0"
             style="stroke-linecap:butt;stroke-linejoin:round;stroke-miterlimit:100000"
             id="use473"
             xlink:href="#BitstreamVeraSans-Roman-74"
             x="98.666016" />
          <use
             height="100%"
             width="100%"
             y="0"
             style="stroke-linecap:butt;stroke-linejoin:round;stroke-miterlimit:100000"
             id="use475"
             xlink:href="#BitstreamVeraSans-Roman-74"
             x="137.875" />
          <use
             height="100%"
             width="100%"
             y="0"
             style="stroke-linecap:butt;stroke-linejoin:round;stroke-miterlimit:100000"
             id="use477"
             xlink:href="#BitstreamVeraSans-Roman-5f"
             x="177.08398" />
          <use
             height="100%"
             width="100%"
             y="0"
             style="stroke-linecap:butt;stroke-linejoin:round;stroke-miterlimit:100000"
             id="use479"
             xlink:href="#BitstreamVeraSans-Roman-62"
             x="227.08398" />
          <use
             height="100%"
             width="100%"
             y="0"
             style="stroke-linecap:butt;stroke-linejoin:round;stroke-miterlimit:100000"
             id="use481"
             xlink:href="#BitstreamVeraSans-Roman-72"
             x="290.56055" />
          <use
             height="100%"
             width="100%"
             y="0"
             style="stroke-linecap:butt;stroke-linejoin:round;stroke-miterlimit:100000"
             id="use483"
             xlink:href="#BitstreamVeraSans-Roman-69"
             x="331.67383" />
          <use
             height="100%"
             width="100%"
             y="0"
             style="stroke-linecap:butt;stroke-linejoin:round;stroke-miterlimit:100000"
             id="use485"
             xlink:href="#BitstreamVeraSans-Roman-73"
             x="359.45703" />
          <use
             height="100%"
             width="100%"
             y="0"
             style="stroke-linecap:butt;stroke-linejoin:round;stroke-miterlimit:100000"
             id="use487"
             xlink:href="#BitstreamVeraSans-Roman-6b"
             x="411.55664" />
        </g>
      </g>
    </g>
  </g>
  <defs
     id="defs506">
    <clipPath
       id="pb80181bbb1">
      <rect
         height="511.20000000000005"
         width="426.00000000000006"
         x="387.08625"
         y="63.89999999999998"
         id="rect503" />
    </clipPath>
  </defs>
</svg>
