<?xml version="1.0" encoding="UTF-8" standalone="no"?>
<!-- Created with matplotlib (http://matplotlib.org/) -->

<svg
   xmlns:dc="http://purl.org/dc/elements/1.1/"
   xmlns:cc="http://creativecommons.org/ns#"
   xmlns:rdf="http://www.w3.org/1999/02/22-rdf-syntax-ns#"
   xmlns:svg="http://www.w3.org/2000/svg"
   xmlns="http://www.w3.org/2000/svg"
   xmlns:xlink="http://www.w3.org/1999/xlink"
   xmlns:sodipodi="http://sodipodi.sourceforge.net/DTD/sodipodi-0.dtd"
   xmlns:inkscape="http://www.inkscape.org/namespaces/inkscape"
   height="639pt"
   version="1.1"
   viewBox="0 0 1170 639"
   width="1170pt"
   id="svg543"
   sodipodi:docname="kitti_04.svg"
   inkscape:version="0.92.3 (unknown)">
  <metadata
     id="metadata547">
    <rdf:RDF>
      <cc:Work
         rdf:about="">
        <dc:format>image/svg+xml</dc:format>
        <dc:type
           rdf:resource="http://purl.org/dc/dcmitype/StillImage" />
      </cc:Work>
    </rdf:RDF>
  </metadata>
  <sodipodi:namedview
     pagecolor="#ffffff"
     bordercolor="#666666"
     borderopacity="1"
     objecttolerance="10"
     gridtolerance="10"
     guidetolerance="10"
     inkscape:pageopacity="0"
     inkscape:pageshadow="2"
     inkscape:window-width="1301"
     inkscape:window-height="744"
     id="namedview545"
     showgrid="false"
     inkscape:zoom="0.37051282"
     inkscape:cx="865.12732"
     inkscape:cy="318.08698"
     inkscape:window-x="65"
     inkscape:window-y="24"
     inkscape:window-maximized="1"
     inkscape:current-layer="svg543" />
  <defs
     id="defs4">
    <style
       type="text/css"
       id="style2">
*{stroke-linecap:butt;stroke-linejoin:round;stroke-miterlimit:100000;}
  </style>
  </defs>
  <g
     style="stroke-linecap:butt;stroke-linejoin:round;stroke-miterlimit:100000"
     id="axes_1">
    <g
       style="stroke-linecap:butt;stroke-linejoin:round;stroke-miterlimit:100000"
       id="patch_2">
      <path
         inkscape:connector-curvature="0"
         id="path9"
         style="fill:#ffffff;stroke-linecap:butt;stroke-linejoin:round;stroke-miterlimit:100000"
         d="m 421.16625,575.1 h 357.84 V 63.9 h -357.84 z" />
    </g>
    <g
       style="stroke-linecap:butt;stroke-linejoin:round;stroke-miterlimit:100000"
       id="line2d_1">
      <path
         inkscape:connector-curvature="0"
         id="path12"
         style="fill:none;stroke:#ff0000;stroke-width:1.5;stroke-linecap:square;stroke-linejoin:round;stroke-miterlimit:100000"
         d="m 574.52625,575.1 -0.0359,-73.55123 -0.28654,-35.04892 -0.14383,-17.79323 -0.0556,-34.5149 0.2198,-40.89395 -0.0658,-57.63893 0.21476,-47.52084 0.0994,-52.76719 -0.27725,-42.64441 v 0"
         clip-path="url(#p14174e07d0)" />
    </g>
    <g
       style="stroke-linecap:butt;stroke-linejoin:round;stroke-miterlimit:100000"
       id="line2d_2">
      <path
         inkscape:connector-curvature="0"
         id="path15"
         style="fill:none;stroke:#ff0000;stroke-linecap:square;stroke-linejoin:round;stroke-miterlimit:100000"
         d="M 574.52625,575.1"
         clip-path="url(#p14174e07d0)" />
      <defs
         id="defs18">
        <path
           inkscape:connector-curvature="0"
           style="stroke:#000000;stroke-width:0.5;stroke-linecap:butt;stroke-linejoin:miter;stroke-miterlimit:100000"
           id="m4932b4793d"
           d="M 0,4 4,-4 H -4 Z" />
      </defs>
      <g
         style="stroke-linecap:butt;stroke-linejoin:round;stroke-miterlimit:100000"
         id="g22"
         clip-path="url(#p14174e07d0)">
        <use
           height="100%"
           width="100%"
           id="use20"
           y="575.09998"
           xlink:href="#m4932b4793d"
           x="574.52625"
           style="fill:#ff0000;stroke:#000000;stroke-width:0.5;stroke-linecap:butt;stroke-linejoin:miter;stroke-miterlimit:100000" />
      </g>
    </g>
    <g
       style="stroke-linecap:butt;stroke-linejoin:round;stroke-miterlimit:100000"
       id="line2d_3">
      <path
         inkscape:connector-curvature="0"
         id="path25"
         style="fill:none;stroke:#0072bd;stroke-width:1.5;stroke-linecap:square;stroke-linejoin:round;stroke-miterlimit:100000"
         d="m 574.52625,575.1 -0.0532,-8.15554 -0.0805,-25.20709 -0.42886,-51.03588 -0.008,-7.06647 -0.26707,-33.24883 0.0295,-5.62963 0.0629,-13.99061 0.05,-16.59772 -0.29689,-154.19326 0.009,-9.93934 -0.0904,-18.34539 -0.0269,-6.58199 -0.0621,-6.70912 -0.0407,-6.57349 -0.0996,-11.52002 -0.21777,-31.21089 v 0"
         clip-path="url(#p14174e07d0)" />
    </g>
    <g
       style="stroke-linecap:butt;stroke-linejoin:round;stroke-miterlimit:100000"
       id="line2d_4">
      <path
         inkscape:connector-curvature="0"
         id="path28"
         style="fill:none;stroke:#0072bd;stroke-linecap:square;stroke-linejoin:round;stroke-miterlimit:100000"
         d="M 574.52625,575.1"
         clip-path="url(#p14174e07d0)" />
      <defs
         id="defs31">
        <path
           inkscape:connector-curvature="0"
           style="stroke:#000000;stroke-width:0.5;stroke-linecap:butt;stroke-linejoin:miter;stroke-miterlimit:100000"
           id="m8e3860e53a"
           d="M 0,4 4,-4 H -4 Z" />
      </defs>
      <g
         style="stroke-linecap:butt;stroke-linejoin:round;stroke-miterlimit:100000"
         id="g35"
         clip-path="url(#p14174e07d0)">
        <use
           height="100%"
           width="100%"
           id="use33"
           y="575.09998"
           xlink:href="#m8e3860e53a"
           x="574.52625"
           style="fill:#0072bd;stroke:#000000;stroke-width:0.5;stroke-linecap:butt;stroke-linejoin:miter;stroke-miterlimit:100000" />
      </g>
    </g>
    <g
       style="stroke-linecap:butt;stroke-linejoin:round;stroke-miterlimit:100000"
       id="line2d_5">
      <path
         inkscape:connector-curvature="0"
         id="path38"
         style="fill:none;stroke:#d95319;stroke-width:1.5;stroke-linecap:square;stroke-linejoin:round;stroke-miterlimit:100000"
         d="m 574.52625,575.1 -0.0492,-5.43703 -0.003,-5.47964 -0.0437,-9.71755 -0.0403,-11.32199 -0.3173,-45.06157 -0.06,-10.14342 -0.25891,-37.52989 0.11662,-37.38669 0.0272,-11.0255 0.0349,-7.18018 -0.17356,-45.69976 -0.0814,-142.21599 -0.11144,-11.47543 -0.20103,-26.64601 v 0"
         clip-path="url(#p14174e07d0)" />
    </g>
    <g
       style="stroke-linecap:butt;stroke-linejoin:round;stroke-miterlimit:100000"
       id="line2d_6">
      <path
         inkscape:connector-curvature="0"
         id="path41"
         style="fill:none;stroke:#d95319;stroke-linecap:square;stroke-linejoin:round;stroke-miterlimit:100000"
         d="M 574.52625,575.1"
         clip-path="url(#p14174e07d0)" />
      <defs
         id="defs44">
        <path
           inkscape:connector-curvature="0"
           style="stroke:#000000;stroke-width:0.5;stroke-linecap:butt;stroke-linejoin:miter;stroke-miterlimit:100000"
           id="m92da326264"
           d="M 0,4 4,-4 H -4 Z" />
      </defs>
      <g
         style="stroke-linecap:butt;stroke-linejoin:round;stroke-miterlimit:100000"
         id="g48"
         clip-path="url(#p14174e07d0)">
        <use
           height="100%"
           width="100%"
           id="use46"
           y="575.09998"
           xlink:href="#m92da326264"
           x="574.52625"
           style="fill:#d95319;stroke:#000000;stroke-width:0.5;stroke-linecap:butt;stroke-linejoin:miter;stroke-miterlimit:100000" />
      </g>
    </g>
    <g
       style="stroke-linecap:butt;stroke-linejoin:round;stroke-miterlimit:100000"
       id="patch_3">
      <path
         inkscape:connector-curvature="0"
         id="path51"
         style="fill:none;stroke:#000000;stroke-linecap:square;stroke-linejoin:miter;stroke-miterlimit:100000"
         d="m 421.16625,63.9 h 357.84" />
    </g>
    <g
       style="stroke-linecap:butt;stroke-linejoin:round;stroke-miterlimit:100000"
       id="patch_4">
      <path
         inkscape:connector-curvature="0"
         id="path54"
         style="fill:none;stroke:#000000;stroke-linecap:square;stroke-linejoin:miter;stroke-miterlimit:100000"
         d="M 779.00625,575.1 V 63.9" />
    </g>
    <g
       style="stroke-linecap:butt;stroke-linejoin:round;stroke-miterlimit:100000"
       id="patch_5">
      <path
         inkscape:connector-curvature="0"
         id="path57"
         style="fill:none;stroke:#000000;stroke-linecap:square;stroke-linejoin:miter;stroke-miterlimit:100000"
         d="m 421.16625,575.1 h 357.84" />
    </g>
    <g
       style="stroke-linecap:butt;stroke-linejoin:round;stroke-miterlimit:100000"
       id="patch_6">
      <path
         inkscape:connector-curvature="0"
         id="path60"
         style="fill:none;stroke:#000000;stroke-linecap:square;stroke-linejoin:miter;stroke-miterlimit:100000"
         d="M 421.16625,575.1 V 63.9" />
    </g>
    <g
       style="stroke-linecap:butt;stroke-linejoin:round;stroke-miterlimit:100000"
       id="matplotlib.axis_1">
      <g
         style="stroke-linecap:butt;stroke-linejoin:round;stroke-miterlimit:100000"
         id="xtick_1">
        <g
           style="stroke-linecap:butt;stroke-linejoin:round;stroke-miterlimit:100000"
           id="line2d_7">
          <defs
             id="defs64">
            <path
               inkscape:connector-curvature="0"
               style="stroke:#000000;stroke-width:0.5;stroke-linecap:butt;stroke-linejoin:round;stroke-miterlimit:100000"
               id="mea6fcfb60c"
               d="M 0,0 V -4" />
          </defs>
          <g
             style="stroke-linecap:butt;stroke-linejoin:round;stroke-miterlimit:100000"
             id="g68">
            <use
               height="100%"
               width="100%"
               id="use66"
               y="575.09998"
               xlink:href="#mea6fcfb60c"
               x="421.16626"
               style="stroke:#000000;stroke-width:0.5;stroke-linecap:butt;stroke-linejoin:round;stroke-miterlimit:100000" />
          </g>
        </g>
        <g
           style="stroke-linecap:butt;stroke-linejoin:round;stroke-miterlimit:100000"
           id="line2d_8">
          <defs
             id="defs72">
            <path
               inkscape:connector-curvature="0"
               style="stroke:#000000;stroke-width:0.5;stroke-linecap:butt;stroke-linejoin:round;stroke-miterlimit:100000"
               id="m82c6a1379b"
               d="M 0,0 V 4" />
          </defs>
          <g
             style="stroke-linecap:butt;stroke-linejoin:round;stroke-miterlimit:100000"
             id="g76">
            <use
               height="100%"
               width="100%"
               id="use74"
               y="63.900002"
               xlink:href="#m82c6a1379b"
               x="421.16626"
               style="stroke:#000000;stroke-width:0.5;stroke-linecap:butt;stroke-linejoin:round;stroke-miterlimit:100000" />
          </g>
        </g>
        <g
           style="stroke-linecap:butt;stroke-linejoin:round;stroke-miterlimit:100000"
           id="text_1">
          <!-- −150 -->
          <defs
             id="defs83">
            <path
               style="stroke-linecap:butt;stroke-linejoin:round;stroke-miterlimit:100000"
               inkscape:connector-curvature="0"
               id="BitstreamVeraSans-Roman-2212"
               d="M 10.59375,35.5 H 73.1875 V 27.203125 H 10.59375 Z" />
            <path
               style="stroke-linecap:butt;stroke-linejoin:round;stroke-miterlimit:100000"
               inkscape:connector-curvature="0"
               id="BitstreamVeraSans-Roman-30"
               d="m 31.78125,66.40625 q -7.609375,0 -11.453125,-7.5 Q 16.5,51.421875 16.5,36.375 q 0,-14.984375 3.828125,-22.484375 3.84375,-7.5 11.453125,-7.5 7.671875,0 11.5,7.5 3.84375,7.5 3.84375,22.484375 0,15.046875 -3.84375,22.53125 -3.828125,7.5 -11.5,7.5 m 0,7.8125 q 12.265625,0 18.734375,-9.703125 6.46875,-9.6875 6.46875,-28.140625 0,-18.40625 -6.46875,-28.109375 -6.46875,-9.6875 -18.734375,-9.6875 -12.25,0 -18.71875,9.6875 Q 6.59375,17.96875 6.59375,36.375 q 0,18.453125 6.46875,28.140625 6.46875,9.703125 18.71875,9.703125" />
            <path
               style="stroke-linecap:butt;stroke-linejoin:round;stroke-miterlimit:100000"
               inkscape:connector-curvature="0"
               id="BitstreamVeraSans-Roman-31"
               d="m 12.40625,8.296875 h 16.109375 v 55.625 L 10.984375,60.40625 v 8.984375 l 17.4375,3.515625 H 38.28125 V 8.296875 H 54.390625 V 0 H 12.40625 Z" />
            <path
               style="stroke-linecap:butt;stroke-linejoin:round;stroke-miterlimit:100000"
               inkscape:connector-curvature="0"
               id="BitstreamVeraSans-Roman-35"
               d="m 10.796875,72.90625 h 38.71875 v -8.3125 h -29.6875 V 46.734375 q 2.140625,0.734375 4.28125,1.09375 2.15625,0.359375 4.3125,0.359375 Q 40.625,48.1875 47.75,41.5 54.890625,34.8125 54.890625,23.390625 54.890625,11.625 47.5625,5.09375 40.234375,-1.421875 26.90625,-1.421875 q -4.59375,0 -9.359375,0.78125 -4.75,0.78125 -9.828125,2.34375 V 11.625 q 4.390625,-2.390625 9.078125,-3.5625 4.6875,-1.171875 9.90625,-1.171875 8.453125,0 13.375,4.4375 4.9375,4.4375 4.9375,12.0625 0,7.609375 -4.9375,12.046875 -4.921875,4.453125 -13.375,4.453125 -3.953125,0 -7.890625,-0.875 -3.921875,-0.875 -8.015625,-2.734375 z" />
          </defs>
          <g
             style="stroke-linecap:butt;stroke-linejoin:round;stroke-miterlimit:100000"
             id="g93"
             transform="matrix(0.12,0,0,-0.12,404.68594,588.21812)">
            <use
               height="100%"
               width="100%"
               y="0"
               x="0"
               style="stroke-linecap:butt;stroke-linejoin:round;stroke-miterlimit:100000"
               id="use85"
               xlink:href="#BitstreamVeraSans-Roman-2212" />
            <use
               height="100%"
               width="100%"
               y="0"
               style="stroke-linecap:butt;stroke-linejoin:round;stroke-miterlimit:100000"
               id="use87"
               xlink:href="#BitstreamVeraSans-Roman-31"
               x="83.789062" />
            <use
               height="100%"
               width="100%"
               y="0"
               style="stroke-linecap:butt;stroke-linejoin:round;stroke-miterlimit:100000"
               id="use89"
               xlink:href="#BitstreamVeraSans-Roman-35"
               x="147.41211" />
            <use
               height="100%"
               width="100%"
               y="0"
               style="stroke-linecap:butt;stroke-linejoin:round;stroke-miterlimit:100000"
               id="use91"
               xlink:href="#BitstreamVeraSans-Roman-30"
               x="211.03516" />
          </g>
        </g>
      </g>
      <g
         style="stroke-linecap:butt;stroke-linejoin:round;stroke-miterlimit:100000"
         id="xtick_2">
        <g
           style="stroke-linecap:butt;stroke-linejoin:round;stroke-miterlimit:100000"
           id="line2d_9">
          <g
             style="stroke-linecap:butt;stroke-linejoin:round;stroke-miterlimit:100000"
             id="g99">
            <use
               height="100%"
               width="100%"
               id="use97"
               y="575.09998"
               xlink:href="#mea6fcfb60c"
               x="472.28625"
               style="stroke:#000000;stroke-width:0.5;stroke-linecap:butt;stroke-linejoin:round;stroke-miterlimit:100000" />
          </g>
        </g>
        <g
           style="stroke-linecap:butt;stroke-linejoin:round;stroke-miterlimit:100000"
           id="line2d_10">
          <g
             style="stroke-linecap:butt;stroke-linejoin:round;stroke-miterlimit:100000"
             id="g104">
            <use
               height="100%"
               width="100%"
               id="use102"
               y="63.900002"
               xlink:href="#m82c6a1379b"
               x="472.28625"
               style="stroke:#000000;stroke-width:0.5;stroke-linecap:butt;stroke-linejoin:round;stroke-miterlimit:100000" />
          </g>
        </g>
        <g
           style="stroke-linecap:butt;stroke-linejoin:round;stroke-miterlimit:100000"
           id="text_2">
          <!-- −100 -->
          <g
             style="stroke-linecap:butt;stroke-linejoin:round;stroke-miterlimit:100000"
             id="g115"
             transform="matrix(0.12,0,0,-0.12,455.80594,588.21812)">
            <use
               height="100%"
               width="100%"
               y="0"
               x="0"
               style="stroke-linecap:butt;stroke-linejoin:round;stroke-miterlimit:100000"
               id="use107"
               xlink:href="#BitstreamVeraSans-Roman-2212" />
            <use
               height="100%"
               width="100%"
               y="0"
               style="stroke-linecap:butt;stroke-linejoin:round;stroke-miterlimit:100000"
               id="use109"
               xlink:href="#BitstreamVeraSans-Roman-31"
               x="83.789062" />
            <use
               height="100%"
               width="100%"
               y="0"
               style="stroke-linecap:butt;stroke-linejoin:round;stroke-miterlimit:100000"
               id="use111"
               xlink:href="#BitstreamVeraSans-Roman-30"
               x="147.41211" />
            <use
               height="100%"
               width="100%"
               y="0"
               style="stroke-linecap:butt;stroke-linejoin:round;stroke-miterlimit:100000"
               id="use113"
               xlink:href="#BitstreamVeraSans-Roman-30"
               x="211.03516" />
          </g>
        </g>
      </g>
      <g
         style="stroke-linecap:butt;stroke-linejoin:round;stroke-miterlimit:100000"
         id="xtick_3">
        <g
           style="stroke-linecap:butt;stroke-linejoin:round;stroke-miterlimit:100000"
           id="line2d_11">
          <g
             style="stroke-linecap:butt;stroke-linejoin:round;stroke-miterlimit:100000"
             id="g121">
            <use
               height="100%"
               width="100%"
               id="use119"
               y="575.09998"
               xlink:href="#mea6fcfb60c"
               x="523.40625"
               style="stroke:#000000;stroke-width:0.5;stroke-linecap:butt;stroke-linejoin:round;stroke-miterlimit:100000" />
          </g>
        </g>
        <g
           style="stroke-linecap:butt;stroke-linejoin:round;stroke-miterlimit:100000"
           id="line2d_12">
          <g
             style="stroke-linecap:butt;stroke-linejoin:round;stroke-miterlimit:100000"
             id="g126">
            <use
               height="100%"
               width="100%"
               id="use124"
               y="63.900002"
               xlink:href="#m82c6a1379b"
               x="523.40625"
               style="stroke:#000000;stroke-width:0.5;stroke-linecap:butt;stroke-linejoin:round;stroke-miterlimit:100000" />
          </g>
        </g>
        <g
           style="stroke-linecap:butt;stroke-linejoin:round;stroke-miterlimit:100000"
           id="text_3">
          <!-- −50 -->
          <g
             style="stroke-linecap:butt;stroke-linejoin:round;stroke-miterlimit:100000"
             id="g135"
             transform="matrix(0.12,0,0,-0.12,510.74344,588.21812)">
            <use
               height="100%"
               width="100%"
               y="0"
               x="0"
               style="stroke-linecap:butt;stroke-linejoin:round;stroke-miterlimit:100000"
               id="use129"
               xlink:href="#BitstreamVeraSans-Roman-2212" />
            <use
               height="100%"
               width="100%"
               y="0"
               style="stroke-linecap:butt;stroke-linejoin:round;stroke-miterlimit:100000"
               id="use131"
               xlink:href="#BitstreamVeraSans-Roman-35"
               x="83.789062" />
            <use
               height="100%"
               width="100%"
               y="0"
               style="stroke-linecap:butt;stroke-linejoin:round;stroke-miterlimit:100000"
               id="use133"
               xlink:href="#BitstreamVeraSans-Roman-30"
               x="147.41211" />
          </g>
        </g>
      </g>
      <g
         style="stroke-linecap:butt;stroke-linejoin:round;stroke-miterlimit:100000"
         id="xtick_4">
        <g
           style="stroke-linecap:butt;stroke-linejoin:round;stroke-miterlimit:100000"
           id="line2d_13">
          <g
             style="stroke-linecap:butt;stroke-linejoin:round;stroke-miterlimit:100000"
             id="g141">
            <use
               height="100%"
               width="100%"
               id="use139"
               y="575.09998"
               xlink:href="#mea6fcfb60c"
               x="574.52625"
               style="stroke:#000000;stroke-width:0.5;stroke-linecap:butt;stroke-linejoin:round;stroke-miterlimit:100000" />
          </g>
        </g>
        <g
           style="stroke-linecap:butt;stroke-linejoin:round;stroke-miterlimit:100000"
           id="line2d_14">
          <g
             style="stroke-linecap:butt;stroke-linejoin:round;stroke-miterlimit:100000"
             id="g146">
            <use
               height="100%"
               width="100%"
               id="use144"
               y="63.900002"
               xlink:href="#m82c6a1379b"
               x="574.52625"
               style="stroke:#000000;stroke-width:0.5;stroke-linecap:butt;stroke-linejoin:round;stroke-miterlimit:100000" />
          </g>
        </g>
        <g
           style="stroke-linecap:butt;stroke-linejoin:round;stroke-miterlimit:100000"
           id="text_4">
          <!-- 0 -->
          <g
             style="stroke-linecap:butt;stroke-linejoin:round;stroke-miterlimit:100000"
             id="g151"
             transform="matrix(0.12,0,0,-0.12,570.70875,588.21812)">
            <use
               height="100%"
               width="100%"
               y="0"
               x="0"
               style="stroke-linecap:butt;stroke-linejoin:round;stroke-miterlimit:100000"
               id="use149"
               xlink:href="#BitstreamVeraSans-Roman-30" />
          </g>
        </g>
      </g>
      <g
         style="stroke-linecap:butt;stroke-linejoin:round;stroke-miterlimit:100000"
         id="xtick_5">
        <g
           style="stroke-linecap:butt;stroke-linejoin:round;stroke-miterlimit:100000"
           id="line2d_15">
          <g
             style="stroke-linecap:butt;stroke-linejoin:round;stroke-miterlimit:100000"
             id="g157">
            <use
               height="100%"
               width="100%"
               id="use155"
               y="575.09998"
               xlink:href="#mea6fcfb60c"
               x="625.64624"
               style="stroke:#000000;stroke-width:0.5;stroke-linecap:butt;stroke-linejoin:round;stroke-miterlimit:100000" />
          </g>
        </g>
        <g
           style="stroke-linecap:butt;stroke-linejoin:round;stroke-miterlimit:100000"
           id="line2d_16">
          <g
             style="stroke-linecap:butt;stroke-linejoin:round;stroke-miterlimit:100000"
             id="g162">
            <use
               height="100%"
               width="100%"
               id="use160"
               y="63.900002"
               xlink:href="#m82c6a1379b"
               x="625.64624"
               style="stroke:#000000;stroke-width:0.5;stroke-linecap:butt;stroke-linejoin:round;stroke-miterlimit:100000" />
          </g>
        </g>
        <g
           style="stroke-linecap:butt;stroke-linejoin:round;stroke-miterlimit:100000"
           id="text_5">
          <!-- 50 -->
          <g
             style="stroke-linecap:butt;stroke-linejoin:round;stroke-miterlimit:100000"
             id="g169"
             transform="matrix(0.12,0,0,-0.12,618.01125,588.21812)">
            <use
               height="100%"
               width="100%"
               y="0"
               x="0"
               style="stroke-linecap:butt;stroke-linejoin:round;stroke-miterlimit:100000"
               id="use165"
               xlink:href="#BitstreamVeraSans-Roman-35" />
            <use
               height="100%"
               width="100%"
               y="0"
               style="stroke-linecap:butt;stroke-linejoin:round;stroke-miterlimit:100000"
               id="use167"
               xlink:href="#BitstreamVeraSans-Roman-30"
               x="63.623047" />
          </g>
        </g>
      </g>
      <g
         style="stroke-linecap:butt;stroke-linejoin:round;stroke-miterlimit:100000"
         id="xtick_6">
        <g
           style="stroke-linecap:butt;stroke-linejoin:round;stroke-miterlimit:100000"
           id="line2d_17">
          <g
             style="stroke-linecap:butt;stroke-linejoin:round;stroke-miterlimit:100000"
             id="g175">
            <use
               height="100%"
               width="100%"
               id="use173"
               y="575.09998"
               xlink:href="#mea6fcfb60c"
               x="676.76624"
               style="stroke:#000000;stroke-width:0.5;stroke-linecap:butt;stroke-linejoin:round;stroke-miterlimit:100000" />
          </g>
        </g>
        <g
           style="stroke-linecap:butt;stroke-linejoin:round;stroke-miterlimit:100000"
           id="line2d_18">
          <g
             style="stroke-linecap:butt;stroke-linejoin:round;stroke-miterlimit:100000"
             id="g180">
            <use
               height="100%"
               width="100%"
               id="use178"
               y="63.900002"
               xlink:href="#m82c6a1379b"
               x="676.76624"
               style="stroke:#000000;stroke-width:0.5;stroke-linecap:butt;stroke-linejoin:round;stroke-miterlimit:100000" />
          </g>
        </g>
        <g
           style="stroke-linecap:butt;stroke-linejoin:round;stroke-miterlimit:100000"
           id="text_6">
          <!-- 100 -->
          <g
             style="stroke-linecap:butt;stroke-linejoin:round;stroke-miterlimit:100000"
             id="g189"
             transform="matrix(0.12,0,0,-0.12,665.31375,588.21812)">
            <use
               height="100%"
               width="100%"
               y="0"
               x="0"
               style="stroke-linecap:butt;stroke-linejoin:round;stroke-miterlimit:100000"
               id="use183"
               xlink:href="#BitstreamVeraSans-Roman-31" />
            <use
               height="100%"
               width="100%"
               y="0"
               style="stroke-linecap:butt;stroke-linejoin:round;stroke-miterlimit:100000"
               id="use185"
               xlink:href="#BitstreamVeraSans-Roman-30"
               x="63.623047" />
            <use
               height="100%"
               width="100%"
               y="0"
               style="stroke-linecap:butt;stroke-linejoin:round;stroke-miterlimit:100000"
               id="use187"
               xlink:href="#BitstreamVeraSans-Roman-30"
               x="127.24609" />
          </g>
        </g>
      </g>
      <g
         style="stroke-linecap:butt;stroke-linejoin:round;stroke-miterlimit:100000"
         id="xtick_7">
        <g
           style="stroke-linecap:butt;stroke-linejoin:round;stroke-miterlimit:100000"
           id="line2d_19">
          <g
             style="stroke-linecap:butt;stroke-linejoin:round;stroke-miterlimit:100000"
             id="g195">
            <use
               height="100%"
               width="100%"
               id="use193"
               y="575.09998"
               xlink:href="#mea6fcfb60c"
               x="727.88623"
               style="stroke:#000000;stroke-width:0.5;stroke-linecap:butt;stroke-linejoin:round;stroke-miterlimit:100000" />
          </g>
        </g>
        <g
           style="stroke-linecap:butt;stroke-linejoin:round;stroke-miterlimit:100000"
           id="line2d_20">
          <g
             style="stroke-linecap:butt;stroke-linejoin:round;stroke-miterlimit:100000"
             id="g200">
            <use
               height="100%"
               width="100%"
               id="use198"
               y="63.900002"
               xlink:href="#m82c6a1379b"
               x="727.88623"
               style="stroke:#000000;stroke-width:0.5;stroke-linecap:butt;stroke-linejoin:round;stroke-miterlimit:100000" />
          </g>
        </g>
        <g
           style="stroke-linecap:butt;stroke-linejoin:round;stroke-miterlimit:100000"
           id="text_7">
          <!-- 150 -->
          <g
             style="stroke-linecap:butt;stroke-linejoin:round;stroke-miterlimit:100000"
             id="g209"
             transform="matrix(0.12,0,0,-0.12,716.43375,588.21812)">
            <use
               height="100%"
               width="100%"
               y="0"
               x="0"
               style="stroke-linecap:butt;stroke-linejoin:round;stroke-miterlimit:100000"
               id="use203"
               xlink:href="#BitstreamVeraSans-Roman-31" />
            <use
               height="100%"
               width="100%"
               y="0"
               style="stroke-linecap:butt;stroke-linejoin:round;stroke-miterlimit:100000"
               id="use205"
               xlink:href="#BitstreamVeraSans-Roman-35"
               x="63.623047" />
            <use
               height="100%"
               width="100%"
               y="0"
               style="stroke-linecap:butt;stroke-linejoin:round;stroke-miterlimit:100000"
               id="use207"
               xlink:href="#BitstreamVeraSans-Roman-30"
               x="127.24609" />
          </g>
        </g>
      </g>
      <g
         style="stroke-linecap:butt;stroke-linejoin:round;stroke-miterlimit:100000"
         id="xtick_8">
        <g
           style="stroke-linecap:butt;stroke-linejoin:round;stroke-miterlimit:100000"
           id="line2d_21">
          <g
             style="stroke-linecap:butt;stroke-linejoin:round;stroke-miterlimit:100000"
             id="g215">
            <use
               height="100%"
               width="100%"
               id="use213"
               y="575.09998"
               xlink:href="#mea6fcfb60c"
               x="779.00623"
               style="stroke:#000000;stroke-width:0.5;stroke-linecap:butt;stroke-linejoin:round;stroke-miterlimit:100000" />
          </g>
        </g>
        <g
           style="stroke-linecap:butt;stroke-linejoin:round;stroke-miterlimit:100000"
           id="line2d_22">
          <g
             style="stroke-linecap:butt;stroke-linejoin:round;stroke-miterlimit:100000"
             id="g220">
            <use
               height="100%"
               width="100%"
               id="use218"
               y="63.900002"
               xlink:href="#m82c6a1379b"
               x="779.00623"
               style="stroke:#000000;stroke-width:0.5;stroke-linecap:butt;stroke-linejoin:round;stroke-miterlimit:100000" />
          </g>
        </g>
        <g
           style="stroke-linecap:butt;stroke-linejoin:round;stroke-miterlimit:100000"
           id="text_8">
          <!-- 200 -->
          <defs
             id="defs224">
            <path
               style="stroke-linecap:butt;stroke-linejoin:round;stroke-miterlimit:100000"
               inkscape:connector-curvature="0"
               id="BitstreamVeraSans-Roman-32"
               d="M 19.1875,8.296875 H 53.609375 V 0 H 7.328125 v 8.296875 q 5.609375,5.8125 15.296875,15.59375 9.703125,9.796875 12.1875,12.640625 4.734375,5.3125 6.609375,9 1.890625,3.6875 1.890625,7.25 0,5.8125 -4.078125,9.46875 -4.078125,3.671875 -10.625,3.671875 -4.640625,0 -9.796875,-1.609375 -5.140625,-1.609375 -11,-4.890625 v 9.96875 Q 13.765625,71.78125 18.9375,73 q 5.1875,1.21875 9.484375,1.21875 11.328125,0 18.0625,-5.671875 6.734375,-5.65625 6.734375,-15.125 0,-4.5 -1.6875,-8.53125 Q 49.859375,40.875 45.40625,35.40625 44.1875,33.984375 37.640625,27.21875 31.109375,20.453125 19.1875,8.296875" />
          </defs>
          <g
             style="stroke-linecap:butt;stroke-linejoin:round;stroke-miterlimit:100000"
             id="g232"
             transform="matrix(0.12,0,0,-0.12,767.55375,588.21812)">
            <use
               height="100%"
               width="100%"
               y="0"
               x="0"
               style="stroke-linecap:butt;stroke-linejoin:round;stroke-miterlimit:100000"
               id="use226"
               xlink:href="#BitstreamVeraSans-Roman-32" />
            <use
               height="100%"
               width="100%"
               y="0"
               style="stroke-linecap:butt;stroke-linejoin:round;stroke-miterlimit:100000"
               id="use228"
               xlink:href="#BitstreamVeraSans-Roman-30"
               x="63.623047" />
            <use
               height="100%"
               width="100%"
               y="0"
               style="stroke-linecap:butt;stroke-linejoin:round;stroke-miterlimit:100000"
               id="use230"
               xlink:href="#BitstreamVeraSans-Roman-30"
               x="127.24609" />
          </g>
        </g>
      </g>
      <g
         style="stroke-linecap:butt;stroke-linejoin:round;stroke-miterlimit:100000"
         id="text_9">
        <!-- x (m) -->
        <defs
           id="defs241">
          <path
             style="stroke-linecap:butt;stroke-linejoin:round;stroke-miterlimit:100000"
             inkscape:connector-curvature="0"
             id="BitstreamVeraSans-Roman-29"
             d="m 8.015625,75.875 h 7.8125 q 7.3125,-11.515625 10.953125,-22.5625 3.640625,-11.03125 3.640625,-21.921875 0,-10.9375 -3.640625,-22.015625 -3.640625,-11.078125 -10.953125,-22.5625 h -7.8125 Q 14.5,-2 17.703125,9.0625 20.90625,20.125 20.90625,31.390625 q 0,11.28125 -3.203125,22.265625 -3.203125,11 -9.6875,22.21875" />
          <path
             style="stroke-linecap:butt;stroke-linejoin:round;stroke-miterlimit:100000"
             inkscape:connector-curvature="0"
             d=""
             id="BitstreamVeraSans-Roman-20" />
          <path
             style="stroke-linecap:butt;stroke-linejoin:round;stroke-miterlimit:100000"
             inkscape:connector-curvature="0"
             id="BitstreamVeraSans-Roman-6d"
             d="M 52,44.1875 Q 55.375,50.25 60.0625,53.125 64.75,56 71.09375,56 q 8.546875,0 13.1875,-5.984375 4.640625,-5.96875 4.640625,-17 V 0 h -9.03125 v 32.71875 q 0,7.859375 -2.796875,11.65625 -2.78125,3.8125 -8.484375,3.8125 -6.984375,0 -11.046875,-4.640625 -4.046875,-4.625 -4.046875,-12.640625 V 0 h -9.03125 v 32.71875 q 0,7.90625 -2.78125,11.6875 -2.78125,3.78125 -8.59375,3.78125 -6.890625,0 -10.953125,-4.65625 -4.046875,-4.65625 -4.046875,-12.625 V 0 h -9.03125 v 54.6875 h 9.03125 v -8.5 q 3.078125,5.03125 7.375,7.421875 Q 29.78125,56 35.6875,56 41.65625,56 45.828125,52.96875 50,49.953125 52,44.1875" />
          <path
             style="stroke-linecap:butt;stroke-linejoin:round;stroke-miterlimit:100000"
             inkscape:connector-curvature="0"
             id="BitstreamVeraSans-Roman-78"
             d="M 54.890625,54.6875 35.109375,28.078125 55.90625,0 H 45.3125 L 29.390625,21.484375 13.484375,0 H 2.875 L 24.125,28.609375 4.6875,54.6875 h 10.59375 l 14.5,-19.484375 14.5,19.484375 z" />
          <path
             style="stroke-linecap:butt;stroke-linejoin:round;stroke-miterlimit:100000"
             inkscape:connector-curvature="0"
             id="BitstreamVeraSans-Roman-28"
             d="M 31,75.875 Q 24.46875,64.65625 21.28125,53.65625 18.109375,42.671875 18.109375,31.390625 18.109375,20.125 21.3125,9.0625 24.515625,-2 31,-13.1875 H 23.1875 Q 15.875,-1.703125 12.234375,9.375 8.59375,20.453125 8.59375,31.390625 q 0,10.890625 3.609375,21.921875 3.625,11.046875 10.984375,22.5625 z" />
        </defs>
        <g
           style="stroke-linecap:butt;stroke-linejoin:round;stroke-miterlimit:100000"
           id="g253"
           transform="matrix(0.12,0,0,-0.12,584.10187,604.83187)">
          <use
             height="100%"
             width="100%"
             y="0"
             x="0"
             style="stroke-linecap:butt;stroke-linejoin:round;stroke-miterlimit:100000"
             id="use243"
             xlink:href="#BitstreamVeraSans-Roman-78" />
          <use
             height="100%"
             width="100%"
             y="0"
             style="stroke-linecap:butt;stroke-linejoin:round;stroke-miterlimit:100000"
             id="use245"
             xlink:href="#BitstreamVeraSans-Roman-20"
             x="59.179688" />
          <use
             height="100%"
             width="100%"
             y="0"
             style="stroke-linecap:butt;stroke-linejoin:round;stroke-miterlimit:100000"
             id="use247"
             xlink:href="#BitstreamVeraSans-Roman-28"
             x="90.966797" />
          <use
             height="100%"
             width="100%"
             y="0"
             style="stroke-linecap:butt;stroke-linejoin:round;stroke-miterlimit:100000"
             id="use249"
             xlink:href="#BitstreamVeraSans-Roman-6d"
             x="129.98047" />
          <use
             height="100%"
             width="100%"
             y="0"
             style="stroke-linecap:butt;stroke-linejoin:round;stroke-miterlimit:100000"
             id="use251"
             xlink:href="#BitstreamVeraSans-Roman-29"
             x="227.39258" />
        </g>
      </g>
    </g>
    <g
       style="stroke-linecap:butt;stroke-linejoin:round;stroke-miterlimit:100000"
       id="matplotlib.axis_2">
      <g
         style="stroke-linecap:butt;stroke-linejoin:round;stroke-miterlimit:100000"
         id="ytick_1">
        <g
           style="stroke-linecap:butt;stroke-linejoin:round;stroke-miterlimit:100000"
           id="line2d_23">
          <defs
             id="defs258">
            <path
               inkscape:connector-curvature="0"
               style="stroke:#000000;stroke-width:0.5;stroke-linecap:butt;stroke-linejoin:round;stroke-miterlimit:100000"
               id="me8f4a2a801"
               d="M 0,0 H 4" />
          </defs>
          <g
             style="stroke-linecap:butt;stroke-linejoin:round;stroke-miterlimit:100000"
             id="g262">
            <use
               height="100%"
               width="100%"
               id="use260"
               y="575.09998"
               xlink:href="#me8f4a2a801"
               x="421.16626"
               style="stroke:#000000;stroke-width:0.5;stroke-linecap:butt;stroke-linejoin:round;stroke-miterlimit:100000" />
          </g>
        </g>
        <g
           style="stroke-linecap:butt;stroke-linejoin:round;stroke-miterlimit:100000"
           id="line2d_24">
          <defs
             id="defs266">
            <path
               inkscape:connector-curvature="0"
               style="stroke:#000000;stroke-width:0.5;stroke-linecap:butt;stroke-linejoin:round;stroke-miterlimit:100000"
               id="m5ed6ba677d"
               d="M 0,0 H -4" />
          </defs>
          <g
             style="stroke-linecap:butt;stroke-linejoin:round;stroke-miterlimit:100000"
             id="g270">
            <use
               height="100%"
               width="100%"
               id="use268"
               y="575.09998"
               xlink:href="#m5ed6ba677d"
               x="779.00623"
               style="stroke:#000000;stroke-width:0.5;stroke-linecap:butt;stroke-linejoin:round;stroke-miterlimit:100000" />
          </g>
        </g>
        <g
           style="stroke-linecap:butt;stroke-linejoin:round;stroke-miterlimit:100000"
           id="text_10">
          <!-- 0 -->
          <g
             style="stroke-linecap:butt;stroke-linejoin:round;stroke-miterlimit:100000"
             id="g275"
             transform="matrix(0.12,0,0,-0.12,409.53125,578.41125)">
            <use
               height="100%"
               width="100%"
               y="0"
               x="0"
               style="stroke-linecap:butt;stroke-linejoin:round;stroke-miterlimit:100000"
               id="use273"
               xlink:href="#BitstreamVeraSans-Roman-30" />
          </g>
        </g>
      </g>
      <g
         style="stroke-linecap:butt;stroke-linejoin:round;stroke-miterlimit:100000"
         id="ytick_2">
        <g
           style="stroke-linecap:butt;stroke-linejoin:round;stroke-miterlimit:100000"
           id="line2d_25">
          <g
             style="stroke-linecap:butt;stroke-linejoin:round;stroke-miterlimit:100000"
             id="g281">
            <use
               height="100%"
               width="100%"
               id="use279"
               y="472.85999"
               xlink:href="#me8f4a2a801"
               x="421.16626"
               style="stroke:#000000;stroke-width:0.5;stroke-linecap:butt;stroke-linejoin:round;stroke-miterlimit:100000" />
          </g>
        </g>
        <g
           style="stroke-linecap:butt;stroke-linejoin:round;stroke-miterlimit:100000"
           id="line2d_26">
          <g
             style="stroke-linecap:butt;stroke-linejoin:round;stroke-miterlimit:100000"
             id="g286">
            <use
               height="100%"
               width="100%"
               id="use284"
               y="472.85999"
               xlink:href="#m5ed6ba677d"
               x="779.00623"
               style="stroke:#000000;stroke-width:0.5;stroke-linecap:butt;stroke-linejoin:round;stroke-miterlimit:100000" />
          </g>
        </g>
        <g
           style="stroke-linecap:butt;stroke-linejoin:round;stroke-miterlimit:100000"
           id="text_11">
          <!-- 100 -->
          <g
             style="stroke-linecap:butt;stroke-linejoin:round;stroke-miterlimit:100000"
             id="g295"
             transform="matrix(0.12,0,0,-0.12,394.26125,476.17125)">
            <use
               height="100%"
               width="100%"
               y="0"
               x="0"
               style="stroke-linecap:butt;stroke-linejoin:round;stroke-miterlimit:100000"
               id="use289"
               xlink:href="#BitstreamVeraSans-Roman-31" />
            <use
               height="100%"
               width="100%"
               y="0"
               style="stroke-linecap:butt;stroke-linejoin:round;stroke-miterlimit:100000"
               id="use291"
               xlink:href="#BitstreamVeraSans-Roman-30"
               x="63.623047" />
            <use
               height="100%"
               width="100%"
               y="0"
               style="stroke-linecap:butt;stroke-linejoin:round;stroke-miterlimit:100000"
               id="use293"
               xlink:href="#BitstreamVeraSans-Roman-30"
               x="127.24609" />
          </g>
        </g>
      </g>
      <g
         style="stroke-linecap:butt;stroke-linejoin:round;stroke-miterlimit:100000"
         id="ytick_3">
        <g
           style="stroke-linecap:butt;stroke-linejoin:round;stroke-miterlimit:100000"
           id="line2d_27">
          <g
             style="stroke-linecap:butt;stroke-linejoin:round;stroke-miterlimit:100000"
             id="g301">
            <use
               height="100%"
               width="100%"
               id="use299"
               y="370.62"
               xlink:href="#me8f4a2a801"
               x="421.16626"
               style="stroke:#000000;stroke-width:0.5;stroke-linecap:butt;stroke-linejoin:round;stroke-miterlimit:100000" />
          </g>
        </g>
        <g
           style="stroke-linecap:butt;stroke-linejoin:round;stroke-miterlimit:100000"
           id="line2d_28">
          <g
             style="stroke-linecap:butt;stroke-linejoin:round;stroke-miterlimit:100000"
             id="g306">
            <use
               height="100%"
               width="100%"
               id="use304"
               y="370.62"
               xlink:href="#m5ed6ba677d"
               x="779.00623"
               style="stroke:#000000;stroke-width:0.5;stroke-linecap:butt;stroke-linejoin:round;stroke-miterlimit:100000" />
          </g>
        </g>
        <g
           style="stroke-linecap:butt;stroke-linejoin:round;stroke-miterlimit:100000"
           id="text_12">
          <!-- 200 -->
          <g
             style="stroke-linecap:butt;stroke-linejoin:round;stroke-miterlimit:100000"
             id="g315"
             transform="matrix(0.12,0,0,-0.12,394.26125,373.93125)">
            <use
               height="100%"
               width="100%"
               y="0"
               x="0"
               style="stroke-linecap:butt;stroke-linejoin:round;stroke-miterlimit:100000"
               id="use309"
               xlink:href="#BitstreamVeraSans-Roman-32" />
            <use
               height="100%"
               width="100%"
               y="0"
               style="stroke-linecap:butt;stroke-linejoin:round;stroke-miterlimit:100000"
               id="use311"
               xlink:href="#BitstreamVeraSans-Roman-30"
               x="63.623047" />
            <use
               height="100%"
               width="100%"
               y="0"
               style="stroke-linecap:butt;stroke-linejoin:round;stroke-miterlimit:100000"
               id="use313"
               xlink:href="#BitstreamVeraSans-Roman-30"
               x="127.24609" />
          </g>
        </g>
      </g>
      <g
         style="stroke-linecap:butt;stroke-linejoin:round;stroke-miterlimit:100000"
         id="ytick_4">
        <g
           style="stroke-linecap:butt;stroke-linejoin:round;stroke-miterlimit:100000"
           id="line2d_29">
          <g
             style="stroke-linecap:butt;stroke-linejoin:round;stroke-miterlimit:100000"
             id="g321">
            <use
               height="100%"
               width="100%"
               id="use319"
               y="268.38"
               xlink:href="#me8f4a2a801"
               x="421.16626"
               style="stroke:#000000;stroke-width:0.5;stroke-linecap:butt;stroke-linejoin:round;stroke-miterlimit:100000" />
          </g>
        </g>
        <g
           style="stroke-linecap:butt;stroke-linejoin:round;stroke-miterlimit:100000"
           id="line2d_30">
          <g
             style="stroke-linecap:butt;stroke-linejoin:round;stroke-miterlimit:100000"
             id="g326">
            <use
               height="100%"
               width="100%"
               id="use324"
               y="268.38"
               xlink:href="#m5ed6ba677d"
               x="779.00623"
               style="stroke:#000000;stroke-width:0.5;stroke-linecap:butt;stroke-linejoin:round;stroke-miterlimit:100000" />
          </g>
        </g>
        <g
           style="stroke-linecap:butt;stroke-linejoin:round;stroke-miterlimit:100000"
           id="text_13">
          <!-- 300 -->
          <defs
             id="defs330">
            <path
               style="stroke-linecap:butt;stroke-linejoin:round;stroke-miterlimit:100000"
               inkscape:connector-curvature="0"
               id="BitstreamVeraSans-Roman-33"
               d="M 40.578125,39.3125 Q 47.65625,37.796875 51.625,33 q 3.984375,-4.78125 3.984375,-11.8125 0,-10.78125 -7.421875,-16.703125 -7.421875,-5.90625 -21.09375,-5.90625 -4.578125,0 -9.4375,0.90625 -4.859375,0.90625 -10.03125,2.71875 v 9.515625 q 4.09375,-2.390625 8.96875,-3.609375 4.890625,-1.21875 10.21875,-1.21875 9.265625,0 14.125,3.65625 4.859375,3.65625 4.859375,10.640625 0,6.453125 -4.515625,10.078125 -4.515625,3.640625 -12.5625,3.640625 h -8.5 v 8.109375 h 8.890625 q 7.265625,0 11.125,2.90625 3.859375,2.90625 3.859375,8.375 0,5.609375 -3.984375,8.609375 -3.96875,3.015625 -11.390625,3.015625 -4.0625,0 -8.703125,-0.890625 Q 15.375,64.15625 9.8125,62.3125 v 8.78125 q 5.625,1.5625 10.53125,2.34375 4.90625,0.78125 9.25,0.78125 11.234375,0 17.765625,-5.109375 6.546875,-5.09375 6.546875,-13.78125 0,-6.0625 -3.46875,-10.234375 -3.46875,-4.171875 -9.859375,-5.78125" />
          </defs>
          <g
             style="stroke-linecap:butt;stroke-linejoin:round;stroke-miterlimit:100000"
             id="g338"
             transform="matrix(0.12,0,0,-0.12,394.26125,271.69125)">
            <use
               height="100%"
               width="100%"
               y="0"
               x="0"
               style="stroke-linecap:butt;stroke-linejoin:round;stroke-miterlimit:100000"
               id="use332"
               xlink:href="#BitstreamVeraSans-Roman-33" />
            <use
               height="100%"
               width="100%"
               y="0"
               style="stroke-linecap:butt;stroke-linejoin:round;stroke-miterlimit:100000"
               id="use334"
               xlink:href="#BitstreamVeraSans-Roman-30"
               x="63.623047" />
            <use
               height="100%"
               width="100%"
               y="0"
               style="stroke-linecap:butt;stroke-linejoin:round;stroke-miterlimit:100000"
               id="use336"
               xlink:href="#BitstreamVeraSans-Roman-30"
               x="127.24609" />
          </g>
        </g>
      </g>
      <g
         style="stroke-linecap:butt;stroke-linejoin:round;stroke-miterlimit:100000"
         id="ytick_5">
        <g
           style="stroke-linecap:butt;stroke-linejoin:round;stroke-miterlimit:100000"
           id="line2d_31">
          <g
             style="stroke-linecap:butt;stroke-linejoin:round;stroke-miterlimit:100000"
             id="g344">
            <use
               height="100%"
               width="100%"
               id="use342"
               y="166.14"
               xlink:href="#me8f4a2a801"
               x="421.16626"
               style="stroke:#000000;stroke-width:0.5;stroke-linecap:butt;stroke-linejoin:round;stroke-miterlimit:100000" />
          </g>
        </g>
        <g
           style="stroke-linecap:butt;stroke-linejoin:round;stroke-miterlimit:100000"
           id="line2d_32">
          <g
             style="stroke-linecap:butt;stroke-linejoin:round;stroke-miterlimit:100000"
             id="g349">
            <use
               height="100%"
               width="100%"
               id="use347"
               y="166.14"
               xlink:href="#m5ed6ba677d"
               x="779.00623"
               style="stroke:#000000;stroke-width:0.5;stroke-linecap:butt;stroke-linejoin:round;stroke-miterlimit:100000" />
          </g>
        </g>
        <g
           style="stroke-linecap:butt;stroke-linejoin:round;stroke-miterlimit:100000"
           id="text_14">
          <!-- 400 -->
          <defs
             id="defs353">
            <path
               style="stroke-linecap:butt;stroke-linejoin:round;stroke-miterlimit:100000"
               inkscape:connector-curvature="0"
               id="BitstreamVeraSans-Roman-34"
               d="M 37.796875,64.3125 12.890625,25.390625 h 24.90625 z m -2.59375,8.59375 h 12.40625 V 25.390625 h 10.40625 V 17.1875 H 47.609375 V 0 h -9.8125 V 17.1875 H 4.890625 v 9.515625 z" />
          </defs>
          <g
             style="stroke-linecap:butt;stroke-linejoin:round;stroke-miterlimit:100000"
             id="g361"
             transform="matrix(0.12,0,0,-0.12,394.26125,169.45125)">
            <use
               height="100%"
               width="100%"
               y="0"
               x="0"
               style="stroke-linecap:butt;stroke-linejoin:round;stroke-miterlimit:100000"
               id="use355"
               xlink:href="#BitstreamVeraSans-Roman-34" />
            <use
               height="100%"
               width="100%"
               y="0"
               style="stroke-linecap:butt;stroke-linejoin:round;stroke-miterlimit:100000"
               id="use357"
               xlink:href="#BitstreamVeraSans-Roman-30"
               x="63.623047" />
            <use
               height="100%"
               width="100%"
               y="0"
               style="stroke-linecap:butt;stroke-linejoin:round;stroke-miterlimit:100000"
               id="use359"
               xlink:href="#BitstreamVeraSans-Roman-30"
               x="127.24609" />
          </g>
        </g>
      </g>
      <g
         style="stroke-linecap:butt;stroke-linejoin:round;stroke-miterlimit:100000"
         id="ytick_6">
        <g
           style="stroke-linecap:butt;stroke-linejoin:round;stroke-miterlimit:100000"
           id="line2d_33">
          <g
             style="stroke-linecap:butt;stroke-linejoin:round;stroke-miterlimit:100000"
             id="g367">
            <use
               height="100%"
               width="100%"
               id="use365"
               y="63.900002"
               xlink:href="#me8f4a2a801"
               x="421.16626"
               style="stroke:#000000;stroke-width:0.5;stroke-linecap:butt;stroke-linejoin:round;stroke-miterlimit:100000" />
          </g>
        </g>
        <g
           style="stroke-linecap:butt;stroke-linejoin:round;stroke-miterlimit:100000"
           id="line2d_34">
          <g
             style="stroke-linecap:butt;stroke-linejoin:round;stroke-miterlimit:100000"
             id="g372">
            <use
               height="100%"
               width="100%"
               id="use370"
               y="63.900002"
               xlink:href="#m5ed6ba677d"
               x="779.00623"
               style="stroke:#000000;stroke-width:0.5;stroke-linecap:butt;stroke-linejoin:round;stroke-miterlimit:100000" />
          </g>
        </g>
        <g
           style="stroke-linecap:butt;stroke-linejoin:round;stroke-miterlimit:100000"
           id="text_15">
          <!-- 500 -->
          <g
             style="stroke-linecap:butt;stroke-linejoin:round;stroke-miterlimit:100000"
             id="g381"
             transform="matrix(0.12,0,0,-0.12,394.26125,67.21125)">
            <use
               height="100%"
               width="100%"
               y="0"
               x="0"
               style="stroke-linecap:butt;stroke-linejoin:round;stroke-miterlimit:100000"
               id="use375"
               xlink:href="#BitstreamVeraSans-Roman-35" />
            <use
               height="100%"
               width="100%"
               y="0"
               style="stroke-linecap:butt;stroke-linejoin:round;stroke-miterlimit:100000"
               id="use377"
               xlink:href="#BitstreamVeraSans-Roman-30"
               x="63.623047" />
            <use
               height="100%"
               width="100%"
               y="0"
               style="stroke-linecap:butt;stroke-linejoin:round;stroke-miterlimit:100000"
               id="use379"
               xlink:href="#BitstreamVeraSans-Roman-30"
               x="127.24609" />
          </g>
        </g>
      </g>
      <g
         style="stroke-linecap:butt;stroke-linejoin:round;stroke-miterlimit:100000"
         id="text_16">
        <!-- z (m) -->
        <defs
           id="defs386">
          <path
             style="stroke-linecap:butt;stroke-linejoin:round;stroke-miterlimit:100000"
             inkscape:connector-curvature="0"
             id="BitstreamVeraSans-Roman-7a"
             d="M 5.515625,54.6875 H 48.1875 V 46.484375 L 14.40625,7.171875 H 48.1875 V 0 H 4.296875 v 8.203125 l 33.796875,39.3125 H 5.515625 Z" />
        </defs>
        <g
           style="stroke-linecap:butt;stroke-linejoin:round;stroke-miterlimit:100000"
           id="g398"
           transform="matrix(0,-0.12,-0.12,0,386.76562,335.08219)">
          <use
             height="100%"
             width="100%"
             y="0"
             x="0"
             style="stroke-linecap:butt;stroke-linejoin:round;stroke-miterlimit:100000"
             id="use388"
             xlink:href="#BitstreamVeraSans-Roman-7a" />
          <use
             height="100%"
             width="100%"
             y="0"
             style="stroke-linecap:butt;stroke-linejoin:round;stroke-miterlimit:100000"
             id="use390"
             xlink:href="#BitstreamVeraSans-Roman-20"
             x="52.490234" />
          <use
             height="100%"
             width="100%"
             y="0"
             style="stroke-linecap:butt;stroke-linejoin:round;stroke-miterlimit:100000"
             id="use392"
             xlink:href="#BitstreamVeraSans-Roman-28"
             x="84.277344" />
          <use
             height="100%"
             width="100%"
             y="0"
             style="stroke-linecap:butt;stroke-linejoin:round;stroke-miterlimit:100000"
             id="use394"
             xlink:href="#BitstreamVeraSans-Roman-6d"
             x="123.29102" />
          <use
             height="100%"
             width="100%"
             y="0"
             style="stroke-linecap:butt;stroke-linejoin:round;stroke-miterlimit:100000"
             id="use396"
             xlink:href="#BitstreamVeraSans-Roman-29"
             x="220.70312" />
        </g>
      </g>
    </g>
    <g
       style="stroke-linecap:butt;stroke-linejoin:round;stroke-miterlimit:100000"
       id="legend_1">
      <g
         style="stroke-linecap:butt;stroke-linejoin:round;stroke-miterlimit:100000"
         id="patch_7">
        <path
           inkscape:connector-curvature="0"
           id="path402"
           style="fill:#ffffff;stroke:#000000;stroke-linecap:butt;stroke-linejoin:miter;stroke-miterlimit:100000"
           d="M 579.4983,149.8545 H 761.07105 V 81.324 H 579.4983 Z" />
      </g>
      <g
         style="stroke-linecap:butt;stroke-linejoin:round;stroke-miterlimit:100000"
         id="line2d_35">
        <path
           inkscape:connector-curvature="0"
           id="path405"
           style="fill:none;stroke:#ff0000;stroke-width:1.5;stroke-linecap:square;stroke-linejoin:round;stroke-miterlimit:100000"
           d="m 589.5783,92.98575 h 20.16" />
      </g>
      <g
         style="stroke-linecap:butt;stroke-linejoin:round;stroke-miterlimit:100000"
         id="line2d_36" />
      <g
         style="stroke-linecap:butt;stroke-linejoin:round;stroke-miterlimit:100000"
         id="text_17">
        <!-- ground truth -->
        <defs
           id="defs417">
          <path
             style="stroke-linecap:butt;stroke-linejoin:round;stroke-miterlimit:100000"
             inkscape:connector-curvature="0"
             id="BitstreamVeraSans-Roman-6e"
             d="M 54.890625,33.015625 V 0 H 45.90625 v 32.71875 q 0,7.765625 -3.03125,11.609375 -3.03125,3.859375 -9.078125,3.859375 -7.28125,0 -11.484375,-4.640625 -4.203125,-4.625 -4.203125,-12.640625 V 0 h -9.03125 v 54.6875 h 9.03125 v -8.5 q 3.234375,4.9375 7.59375,7.375 4.375,2.4375 10.09375,2.4375 9.421875,0 14.25,-5.828125 4.84375,-5.828125 4.84375,-17.15625" />
          <path
             style="stroke-linecap:butt;stroke-linejoin:round;stroke-miterlimit:100000"
             inkscape:connector-curvature="0"
             id="BitstreamVeraSans-Roman-6f"
             d="m 30.609375,48.390625 q -7.21875,0 -11.421875,-5.640625 -4.203125,-5.640625 -4.203125,-15.453125 0,-9.8125 4.171875,-15.453125 4.1875,-5.640625 11.453125,-5.640625 7.1875,0 11.375,5.65625 4.203125,5.671875 4.203125,15.4375 0,9.71875 -4.203125,15.40625 -4.1875,5.6875 -11.375,5.6875 m 0,7.609375 q 11.71875,0 18.40625,-7.625 6.703125,-7.609375 6.703125,-21.078125 0,-13.421875 -6.703125,-21.078125 -6.6875,-7.640625 -18.40625,-7.640625 -11.765625,0 -18.4375,7.640625 -6.65625,7.65625 -6.65625,21.078125 0,13.46875 6.65625,21.078125 Q 18.84375,56 30.609375,56" />
          <path
             style="stroke-linecap:butt;stroke-linejoin:round;stroke-miterlimit:100000"
             inkscape:connector-curvature="0"
             id="BitstreamVeraSans-Roman-68"
             d="M 54.890625,33.015625 V 0 H 45.90625 v 32.71875 q 0,7.765625 -3.03125,11.609375 -3.03125,3.859375 -9.078125,3.859375 -7.28125,0 -11.484375,-4.640625 -4.203125,-4.625 -4.203125,-12.640625 V 0 h -9.03125 v 75.984375 h 9.03125 V 46.1875 q 3.234375,4.9375 7.59375,7.375 4.375,2.4375 10.09375,2.4375 9.421875,0 14.25,-5.828125 4.84375,-5.828125 4.84375,-17.15625" />
          <path
             style="stroke-linecap:butt;stroke-linejoin:round;stroke-miterlimit:100000"
             inkscape:connector-curvature="0"
             id="BitstreamVeraSans-Roman-64"
             d="m 45.40625,46.390625 v 29.59375 h 8.984375 V 0 H 45.40625 v 8.203125 q -2.828125,-4.875 -7.15625,-7.25 -4.3125,-2.375 -10.375,-2.375 -9.90625,0 -16.140625,7.90625 -6.21875,7.921875 -6.21875,20.8125 0,12.890625 6.21875,20.796875 Q 17.96875,56 27.875,56 q 6.0625,0 10.375,-2.375 4.328125,-2.359375 7.15625,-7.234375 M 14.796875,27.296875 q 0,-9.90625 4.078125,-15.546875 4.078125,-5.640625 11.203125,-5.640625 7.125,0 11.21875,5.640625 4.109375,5.640625 4.109375,15.546875 0,9.90625 -4.109375,15.546875 -4.09375,5.640625 -11.21875,5.640625 -7.125,0 -11.203125,-5.640625 -4.078125,-5.640625 -4.078125,-15.546875" />
          <path
             style="stroke-linecap:butt;stroke-linejoin:round;stroke-miterlimit:100000"
             inkscape:connector-curvature="0"
             id="BitstreamVeraSans-Roman-67"
             d="m 45.40625,27.984375 q 0,9.765625 -4.03125,15.125 -4.015625,5.375 -11.296875,5.375 -7.21875,0 -11.25,-5.375 -4.03125,-5.359375 -4.03125,-15.125 0,-9.71875 4.03125,-15.09375 4.03125,-5.375 11.25,-5.375 7.28125,0 11.296875,5.375 4.03125,5.375 4.03125,15.09375 M 54.390625,6.78125 q 0,-13.953125 -6.203125,-20.765625 -6.1875,-6.8125 -18.984375,-6.8125 -4.734375,0 -8.9375,0.703125 -4.203125,0.703125 -8.15625,2.171875 V -9.1875 q 3.953125,-2.140625 7.8125,-3.15625 3.859375,-1.03125 7.859375,-1.03125 8.84375,0 13.234375,4.609375 4.390625,4.609375 4.390625,13.9375 V 9.625 Q 42.625,4.78125 38.28125,2.390625 33.9375,0 27.875,0 17.828125,0 11.671875,7.65625 q -6.15625,7.671875 -6.15625,20.328125 0,12.6875 6.15625,20.34375 Q 17.828125,56 27.875,56 q 6.0625,0 10.40625,-2.390625 4.34375,-2.390625 7.125,-7.21875 V 54.6875 h 8.984375 z" />
          <path
             style="stroke-linecap:butt;stroke-linejoin:round;stroke-miterlimit:100000"
             inkscape:connector-curvature="0"
             id="BitstreamVeraSans-Roman-75"
             d="M 8.5,21.578125 V 54.6875 h 8.984375 V 21.921875 q 0,-7.765625 3.015625,-11.65625 3.03125,-3.875 9.09375,-3.875 7.265625,0 11.484375,4.640625 4.234375,4.640625 4.234375,12.65625 v 31 h 8.984375 V 0 H 45.3125 V 8.40625 Q 42.046875,3.421875 37.71875,1 33.40625,-1.421875 27.6875,-1.421875 18.265625,-1.421875 13.375,4.4375 8.5,10.296875 8.5,21.578125" />
          <path
             style="stroke-linecap:butt;stroke-linejoin:round;stroke-miterlimit:100000"
             inkscape:connector-curvature="0"
             id="BitstreamVeraSans-Roman-72"
             d="m 41.109375,46.296875 q -1.515625,0.875 -3.296875,1.28125 Q 36.03125,48 33.890625,48 26.265625,48 22.1875,43.046875 18.109375,38.09375 18.109375,28.8125 V 0 h -9.03125 v 54.6875 h 9.03125 v -8.5 q 2.84375,4.984375 7.375,7.390625 Q 30.03125,56 36.53125,56 q 0.921875,0 2.046875,-0.125 1.125,-0.109375 2.484375,-0.359375 z" />
          <path
             style="stroke-linecap:butt;stroke-linejoin:round;stroke-miterlimit:100000"
             inkscape:connector-curvature="0"
             id="BitstreamVeraSans-Roman-74"
             d="M 18.3125,70.21875 V 54.6875 h 18.5 v -6.984375 h -18.5 v -29.6875 q 0,-6.6875 1.828125,-8.59375 1.828125,-1.90625 7.453125,-1.90625 H 36.8125 V 0 H 27.59375 Q 17.1875,0 13.234375,3.875 9.28125,7.765625 9.28125,18.015625 v 29.6875 H 2.6875 V 54.6875 h 6.59375 v 15.53125 z" />
        </defs>
        <g
           style="stroke-linecap:butt;stroke-linejoin:round;stroke-miterlimit:100000"
           id="g443"
           transform="matrix(0.144,0,0,-0.144,625.5783,98.02575)">
          <use
             height="100%"
             width="100%"
             y="0"
             x="0"
             style="stroke-linecap:butt;stroke-linejoin:round;stroke-miterlimit:100000"
             id="use419"
             xlink:href="#BitstreamVeraSans-Roman-67" />
          <use
             height="100%"
             width="100%"
             y="0"
             style="stroke-linecap:butt;stroke-linejoin:round;stroke-miterlimit:100000"
             id="use421"
             xlink:href="#BitstreamVeraSans-Roman-72"
             x="63.476562" />
          <use
             height="100%"
             width="100%"
             y="0"
             style="stroke-linecap:butt;stroke-linejoin:round;stroke-miterlimit:100000"
             id="use423"
             xlink:href="#BitstreamVeraSans-Roman-6f"
             x="104.55859" />
          <use
             height="100%"
             width="100%"
             y="0"
             style="stroke-linecap:butt;stroke-linejoin:round;stroke-miterlimit:100000"
             id="use425"
             xlink:href="#BitstreamVeraSans-Roman-75"
             x="165.74023" />
          <use
             height="100%"
             width="100%"
             y="0"
             style="stroke-linecap:butt;stroke-linejoin:round;stroke-miterlimit:100000"
             id="use427"
             xlink:href="#BitstreamVeraSans-Roman-6e"
             x="229.11914" />
          <use
             height="100%"
             width="100%"
             y="0"
             style="stroke-linecap:butt;stroke-linejoin:round;stroke-miterlimit:100000"
             id="use429"
             xlink:href="#BitstreamVeraSans-Roman-64"
             x="292.49805" />
          <use
             height="100%"
             width="100%"
             y="0"
             style="stroke-linecap:butt;stroke-linejoin:round;stroke-miterlimit:100000"
             id="use431"
             xlink:href="#BitstreamVeraSans-Roman-20"
             x="355.97461" />
          <use
             height="100%"
             width="100%"
             y="0"
             style="stroke-linecap:butt;stroke-linejoin:round;stroke-miterlimit:100000"
             id="use433"
             xlink:href="#BitstreamVeraSans-Roman-74"
             x="387.76172" />
          <use
             height="100%"
             width="100%"
             y="0"
             style="stroke-linecap:butt;stroke-linejoin:round;stroke-miterlimit:100000"
             id="use435"
             xlink:href="#BitstreamVeraSans-Roman-72"
             x="426.9707" />
          <use
             height="100%"
             width="100%"
             y="0"
             style="stroke-linecap:butt;stroke-linejoin:round;stroke-miterlimit:100000"
             id="use437"
             xlink:href="#BitstreamVeraSans-Roman-75"
             x="468.08398" />
          <use
             height="100%"
             width="100%"
             y="0"
             style="stroke-linecap:butt;stroke-linejoin:round;stroke-miterlimit:100000"
             id="use439"
             xlink:href="#BitstreamVeraSans-Roman-74"
             x="531.46289" />
          <use
             height="100%"
             width="100%"
             y="0"
             style="stroke-linecap:butt;stroke-linejoin:round;stroke-miterlimit:100000"
             id="use441"
             xlink:href="#BitstreamVeraSans-Roman-68"
             x="570.67188" />
        </g>
      </g>
      <g
         style="stroke-linecap:butt;stroke-linejoin:round;stroke-miterlimit:100000"
         id="line2d_37">
        <path
           inkscape:connector-curvature="0"
           id="path446"
           style="fill:none;stroke:#0072bd;stroke-width:1.5;stroke-linecap:square;stroke-linejoin:round;stroke-miterlimit:100000"
           d="m 589.5783,114.12225 h 20.16" />
      </g>
      <g
         style="stroke-linecap:butt;stroke-linejoin:round;stroke-miterlimit:100000"
         id="line2d_38" />
      <g
         style="stroke-linecap:butt;stroke-linejoin:round;stroke-miterlimit:100000"
         id="text_18">
        <!-- fast_anms_ldb.log -->
        <defs
           id="defs457">
          <path
             style="stroke-linecap:butt;stroke-linejoin:round;stroke-miterlimit:100000"
             inkscape:connector-curvature="0"
             id="BitstreamVeraSans-Roman-5f"
             d="m 50.984375,-16.609375 v -6.96875 h -51.96875 v 6.96875 z" />
          <path
             style="stroke-linecap:butt;stroke-linejoin:round;stroke-miterlimit:100000"
             inkscape:connector-curvature="0"
             id="BitstreamVeraSans-Roman-6c"
             d="M 9.421875,75.984375 H 18.40625 V 0 H 9.421875 Z" />
          <path
             style="stroke-linecap:butt;stroke-linejoin:round;stroke-miterlimit:100000"
             inkscape:connector-curvature="0"
             id="BitstreamVeraSans-Roman-2e"
             d="M 10.6875,12.40625 H 21 V 0 H 10.6875 Z" />
          <path
             style="stroke-linecap:butt;stroke-linejoin:round;stroke-miterlimit:100000"
             inkscape:connector-curvature="0"
             id="BitstreamVeraSans-Roman-66"
             d="M 37.109375,75.984375 V 68.5 h -8.59375 q -4.828125,0 -6.71875,-1.953125 -1.875,-1.953125 -1.875,-7.03125 V 54.6875 H 34.71875 V 47.703125 H 19.921875 V 0 h -9.03125 V 47.703125 H 2.296875 V 54.6875 h 8.59375 V 58.5 q 0,9.125 4.25,13.296875 4.25,4.1875 13.46875,4.1875 z" />
          <path
             style="stroke-linecap:butt;stroke-linejoin:round;stroke-miterlimit:100000"
             inkscape:connector-curvature="0"
             id="BitstreamVeraSans-Roman-61"
             d="m 34.28125,27.484375 q -10.890625,0 -15.09375,-2.484375 -4.203125,-2.484375 -4.203125,-8.5 0,-4.78125 3.15625,-7.59375 3.15625,-2.796875 8.5625,-2.796875 7.484375,0 12,5.296875 4.515625,5.296875 4.515625,14.078125 v 2 z m 17.921875,3.71875 V 0 H 43.21875 v 8.296875 q -3.078125,-4.96875 -7.671875,-7.34375 -4.59375,-2.375 -11.234375,-2.375 -8.390625,0 -13.359375,4.71875 Q 6,8.015625 6,15.921875 q 0,9.21875 6.171875,13.90625 6.1875,4.6875 18.4375,4.6875 H 43.21875 v 0.890625 q 0,6.203125 -4.078125,9.59375 -4.078125,3.390625 -11.453125,3.390625 -4.6875,0 -9.140625,-1.125 -4.4375,-1.125 -8.53125,-3.375 v 8.3125 q 4.921875,1.90625 9.5625,2.84375 Q 24.21875,56 28.609375,56 q 11.875,0 17.734375,-6.15625 5.859375,-6.140625 5.859375,-18.640625" />
          <path
             style="stroke-linecap:butt;stroke-linejoin:round;stroke-miterlimit:100000"
             inkscape:connector-curvature="0"
             id="BitstreamVeraSans-Roman-73"
             d="m 44.28125,53.078125 v -8.5 Q 40.484375,46.53125 36.375,47.5 q -4.09375,0.984375 -8.5,0.984375 -6.6875,0 -10.03125,-2.046875 Q 14.5,44.390625 14.5,40.28125 q 0,-3.125 2.390625,-4.90625 2.390625,-1.78125 9.625,-3.390625 l 3.078125,-0.6875 Q 39.15625,29.25 43.1875,25.515625 47.21875,21.78125 47.21875,15.09375 q 0,-7.625 -6.03125,-12.078125 -6.03125,-4.4375 -16.578125,-4.4375 -4.390625,0 -9.15625,0.859375 Q 10.6875,0.296875 5.421875,2 v 9.28125 q 4.984375,-2.59375 9.8125,-3.890625 4.828125,-1.28125 9.578125,-1.28125 6.34375,0 9.75,2.171875 3.421875,2.171875 3.421875,6.125 0,3.65625 -2.46875,5.609375 -2.453125,1.953125 -10.8125,3.765625 l -3.125,0.734375 q -8.34375,1.75 -12.0625,5.390625 -3.703125,3.640625 -3.703125,9.984375 0,7.71875 5.46875,11.90625 Q 16.75,56 26.8125,56 q 4.96875,0 9.359375,-0.734375 4.40625,-0.71875 8.109375,-2.1875" />
          <path
             style="stroke-linecap:butt;stroke-linejoin:round;stroke-miterlimit:100000"
             inkscape:connector-curvature="0"
             id="BitstreamVeraSans-Roman-62"
             d="m 48.6875,27.296875 q 0,9.90625 -4.078125,15.546875 -4.078125,5.640625 -11.203125,5.640625 -7.140625,0 -11.21875,-5.640625 -4.078125,-5.640625 -4.078125,-15.546875 0,-9.90625 4.078125,-15.546875 4.078125,-5.640625 11.21875,-5.640625 7.125,0 11.203125,5.640625 4.078125,5.640625 4.078125,15.546875 m -30.578125,19.09375 q 2.84375,4.875 7.15625,7.234375 Q 29.59375,56 35.59375,56 q 9.96875,0 16.1875,-7.90625 6.234375,-7.90625 6.234375,-20.796875 0,-12.890625 -6.234375,-20.8125 -6.21875,-7.90625 -16.1875,-7.90625 -6,0 -10.328125,2.375 -4.3125,2.375 -7.15625,7.25 V 0 h -9.03125 v 75.984375 h 9.03125 z" />
        </defs>
        <g
           style="stroke-linecap:butt;stroke-linejoin:round;stroke-miterlimit:100000"
           id="g493"
           transform="matrix(0.144,0,0,-0.144,625.5783,119.16225)">
          <use
             height="100%"
             width="100%"
             y="0"
             x="0"
             style="stroke-linecap:butt;stroke-linejoin:round;stroke-miterlimit:100000"
             id="use459"
             xlink:href="#BitstreamVeraSans-Roman-66" />
          <use
             height="100%"
             width="100%"
             y="0"
             style="stroke-linecap:butt;stroke-linejoin:round;stroke-miterlimit:100000"
             id="use461"
             xlink:href="#BitstreamVeraSans-Roman-61"
             x="35.205078" />
          <use
             height="100%"
             width="100%"
             y="0"
             style="stroke-linecap:butt;stroke-linejoin:round;stroke-miterlimit:100000"
             id="use463"
             xlink:href="#BitstreamVeraSans-Roman-73"
             x="96.484375" />
          <use
             height="100%"
             width="100%"
             y="0"
             style="stroke-linecap:butt;stroke-linejoin:round;stroke-miterlimit:100000"
             id="use465"
             xlink:href="#BitstreamVeraSans-Roman-74"
             x="148.58398" />
          <use
             height="100%"
             width="100%"
             y="0"
             style="stroke-linecap:butt;stroke-linejoin:round;stroke-miterlimit:100000"
             id="use467"
             xlink:href="#BitstreamVeraSans-Roman-5f"
             x="187.79297" />
          <use
             height="100%"
             width="100%"
             y="0"
             style="stroke-linecap:butt;stroke-linejoin:round;stroke-miterlimit:100000"
             id="use469"
             xlink:href="#BitstreamVeraSans-Roman-61"
             x="237.79297" />
          <use
             height="100%"
             width="100%"
             y="0"
             style="stroke-linecap:butt;stroke-linejoin:round;stroke-miterlimit:100000"
             id="use471"
             xlink:href="#BitstreamVeraSans-Roman-6e"
             x="299.07227" />
          <use
             height="100%"
             width="100%"
             y="0"
             style="stroke-linecap:butt;stroke-linejoin:round;stroke-miterlimit:100000"
             id="use473"
             xlink:href="#BitstreamVeraSans-Roman-6d"
             x="362.45117" />
          <use
             height="100%"
             width="100%"
             y="0"
             style="stroke-linecap:butt;stroke-linejoin:round;stroke-miterlimit:100000"
             id="use475"
             xlink:href="#BitstreamVeraSans-Roman-73"
             x="459.86328" />
          <use
             height="100%"
             width="100%"
             y="0"
             style="stroke-linecap:butt;stroke-linejoin:round;stroke-miterlimit:100000"
             id="use477"
             xlink:href="#BitstreamVeraSans-Roman-5f"
             x="511.96289" />
          <use
             height="100%"
             width="100%"
             y="0"
             style="stroke-linecap:butt;stroke-linejoin:round;stroke-miterlimit:100000"
             id="use479"
             xlink:href="#BitstreamVeraSans-Roman-6c"
             x="561.96289" />
          <use
             height="100%"
             width="100%"
             y="0"
             style="stroke-linecap:butt;stroke-linejoin:round;stroke-miterlimit:100000"
             id="use481"
             xlink:href="#BitstreamVeraSans-Roman-64"
             x="589.74609" />
          <use
             height="100%"
             width="100%"
             y="0"
             style="stroke-linecap:butt;stroke-linejoin:round;stroke-miterlimit:100000"
             id="use483"
             xlink:href="#BitstreamVeraSans-Roman-62"
             x="653.22266" />
        </g>
      </g>
      <g
         style="stroke-linecap:butt;stroke-linejoin:round;stroke-miterlimit:100000"
         id="line2d_39">
        <path
           inkscape:connector-curvature="0"
           id="path496"
           style="fill:none;stroke:#d95319;stroke-width:1.5;stroke-linecap:square;stroke-linejoin:round;stroke-miterlimit:100000"
           d="m 589.5783,135.65925 h 20.16" />
      </g>
      <g
         style="stroke-linecap:butt;stroke-linejoin:round;stroke-miterlimit:100000"
         id="line2d_40" />
      <g
         style="stroke-linecap:butt;stroke-linejoin:round;stroke-miterlimit:100000"
         id="text_19">
        <!-- gftt_brisk.log -->
        <defs
           id="defs502">
          <path
             style="stroke-linecap:butt;stroke-linejoin:round;stroke-miterlimit:100000"
             inkscape:connector-curvature="0"
             id="BitstreamVeraSans-Roman-69"
             d="M 9.421875,54.6875 H 18.40625 V 0 H 9.421875 Z m 0,21.296875 H 18.40625 V 64.59375 H 9.421875 Z" />
          <path
             style="stroke-linecap:butt;stroke-linejoin:round;stroke-miterlimit:100000"
             inkscape:connector-curvature="0"
             id="BitstreamVeraSans-Roman-6b"
             d="m 9.078125,75.984375 h 9.03125 v -44.875 l 26.8125,23.578125 h 11.46875 l -29,-25.578125 L 57.625,0 H 45.90625 L 18.109375,26.703125 V 0 h -9.03125 z" />
        </defs>
        <g
           style="stroke-linecap:butt;stroke-linejoin:round;stroke-miterlimit:100000"
           id="g532"
           transform="matrix(0.144,0,0,-0.144,625.5783,140.69925)">
          <use
             height="100%"
             width="100%"
             y="0"
             x="0"
             style="stroke-linecap:butt;stroke-linejoin:round;stroke-miterlimit:100000"
             id="use504"
             xlink:href="#BitstreamVeraSans-Roman-67" />
          <use
             height="100%"
             width="100%"
             y="0"
             style="stroke-linecap:butt;stroke-linejoin:round;stroke-miterlimit:100000"
             id="use506"
             xlink:href="#BitstreamVeraSans-Roman-66"
             x="63.476562" />
          <use
             height="100%"
             width="100%"
             y="0"
             style="stroke-linecap:butt;stroke-linejoin:round;stroke-miterlimit:100000"
             id="use508"
             xlink:href="#BitstreamVeraSans-Roman-74"
             x="98.666016" />
          <use
             height="100%"
             width="100%"
             y="0"
             style="stroke-linecap:butt;stroke-linejoin:round;stroke-miterlimit:100000"
             id="use510"
             xlink:href="#BitstreamVeraSans-Roman-74"
             x="137.875" />
          <use
             height="100%"
             width="100%"
             y="0"
             style="stroke-linecap:butt;stroke-linejoin:round;stroke-miterlimit:100000"
             id="use512"
             xlink:href="#BitstreamVeraSans-Roman-5f"
             x="177.08398" />
          <use
             height="100%"
             width="100%"
             y="0"
             style="stroke-linecap:butt;stroke-linejoin:round;stroke-miterlimit:100000"
             id="use514"
             xlink:href="#BitstreamVeraSans-Roman-62"
             x="227.08398" />
          <use
             height="100%"
             width="100%"
             y="0"
             style="stroke-linecap:butt;stroke-linejoin:round;stroke-miterlimit:100000"
             id="use516"
             xlink:href="#BitstreamVeraSans-Roman-72"
             x="290.56055" />
          <use
             height="100%"
             width="100%"
             y="0"
             style="stroke-linecap:butt;stroke-linejoin:round;stroke-miterlimit:100000"
             id="use518"
             xlink:href="#BitstreamVeraSans-Roman-69"
             x="331.67383" />
          <use
             height="100%"
             width="100%"
             y="0"
             style="stroke-linecap:butt;stroke-linejoin:round;stroke-miterlimit:100000"
             id="use520"
             xlink:href="#BitstreamVeraSans-Roman-73"
             x="359.45703" />
          <use
             height="100%"
             width="100%"
             y="0"
             style="stroke-linecap:butt;stroke-linejoin:round;stroke-miterlimit:100000"
             id="use522"
             xlink:href="#BitstreamVeraSans-Roman-6b"
             x="411.55664" />
        </g>
      </g>
    </g>
  </g>
  <defs
     id="defs541">
    <clipPath
       id="p14174e07d0">
      <rect
         height="511.20000000000005"
         width="357.83999999999986"
         x="421.16624999999993"
         y="63.89999999999998"
         id="rect538" />
    </clipPath>
  </defs>
</svg>
