<?xml version="1.0" encoding="UTF-8" standalone="no"?>
<!-- Created with matplotlib (http://matplotlib.org/) -->

<svg
   xmlns:dc="http://purl.org/dc/elements/1.1/"
   xmlns:cc="http://creativecommons.org/ns#"
   xmlns:rdf="http://www.w3.org/1999/02/22-rdf-syntax-ns#"
   xmlns:svg="http://www.w3.org/2000/svg"
   xmlns="http://www.w3.org/2000/svg"
   xmlns:xlink="http://www.w3.org/1999/xlink"
   xmlns:sodipodi="http://sodipodi.sourceforge.net/DTD/sodipodi-0.dtd"
   xmlns:inkscape="http://www.inkscape.org/namespaces/inkscape"
   height="639pt"
   version="1.1"
   viewBox="0 0 1170 639"
   width="1170pt"
   id="svg572"
   sodipodi:docname="kitti_09.svg"
   inkscape:version="0.92.3 (unknown)">
  <metadata
     id="metadata576">
    <rdf:RDF>
      <cc:Work
         rdf:about="">
        <dc:format>image/svg+xml</dc:format>
        <dc:type
           rdf:resource="http://purl.org/dc/dcmitype/StillImage" />
      </cc:Work>
    </rdf:RDF>
  </metadata>
  <sodipodi:namedview
     pagecolor="#ffffff"
     bordercolor="#666666"
     borderopacity="1"
     objecttolerance="10"
     gridtolerance="10"
     guidetolerance="10"
     inkscape:pageopacity="0"
     inkscape:pageshadow="2"
     inkscape:window-width="1301"
     inkscape:window-height="744"
     id="namedview574"
     showgrid="false"
     inkscape:zoom="0.37051282"
     inkscape:cx="927.73233"
     inkscape:cy="447.28645"
     inkscape:window-x="65"
     inkscape:window-y="24"
     inkscape:window-maximized="1"
     inkscape:current-layer="svg572" />
  <defs
     id="defs4">
    <style
       type="text/css"
       id="style2">
*{stroke-linecap:butt;stroke-linejoin:round;stroke-miterlimit:100000;}
  </style>
  </defs>
  <g
     style="stroke-linecap:butt;stroke-linejoin:round;stroke-miterlimit:100000"
     id="axes_1">
    <g
       style="stroke-linecap:butt;stroke-linejoin:round;stroke-miterlimit:100000"
       id="patch_2">
      <path
         inkscape:connector-curvature="0"
         id="path9"
         style="fill:#ffffff;stroke-linecap:butt;stroke-linejoin:round;stroke-miterlimit:100000"
         d="M 381.00054,575.1 H 819.17196 V 63.9 H 381.00054 Z" />
    </g>
    <g
       style="stroke-linecap:butt;stroke-linejoin:round;stroke-miterlimit:100000"
       id="line2d_1">
      <path
         inkscape:connector-curvature="0"
         id="path12"
         style="fill:none;stroke:#ff0000;stroke-width:1.5;stroke-linecap:square;stroke-linejoin:round;stroke-miterlimit:100000"
         d="m 527.05768,502.07143 0.0255,-1.83796 -0.28517,-1.99511 -0.80766,-3.57859 -0.84671,-2.97076 -1.15772,-3.34771 -1.46698,-3.70803 -1.85644,-3.93104 -2.24042,-4.18859 -4.96186,-8.59482 -2.23155,-3.20746 -4.2411,-5.62794 -3.06411,-3.63379 -2.75633,-2.95804 -4.192,-4.0273 -4.48484,-3.9575 -4.0616,-3.3387 -3.62475,-2.61964 -3.03996,-1.97184 -3.99085,-2.28255 -4.94831,-2.54046 -7.38191,-3.48682 -10.5688,-4.86093 -2.77005,-1.59297 -3.27781,-2.16142 -3.00754,-2.26411 -3.27737,-2.78436 -2.90004,-2.77844 -2.09037,-2.34889 -1.84339,-2.45442 -1.63416,-2.58478 -1.80621,-3.30622 -1.79264,-3.61236 -1.43661,-3.30724 -1.01203,-2.84724 -0.61344,-2.27937 -0.59869,-3.21902 -0.2716,-2.5387 -0.12648,-3.54247 0.15226,-3.65814 0.31205,-2.80897 0.67092,-3.82517 0.97588,-3.9017 1.25353,-3.93156 1.15634,-2.94254 1.36235,-2.92472 1.61291,-2.83702 1.86442,-2.70775 2.09212,-2.57477 2.28214,-2.42769 2.44463,-2.29821 2.56798,-2.14222 2.63319,-1.9251 2.70564,-1.70391 2.74499,-1.4567 2.76293,-1.21293 2.75747,-0.99728 3.60339,-1.02546 2.66839,-0.56232 3.49935,-0.49068 3.40573,-0.22917 5.5921,-0.0859 8.19225,-0.042 4.29078,-0.21412 4.89927,-0.47746 4.79963,-0.70918 6.83444,-1.36746 5.59236,-1.3094 3.43501,-1.04102 4.02705,-1.50001 3.89845,-1.69835 3.71148,-1.8718 3.54275,-2.05123 3.45579,-2.27659 6.98707,-4.71319 8.2907,-5.63503 3.3976,-2.60033 2.71867,-2.36284 2.65182,-2.59251 2.03383,-2.24475 2.40091,-3.02412 2.26568,-3.2253 3.4638,-5.45042 4.78648,-7.78149 1.56957,-2.93085 1.71449,-3.73249 1.72842,-4.55545 1.83644,-5.3324 4.11737,-12.87976 0.98924,-3.27051 0.41996,-1.97571 0.24869,-1.99412 0.067,-2.0031 -0.1144,-2.01983 -0.53931,-4.11625 -0.69618,-5.8436 -1.28509,-10.39401 -0.75518,-4.02198 -1.29996,-5.47765 -1.51882,-5.42128 -8.19174,-28.19706 -2.976,-10.22707 -3.66858,-12.47978 -0.54579,-2.82635 -0.16381,-2.29339 0.0776,-2.29806 0.32822,-2.32304 0.55402,-2.31537 0.73838,-2.32903 0.93626,-2.30602 1.1122,-2.26652 1.29825,-2.19655 1.12369,-1.56288 1.24484,-1.45079 1.80306,-1.75268 2.46215,-2.02647 2.14642,-1.46737 2.30866,-1.27544 2.4758,-1.05169 1.96149,-0.64564 2.04613,-0.49221 2.83417,-0.3902 2.19342,-0.11852 2.23929,0.04 2.26474,0.20586 2.28106,0.38363 3.04975,0.74825 3.03755,1.00801 3.00483,1.26923 6.83102,3.29096 13.66357,6.82693 49.26712,24.83593 11.9436,6.36991 2.7545,1.10485 2.80794,0.89117 2.8617,0.63798 2.90165,0.39253 2.22131,0.096 2.26709,-0.10458 2.28142,-0.32198 2.26973,-0.52464 3.01206,-1.01911 2.19809,-0.97501 2.86637,-1.60648 2.72922,-1.87493 3.28264,-2.64349 3.82253,-3.43103 10.07787,-9.27397 2.74069,-2.00566 2.57345,-1.57771 1.52944,-0.70589 1.54981,-0.49309 1.59582,-0.31541 1.62518,-0.12218 2.09329,0.21631 2.06898,0.50003 2.53314,0.89978 2.48852,1.14692 1.83323,1.20117 1.242,1.07893 1.05943,1.20876 1.34416,2.17348 0.86429,1.8328 0.65485,1.92744 0.31658,1.49753 0.17753,2.08956 -0.05,1.59568 -0.28386,2.18078 -0.77118,3.42138 -1.60809,5.52951 -3.14585,10.2562 -2.42024,7.81749 -1.06987,4.32395 -0.63542,3.62434 -0.32505,2.91837 -0.17272,3.6607 0.054,3.66538 0.26254,3.65442 0.56809,4.34534 0.93571,4.9425 1.27705,5.36264 1.18226,3.97765 0.96902,3.41182 0.36281,1.90261 0.10947,1.39704 -0.16563,1.85595 -0.33038,1.35796 -0.52866,1.33621 -0.71882,1.27675 -1.21059,1.62109 -1.84748,1.97528 -3.07582,2.90851 -7.07647,6.94202 -4.22952,4.45372 -2.55089,2.93772 -1.87508,2.49305 -2.12323,3.27585 -1.95636,3.44139 -2.20065,4.34732 -6.72695,13.92005 -2.44624,4.90898 -2.2863,4.06857 -2.97227,4.85435 -10.08415,15.64287 -10.85686,16.43216 -6.7198,9.74442 -7.8976,11.51142 -5.21358,8.07711 -3.24087,5.50043 -4.02708,7.44337 -3.29257,6.6012 -3.65106,7.64959 -5.34445,11.53238 -4.0387,8.61095 -2.45749,4.60934 -2.15587,3.56906 -2.32428,3.46615 -3.10328,4.1703 -4.57677,5.65169 -4.11984,4.73622 -5.037,5.34248 -20.09322,20.82168 -20.87592,20.82821 -17.53224,17.84379 -14.05624,14.68986 -3.94655,4.34022 -4.06045,4.71634 -4.22541,4.86307 -1.69789,1.49555 -1.24773,0.80197 -1.21143,0.54537 -1.22481,0.33157 -1.20316,0.0841 -1.13712,-0.11496 -1.06765,-0.30074 -1.00971,-0.46063 -0.94354,-0.65091 -0.86811,-0.81909 -0.76872,-0.97439 -0.64165,-1.13419 -0.5192,-1.26674 -0.51907,-1.87519 -0.47394,-2.56599 -1.29062,-8.78542 -0.80823,-5.87797 -1.01544,-5.24623 -1.00002,-3.51096 -0.49639,-1.50859 v 0"
         clip-path="url(#p3aeefc34c3)" />
    </g>
    <g
       style="stroke-linecap:butt;stroke-linejoin:round;stroke-miterlimit:100000"
       id="line2d_2">
      <path
         inkscape:connector-curvature="0"
         id="path15"
         style="fill:none;stroke:#ff0000;stroke-linecap:square;stroke-linejoin:round;stroke-miterlimit:100000"
         d="M 527.05768,502.07143"
         clip-path="url(#p3aeefc34c3)" />
      <defs
         id="defs18">
        <path
           inkscape:connector-curvature="0"
           style="stroke:#000000;stroke-width:0.5;stroke-linecap:butt;stroke-linejoin:miter;stroke-miterlimit:100000"
           id="me1beb085d7"
           d="M 0,4 4,-4 H -4 Z" />
      </defs>
      <g
         style="stroke-linecap:butt;stroke-linejoin:round;stroke-miterlimit:100000"
         id="g22"
         clip-path="url(#p3aeefc34c3)">
        <use
           height="100%"
           width="100%"
           id="use20"
           y="502.07144"
           xlink:href="#me1beb085d7"
           x="527.05768"
           style="fill:#ff0000;stroke:#000000;stroke-width:0.5;stroke-linecap:butt;stroke-linejoin:miter;stroke-miterlimit:100000" />
      </g>
    </g>
    <g
       style="stroke-linecap:butt;stroke-linejoin:round;stroke-miterlimit:100000"
       id="line2d_3">
      <path
         inkscape:connector-curvature="0"
         id="path25"
         style="fill:none;stroke:#0072bd;stroke-width:1.5;stroke-linecap:square;stroke-linejoin:round;stroke-miterlimit:100000"
         d="m 527.05768,502.07143 -0.0329,-2.08607 -0.27772,-1.74776 -1.08501,-4.43713 -1.52759,-4.5438 -1.40732,-3.6266 -1.21585,-2.72408 -2.38364,-4.64843 -5.63471,-9.67707 -1.75632,-2.6689 -3.24518,-4.47801 -3.98503,-5.0003 -2.62272,-3.04564 -5.36013,-5.28602 -3.79167,-3.41197 -5.50127,-4.51334 -3.68987,-2.61008 -3.91759,-2.47685 -4.86389,-2.63517 -5.77443,-2.83536 -8.79476,-4.12032 -5.18972,-2.49713 -4.87428,-2.85902 -2.5098,-1.76119 -3.48559,-2.78501 -2.13254,-1.94104 -3.34059,-3.36361 -2.04118,-2.44609 -1.84987,-2.58402 -1.92868,-3.21002 -2.12995,-4.09402 -1.76046,-3.88459 -1.36544,-3.52254 -0.91889,-3.09166 -0.52543,-2.44468 -0.35604,-2.55485 -0.26655,-3.59287 0.0828,-3.69043 0.36394,-3.85873 0.62924,-4.09643 0.69097,-3.07641 0.82268,-3.23919 0.66525,-2.32604 1.20387,-2.9845 1.9835,-4.12265 1.17022,-2.04067 1.26068,-1.99133 2.10512,-2.8531 2.40486,-2.7405 2.50474,-2.43874 1.81787,-1.69839 3.66024,-2.87978 2.75254,-1.86525 2.86744,-1.65826 3.87185,-1.91197 4.15862,-1.5343 3.76919,-1.03111 2.92911,-0.58423 3.67804,-0.48119 2.72384,-0.16197 10.69526,-0.0691 5.20926,-0.1007 6.49243,-0.49947 3.47601,-0.43262 5.48174,-0.93602 6.97674,-1.52985 4.16746,-1.10099 4.8278,-1.61672 4.61084,-1.95061 3.15375,-1.5289 3.61311,-1.97418 7.66075,-4.79236 12.46587,-8.34017 3.40402,-2.59556 2.74076,-2.39995 2.64887,-2.5868 3.02316,-3.44978 2.33647,-3.06856 2.22896,-3.28162 3.08475,-4.80426 3.93928,-6.39378 1.61517,-2.96346 1.8053,-3.75917 1.52297,-3.83931 2.65958,-7.70156 1.60833,-5.32942 1.15845,-3.55838 1.65212,-4.61105 0.74676,-2.62681 0.3916,-2.00511 0.21147,-2.0249 -10e-4,-2.64945 -0.29742,-2.74821 -0.69898,-5.72487 -1.45116,-12.79183 -1.08744,-5.62891 -1.54698,-6.32082 -3.40838,-11.81648 -2.78699,-9.45456 -6.40879,-22.66097 -2.90493,-10.1328 -0.57155,-2.85266 -0.22897,-2.32581 0.0474,-2.33725 0.29755,-2.35902 0.68379,-2.94544 0.78058,-2.36748 1.20507,-2.93108 1.48573,-2.85651 1.42281,-2.17586 1.2285,-1.48506 1.76361,-1.81149 2.44871,-2.11669 2.18782,-1.56293 1.69708,-0.98174 2.42583,-1.16723 2.60194,-0.94122 2.06882,-0.5712 2.12969,-0.37766 2.92082,-0.25715 3.83154,0.061 2.95195,0.34556 1.49651,0.28474 6.38753,1.99161 3.7742,1.69566 36.01376,17.98658 6.42529,3.34079 24.53046,12.34601 14.46293,7.62434 3.50462,1.31459 2.16027,0.62384 2.94083,0.57006 2.97187,0.3514 2.24667,0.0353 2.25834,-0.16819 3.01793,-0.54781 2.25807,-0.64157 2.23777,-0.8391 1.47145,-0.67844 2.82405,-1.6208 2.72859,-1.87506 3.4119,-2.71465 5.72155,-5.21692 6.00862,-5.63814 2.30392,-1.96933 2.23962,-1.67436 3.17575,-1.99844 1.56294,-0.74817 2.10698,-0.63844 1.65985,-0.2642 1.66805,-0.0568 1.6216,0.19062 1.6111,0.33613 2.63892,0.83489 2.05533,0.84052 1.51007,0.76277 1.38783,0.91028 1.27288,1.0874 1.39727,1.60678 1.10561,1.79088 0.89007,1.92566 0.6602,2.00189 0.34354,1.55536 0.22846,2.13146 -0.0397,1.62013 -0.29593,2.24235 -0.47871,2.36254 -1.70943,6.14712 -3.28526,10.93341 -2.19793,7.10553 -1.11945,4.32334 -0.69192,3.64445 -0.35758,2.91036 -0.21765,3.70557 0.0528,4.40759 0.2625,3.68341 0.58152,4.41974 1.06593,5.72899 1.15713,4.66706 0.88279,2.96098 0.99336,3.04776 0.91217,3.82091 0.0663,1.42198 -0.17817,1.8437 -0.36982,1.39175 -0.55327,1.31781 -0.75203,1.25952 -1.26033,1.60988 -2.30067,2.41507 -10.98153,10.88568 -4.25899,4.6115 -1.98547,2.42005 -2.20307,3.21112 -2.03395,3.39196 -1.91566,3.576 -2.93248,5.97869 -8.17686,16.79178 -2.35615,4.05549 -4.03362,6.50789 -3.11569,4.87979 -12.57829,19.44998 -8.12655,12.28758 -7.23875,10.66297 -4.65241,7.14141 -4.90822,8.17505 -2.52789,4.66914 -5.33537,10.39115 -5.48778,11.55657 -7.64721,16.40829 -1.939,3.72941 -2.1457,3.67279 -2.91067,4.38142 -2.46949,3.32834 -4.48232,5.6129 -4.05478,4.75346 -5.05035,5.46125 -17.58379,18.48294 -37.39054,37.92297 -11.18672,11.72083 -5.00814,5.30848 -4.11222,4.427 -10.14938,11.52285 -1.29201,1.12675 -1.26103,0.83542 -1.25808,0.57635 -1.2736,0.35446 -1.23127,0.08 -1.5607,-0.13656 -1.06951,-0.35905 -0.98544,-0.55548 -0.93403,-0.69723 -0.85328,-0.89051 -0.91097,-1.46179 -0.88052,-2.21286 -0.52518,-2.00226 -0.86962,-5.68447 -2.48685,-17.08023 -0.86394,-3.5462 -0.46428,-1.52944 v 0"
         clip-path="url(#p3aeefc34c3)" />
    </g>
    <g
       style="stroke-linecap:butt;stroke-linejoin:round;stroke-miterlimit:100000"
       id="line2d_4">
      <path
         inkscape:connector-curvature="0"
         id="path28"
         style="fill:none;stroke:#0072bd;stroke-linecap:square;stroke-linejoin:round;stroke-miterlimit:100000"
         d="M 527.05768,502.07143"
         clip-path="url(#p3aeefc34c3)" />
      <defs
         id="defs31">
        <path
           inkscape:connector-curvature="0"
           style="stroke:#000000;stroke-width:0.5;stroke-linecap:butt;stroke-linejoin:miter;stroke-miterlimit:100000"
           id="m9e1b778d2c"
           d="M 0,4 4,-4 H -4 Z" />
      </defs>
      <g
         style="stroke-linecap:butt;stroke-linejoin:round;stroke-miterlimit:100000"
         id="g35"
         clip-path="url(#p3aeefc34c3)">
        <use
           height="100%"
           width="100%"
           id="use33"
           y="502.07144"
           xlink:href="#m9e1b778d2c"
           x="527.05768"
           style="fill:#0072bd;stroke:#000000;stroke-width:0.5;stroke-linecap:butt;stroke-linejoin:miter;stroke-miterlimit:100000" />
      </g>
    </g>
    <g
       style="stroke-linecap:butt;stroke-linejoin:round;stroke-miterlimit:100000"
       id="line2d_5">
      <path
         inkscape:connector-curvature="0"
         id="path38"
         style="fill:none;stroke:#d95319;stroke-width:1.5;stroke-linecap:square;stroke-linejoin:round;stroke-miterlimit:100000"
         d="m 527.05768,502.07143 -0.003,-1.83553 -0.36966,-2.33206 -0.56172,-2.48587 -1.62995,-5.19381 -2.72223,-6.79767 -2.29741,-4.59219 -2.20478,-3.7456 -1.12899,-1.94452 -3.96452,-6.618 -3.71018,-5.11882 -4.48056,-5.60164 -2.68412,-2.98177 -2.36326,-2.39647 -3.74337,-3.53676 -3.93091,-3.44379 -4.10305,-3.34001 -2.9588,-2.10482 -3.10305,-2.00881 -3.18563,-1.83596 -5.7698,-2.99199 -4.14663,-1.97034 -7.2237,-3.35422 -4.50986,-2.06375 -2.84683,-1.52674 -2.14133,-1.22298 -5.05424,-3.49934 -3.91906,-3.28225 -3.38433,-3.34884 -2.1072,-2.3971 -1.88222,-2.52611 -1.98194,-3.20569 -2.13018,-4.00795 -1.49528,-3.14335 -1.70203,-4.13959 -0.96675,-3.03074 -0.73247,-3.27066 -0.34619,-2.54473 -0.25073,-3.58399 0.0268,-3.80338 0.21581,-2.92539 0.56202,-3.95214 0.8699,-4.0959 1.21783,-4.0774 1.4877,-4.14543 1.39116,-3.00478 1.68939,-3.07869 1.90054,-2.85863 2.15225,-2.74403 2.39442,-2.60512 2.68589,-2.58969 2.77941,-2.2372 2.71249,-2.02495 3.71062,-2.35986 2.80184,-1.42997 2.88607,-1.18341 3.82814,-1.30866 2.82437,-0.73411 2.79653,-0.51727 3.69557,-0.49468 3.58438,-0.19273 5.7559,-0.0958 8.3641,-0.0833 5.08159,-0.335 6.32421,-0.74496 3.42055,-0.60594 7.63655,-1.60364 4.84605,-1.27429 4.0671,-1.35228 3.34522,-1.34401 3.24751,-1.47065 4.31793,-2.24955 4.13327,-2.48558 8.29456,-5.36517 10.63074,-7.38818 2.76901,-2.26823 2.14971,-1.94889 3.65888,-3.76769 1.94096,-2.3671 2.28515,-3.12973 1.79039,-2.6833 7.42432,-11.9447 1.93747,-3.74285 1.66206,-3.77989 2.28995,-6.15263 1.69639,-5.41357 1.77501,-6.02877 2.33208,-6.67187 0.67498,-2.63881 0.32931,-1.9748 0.15497,-2.0276 -0.0944,-2.69806 -0.63667,-4.8769 -0.77042,-6.72052 -0.95722,-8.10535 -0.53516,-3.26187 -1.64768,-7.16559 -1.28247,-4.697 -15.13502,-52.27441 -0.53485,-2.87014 -0.15855,-1.75207 0.0395,-2.3298 0.29249,-2.36935 0.53031,-2.35672 0.93381,-2.93563 0.95014,-2.32897 1.10886,-2.28164 1.32339,-2.29827 1.52713,-2.07875 1.72442,-1.87689 1.88228,-1.71405 2.57056,-1.98144 2.26687,-1.37325 2.41084,-1.1735 1.92569,-0.76074 2.02443,-0.59507 2.83754,-0.54596 2.93182,-0.25676 2.26471,-0.0254 3.07167,0.25724 3.06752,0.52018 3.90163,1.04179 3.13613,1.12437 3.03736,1.36382 24.25138,11.90256 15.42851,7.76202 14.74732,7.26309 6.39151,3.13952 20.01515,10.44036 3.47643,1.3247 2.15518,0.63978 2.19971,0.5176 2.93436,0.47496 2.22896,0.173 2.26761,-0.043 2.26525,-0.24675 2.2861,-0.44403 2.28351,-0.63534 2.24175,-0.84142 1.46772,-0.67849 3.53005,-2.05749 2.70397,-1.96534 4.54935,-3.87936 4.3636,-4.06707 6.57189,-6.08634 2.86481,-2.23783 2.63183,-1.76622 2.11107,-1.12994 1.56798,-0.59135 1.61744,-0.39401 1.65018,-0.19741 1.64311,0.0375 2.1994,0.33012 2.09078,0.5827 2.10601,0.74882 2.01436,0.92035 1.48573,0.86715 1.28882,1.03385 1.15659,1.18556 0.96537,1.26593 1.28129,2.28852 0.76145,1.95627 0.54214,2.02656 0.22474,1.57016 0.0889,1.59293 -0.16398,2.20014 -0.52836,2.88849 -0.90989,3.60964 -2.4675,8.45119 -2.42636,7.74943 -1.51732,5.01641 -1.10946,4.32395 -0.6773,3.63803 -0.42461,3.65328 -0.17128,4.44954 0.13297,4.45108 0.36577,3.67815 0.68477,4.33178 0.86545,4.27616 1.34271,5.32792 0.91906,2.86211 1.33467,4.43795 0.27837,1.44208 0.13066,1.41242 -0.0656,1.39109 -0.22913,1.36595 -0.6042,1.78351 -0.67092,1.29918 -1.19065,1.64978 -1.82749,2.00748 -2.1366,2.0793 -3.84249,3.75335 -6.30907,6.41184 -3.7198,4.08787 -2.01536,2.51768 -2.24225,3.2464 -1.67767,2.72224 -1.91173,3.5209 -3.64642,7.44451 -7.74603,16.03221 -4.37091,7.35511 -3.5725,5.70576 -21.64608,33.37906 -12.47573,18.69694 -2.81335,4.53017 -3.63221,6.49685 -3.46151,6.62459 -5.59831,11.49236 -6.672,14.49112 -2.66697,5.78325 -2.91193,5.65279 -2.13813,3.64008 -2.91902,4.3759 -3.08889,4.1497 -5.9001,7.2484 -5.62064,6.27634 -20.61942,21.72612 -32.07067,32.4775 -21.27624,22.3591 -5.13014,5.73898 -8.0194,9.13372 -1.28773,1.02032 -1.26763,0.76312 -1.25478,0.54105 -1.25958,0.28778 -1.20854,0.0739 -1.15662,-0.15556 -1.09012,-0.35158 -1.03724,-0.54249 -0.94251,-0.73739 -0.87502,-0.92012 -0.97194,-1.49885 -0.7066,-1.73328 -0.53309,-1.94847 -0.48696,-2.64931 -1.30376,-9.14269 -1.08501,-7.69225 -0.78726,-4.2253 -0.63483,-2.53184 -0.60836,-2.02486 v 0"
         clip-path="url(#p3aeefc34c3)" />
    </g>
    <g
       style="stroke-linecap:butt;stroke-linejoin:round;stroke-miterlimit:100000"
       id="line2d_6">
      <path
         inkscape:connector-curvature="0"
         id="path41"
         style="fill:none;stroke:#d95319;stroke-linecap:square;stroke-linejoin:round;stroke-miterlimit:100000"
         d="M 527.05768,502.07143"
         clip-path="url(#p3aeefc34c3)" />
      <defs
         id="defs44">
        <path
           inkscape:connector-curvature="0"
           style="stroke:#000000;stroke-width:0.5;stroke-linecap:butt;stroke-linejoin:miter;stroke-miterlimit:100000"
           id="m57832a1d78"
           d="M 0,4 4,-4 H -4 Z" />
      </defs>
      <g
         style="stroke-linecap:butt;stroke-linejoin:round;stroke-miterlimit:100000"
         id="g48"
         clip-path="url(#p3aeefc34c3)">
        <use
           height="100%"
           width="100%"
           id="use46"
           y="502.07144"
           xlink:href="#m57832a1d78"
           x="527.05768"
           style="fill:#d95319;stroke:#000000;stroke-width:0.5;stroke-linecap:butt;stroke-linejoin:miter;stroke-miterlimit:100000" />
      </g>
    </g>
    <g
       style="stroke-linecap:butt;stroke-linejoin:round;stroke-miterlimit:100000"
       id="patch_3">
      <path
         inkscape:connector-curvature="0"
         id="path51"
         style="fill:none;stroke:#000000;stroke-linecap:square;stroke-linejoin:miter;stroke-miterlimit:100000"
         d="M 381.00054,63.9 H 819.17196" />
    </g>
    <g
       style="stroke-linecap:butt;stroke-linejoin:round;stroke-miterlimit:100000"
       id="patch_4">
      <path
         inkscape:connector-curvature="0"
         id="path54"
         style="fill:none;stroke:#000000;stroke-linecap:square;stroke-linejoin:miter;stroke-miterlimit:100000"
         d="M 819.17196,575.1 V 63.9" />
    </g>
    <g
       style="stroke-linecap:butt;stroke-linejoin:round;stroke-miterlimit:100000"
       id="patch_5">
      <path
         inkscape:connector-curvature="0"
         id="path57"
         style="fill:none;stroke:#000000;stroke-linecap:square;stroke-linejoin:miter;stroke-miterlimit:100000"
         d="M 381.00054,575.1 H 819.17196" />
    </g>
    <g
       style="stroke-linecap:butt;stroke-linejoin:round;stroke-miterlimit:100000"
       id="patch_6">
      <path
         inkscape:connector-curvature="0"
         id="path60"
         style="fill:none;stroke:#000000;stroke-linecap:square;stroke-linejoin:miter;stroke-miterlimit:100000"
         d="M 381.00054,575.1 V 63.9" />
    </g>
    <g
       style="stroke-linecap:butt;stroke-linejoin:round;stroke-miterlimit:100000"
       id="matplotlib.axis_1">
      <g
         style="stroke-linecap:butt;stroke-linejoin:round;stroke-miterlimit:100000"
         id="xtick_1">
        <g
           style="stroke-linecap:butt;stroke-linejoin:round;stroke-miterlimit:100000"
           id="line2d_7">
          <defs
             id="defs64">
            <path
               inkscape:connector-curvature="0"
               style="stroke:#000000;stroke-width:0.5;stroke-linecap:butt;stroke-linejoin:round;stroke-miterlimit:100000"
               id="m01ce130cbd"
               d="M 0,0 V -4" />
          </defs>
          <g
             style="stroke-linecap:butt;stroke-linejoin:round;stroke-miterlimit:100000"
             id="g68">
            <use
               height="100%"
               width="100%"
               id="use66"
               y="575.09998"
               xlink:href="#m01ce130cbd"
               x="381.00055"
               style="stroke:#000000;stroke-width:0.5;stroke-linecap:butt;stroke-linejoin:round;stroke-miterlimit:100000" />
          </g>
        </g>
        <g
           style="stroke-linecap:butt;stroke-linejoin:round;stroke-miterlimit:100000"
           id="line2d_8">
          <defs
             id="defs72">
            <path
               inkscape:connector-curvature="0"
               style="stroke:#000000;stroke-width:0.5;stroke-linecap:butt;stroke-linejoin:round;stroke-miterlimit:100000"
               id="md20b04a11f"
               d="M 0,0 V 4" />
          </defs>
          <g
             style="stroke-linecap:butt;stroke-linejoin:round;stroke-miterlimit:100000"
             id="g76">
            <use
               height="100%"
               width="100%"
               id="use74"
               y="63.900002"
               xlink:href="#md20b04a11f"
               x="381.00055"
               style="stroke:#000000;stroke-width:0.5;stroke-linecap:butt;stroke-linejoin:round;stroke-miterlimit:100000" />
          </g>
        </g>
        <g
           style="stroke-linecap:butt;stroke-linejoin:round;stroke-miterlimit:100000"
           id="text_1">
          <!-- −200 -->
          <defs
             id="defs82">
            <path
               style="stroke-linecap:butt;stroke-linejoin:round;stroke-miterlimit:100000"
               inkscape:connector-curvature="0"
               id="BitstreamVeraSans-Roman-2212"
               d="M 10.59375,35.5 H 73.1875 V 27.203125 H 10.59375 Z" />
            <path
               style="stroke-linecap:butt;stroke-linejoin:round;stroke-miterlimit:100000"
               inkscape:connector-curvature="0"
               id="BitstreamVeraSans-Roman-32"
               d="M 19.1875,8.296875 H 53.609375 V 0 H 7.328125 v 8.296875 q 5.609375,5.8125 15.296875,15.59375 9.703125,9.796875 12.1875,12.640625 4.734375,5.3125 6.609375,9 1.890625,3.6875 1.890625,7.25 0,5.8125 -4.078125,9.46875 -4.078125,3.671875 -10.625,3.671875 -4.640625,0 -9.796875,-1.609375 -5.140625,-1.609375 -11,-4.890625 v 9.96875 Q 13.765625,71.78125 18.9375,73 q 5.1875,1.21875 9.484375,1.21875 11.328125,0 18.0625,-5.671875 6.734375,-5.65625 6.734375,-15.125 0,-4.5 -1.6875,-8.53125 Q 49.859375,40.875 45.40625,35.40625 44.1875,33.984375 37.640625,27.21875 31.109375,20.453125 19.1875,8.296875" />
            <path
               style="stroke-linecap:butt;stroke-linejoin:round;stroke-miterlimit:100000"
               inkscape:connector-curvature="0"
               id="BitstreamVeraSans-Roman-30"
               d="m 31.78125,66.40625 q -7.609375,0 -11.453125,-7.5 Q 16.5,51.421875 16.5,36.375 q 0,-14.984375 3.828125,-22.484375 3.84375,-7.5 11.453125,-7.5 7.671875,0 11.5,7.5 3.84375,7.5 3.84375,22.484375 0,15.046875 -3.84375,22.53125 -3.828125,7.5 -11.5,7.5 m 0,7.8125 q 12.265625,0 18.734375,-9.703125 6.46875,-9.6875 6.46875,-28.140625 0,-18.40625 -6.46875,-28.109375 -6.46875,-9.6875 -18.734375,-9.6875 -12.25,0 -18.71875,9.6875 Q 6.59375,17.96875 6.59375,36.375 q 0,18.453125 6.46875,28.140625 6.46875,9.703125 18.71875,9.703125" />
          </defs>
          <g
             style="stroke-linecap:butt;stroke-linejoin:round;stroke-miterlimit:100000"
             id="g92"
             transform="matrix(0.12,0,0,-0.12,364.52022,588.21812)">
            <use
               height="100%"
               width="100%"
               y="0"
               x="0"
               style="stroke-linecap:butt;stroke-linejoin:round;stroke-miterlimit:100000"
               id="use84"
               xlink:href="#BitstreamVeraSans-Roman-2212" />
            <use
               height="100%"
               width="100%"
               y="0"
               style="stroke-linecap:butt;stroke-linejoin:round;stroke-miterlimit:100000"
               id="use86"
               xlink:href="#BitstreamVeraSans-Roman-32"
               x="83.789062" />
            <use
               height="100%"
               width="100%"
               y="0"
               style="stroke-linecap:butt;stroke-linejoin:round;stroke-miterlimit:100000"
               id="use88"
               xlink:href="#BitstreamVeraSans-Roman-30"
               x="147.41211" />
            <use
               height="100%"
               width="100%"
               y="0"
               style="stroke-linecap:butt;stroke-linejoin:round;stroke-miterlimit:100000"
               id="use90"
               xlink:href="#BitstreamVeraSans-Roman-30"
               x="211.03516" />
          </g>
        </g>
      </g>
      <g
         style="stroke-linecap:butt;stroke-linejoin:round;stroke-miterlimit:100000"
         id="xtick_2">
        <g
           style="stroke-linecap:butt;stroke-linejoin:round;stroke-miterlimit:100000"
           id="line2d_9">
          <g
             style="stroke-linecap:butt;stroke-linejoin:round;stroke-miterlimit:100000"
             id="g98">
            <use
               height="100%"
               width="100%"
               id="use96"
               y="575.09998"
               xlink:href="#m01ce130cbd"
               x="454.02911"
               style="stroke:#000000;stroke-width:0.5;stroke-linecap:butt;stroke-linejoin:round;stroke-miterlimit:100000" />
          </g>
        </g>
        <g
           style="stroke-linecap:butt;stroke-linejoin:round;stroke-miterlimit:100000"
           id="line2d_10">
          <g
             style="stroke-linecap:butt;stroke-linejoin:round;stroke-miterlimit:100000"
             id="g103">
            <use
               height="100%"
               width="100%"
               id="use101"
               y="63.900002"
               xlink:href="#md20b04a11f"
               x="454.02911"
               style="stroke:#000000;stroke-width:0.5;stroke-linecap:butt;stroke-linejoin:round;stroke-miterlimit:100000" />
          </g>
        </g>
        <g
           style="stroke-linecap:butt;stroke-linejoin:round;stroke-miterlimit:100000"
           id="text_2">
          <!-- −100 -->
          <defs
             id="defs107">
            <path
               style="stroke-linecap:butt;stroke-linejoin:round;stroke-miterlimit:100000"
               inkscape:connector-curvature="0"
               id="BitstreamVeraSans-Roman-31"
               d="m 12.40625,8.296875 h 16.109375 v 55.625 L 10.984375,60.40625 v 8.984375 l 17.4375,3.515625 H 38.28125 V 8.296875 H 54.390625 V 0 H 12.40625 Z" />
          </defs>
          <g
             style="stroke-linecap:butt;stroke-linejoin:round;stroke-miterlimit:100000"
             id="g117"
             transform="matrix(0.12,0,0,-0.12,437.54879,588.21812)">
            <use
               height="100%"
               width="100%"
               y="0"
               x="0"
               style="stroke-linecap:butt;stroke-linejoin:round;stroke-miterlimit:100000"
               id="use109"
               xlink:href="#BitstreamVeraSans-Roman-2212" />
            <use
               height="100%"
               width="100%"
               y="0"
               style="stroke-linecap:butt;stroke-linejoin:round;stroke-miterlimit:100000"
               id="use111"
               xlink:href="#BitstreamVeraSans-Roman-31"
               x="83.789062" />
            <use
               height="100%"
               width="100%"
               y="0"
               style="stroke-linecap:butt;stroke-linejoin:round;stroke-miterlimit:100000"
               id="use113"
               xlink:href="#BitstreamVeraSans-Roman-30"
               x="147.41211" />
            <use
               height="100%"
               width="100%"
               y="0"
               style="stroke-linecap:butt;stroke-linejoin:round;stroke-miterlimit:100000"
               id="use115"
               xlink:href="#BitstreamVeraSans-Roman-30"
               x="211.03516" />
          </g>
        </g>
      </g>
      <g
         style="stroke-linecap:butt;stroke-linejoin:round;stroke-miterlimit:100000"
         id="xtick_3">
        <g
           style="stroke-linecap:butt;stroke-linejoin:round;stroke-miterlimit:100000"
           id="line2d_11">
          <g
             style="stroke-linecap:butt;stroke-linejoin:round;stroke-miterlimit:100000"
             id="g123">
            <use
               height="100%"
               width="100%"
               id="use121"
               y="575.09998"
               xlink:href="#m01ce130cbd"
               x="527.05768"
               style="stroke:#000000;stroke-width:0.5;stroke-linecap:butt;stroke-linejoin:round;stroke-miterlimit:100000" />
          </g>
        </g>
        <g
           style="stroke-linecap:butt;stroke-linejoin:round;stroke-miterlimit:100000"
           id="line2d_12">
          <g
             style="stroke-linecap:butt;stroke-linejoin:round;stroke-miterlimit:100000"
             id="g128">
            <use
               height="100%"
               width="100%"
               id="use126"
               y="63.900002"
               xlink:href="#md20b04a11f"
               x="527.05768"
               style="stroke:#000000;stroke-width:0.5;stroke-linecap:butt;stroke-linejoin:round;stroke-miterlimit:100000" />
          </g>
        </g>
        <g
           style="stroke-linecap:butt;stroke-linejoin:round;stroke-miterlimit:100000"
           id="text_3">
          <!-- 0 -->
          <g
             style="stroke-linecap:butt;stroke-linejoin:round;stroke-miterlimit:100000"
             id="g133"
             transform="matrix(0.12,0,0,-0.12,523.24018,588.21812)">
            <use
               height="100%"
               width="100%"
               y="0"
               x="0"
               style="stroke-linecap:butt;stroke-linejoin:round;stroke-miterlimit:100000"
               id="use131"
               xlink:href="#BitstreamVeraSans-Roman-30" />
          </g>
        </g>
      </g>
      <g
         style="stroke-linecap:butt;stroke-linejoin:round;stroke-miterlimit:100000"
         id="xtick_4">
        <g
           style="stroke-linecap:butt;stroke-linejoin:round;stroke-miterlimit:100000"
           id="line2d_13">
          <g
             style="stroke-linecap:butt;stroke-linejoin:round;stroke-miterlimit:100000"
             id="g139">
            <use
               height="100%"
               width="100%"
               id="use137"
               y="575.09998"
               xlink:href="#m01ce130cbd"
               x="600.08624"
               style="stroke:#000000;stroke-width:0.5;stroke-linecap:butt;stroke-linejoin:round;stroke-miterlimit:100000" />
          </g>
        </g>
        <g
           style="stroke-linecap:butt;stroke-linejoin:round;stroke-miterlimit:100000"
           id="line2d_14">
          <g
             style="stroke-linecap:butt;stroke-linejoin:round;stroke-miterlimit:100000"
             id="g144">
            <use
               height="100%"
               width="100%"
               id="use142"
               y="63.900002"
               xlink:href="#md20b04a11f"
               x="600.08624"
               style="stroke:#000000;stroke-width:0.5;stroke-linecap:butt;stroke-linejoin:round;stroke-miterlimit:100000" />
          </g>
        </g>
        <g
           style="stroke-linecap:butt;stroke-linejoin:round;stroke-miterlimit:100000"
           id="text_4">
          <!-- 100 -->
          <g
             style="stroke-linecap:butt;stroke-linejoin:round;stroke-miterlimit:100000"
             id="g153"
             transform="matrix(0.12,0,0,-0.12,588.63375,588.21812)">
            <use
               height="100%"
               width="100%"
               y="0"
               x="0"
               style="stroke-linecap:butt;stroke-linejoin:round;stroke-miterlimit:100000"
               id="use147"
               xlink:href="#BitstreamVeraSans-Roman-31" />
            <use
               height="100%"
               width="100%"
               y="0"
               style="stroke-linecap:butt;stroke-linejoin:round;stroke-miterlimit:100000"
               id="use149"
               xlink:href="#BitstreamVeraSans-Roman-30"
               x="63.623047" />
            <use
               height="100%"
               width="100%"
               y="0"
               style="stroke-linecap:butt;stroke-linejoin:round;stroke-miterlimit:100000"
               id="use151"
               xlink:href="#BitstreamVeraSans-Roman-30"
               x="127.24609" />
          </g>
        </g>
      </g>
      <g
         style="stroke-linecap:butt;stroke-linejoin:round;stroke-miterlimit:100000"
         id="xtick_5">
        <g
           style="stroke-linecap:butt;stroke-linejoin:round;stroke-miterlimit:100000"
           id="line2d_15">
          <g
             style="stroke-linecap:butt;stroke-linejoin:round;stroke-miterlimit:100000"
             id="g159">
            <use
               height="100%"
               width="100%"
               id="use157"
               y="575.09998"
               xlink:href="#m01ce130cbd"
               x="673.11481"
               style="stroke:#000000;stroke-width:0.5;stroke-linecap:butt;stroke-linejoin:round;stroke-miterlimit:100000" />
          </g>
        </g>
        <g
           style="stroke-linecap:butt;stroke-linejoin:round;stroke-miterlimit:100000"
           id="line2d_16">
          <g
             style="stroke-linecap:butt;stroke-linejoin:round;stroke-miterlimit:100000"
             id="g164">
            <use
               height="100%"
               width="100%"
               id="use162"
               y="63.900002"
               xlink:href="#md20b04a11f"
               x="673.11481"
               style="stroke:#000000;stroke-width:0.5;stroke-linecap:butt;stroke-linejoin:round;stroke-miterlimit:100000" />
          </g>
        </g>
        <g
           style="stroke-linecap:butt;stroke-linejoin:round;stroke-miterlimit:100000"
           id="text_5">
          <!-- 200 -->
          <g
             style="stroke-linecap:butt;stroke-linejoin:round;stroke-miterlimit:100000"
             id="g173"
             transform="matrix(0.12,0,0,-0.12,661.66232,588.21812)">
            <use
               height="100%"
               width="100%"
               y="0"
               x="0"
               style="stroke-linecap:butt;stroke-linejoin:round;stroke-miterlimit:100000"
               id="use167"
               xlink:href="#BitstreamVeraSans-Roman-32" />
            <use
               height="100%"
               width="100%"
               y="0"
               style="stroke-linecap:butt;stroke-linejoin:round;stroke-miterlimit:100000"
               id="use169"
               xlink:href="#BitstreamVeraSans-Roman-30"
               x="63.623047" />
            <use
               height="100%"
               width="100%"
               y="0"
               style="stroke-linecap:butt;stroke-linejoin:round;stroke-miterlimit:100000"
               id="use171"
               xlink:href="#BitstreamVeraSans-Roman-30"
               x="127.24609" />
          </g>
        </g>
      </g>
      <g
         style="stroke-linecap:butt;stroke-linejoin:round;stroke-miterlimit:100000"
         id="xtick_6">
        <g
           style="stroke-linecap:butt;stroke-linejoin:round;stroke-miterlimit:100000"
           id="line2d_17">
          <g
             style="stroke-linecap:butt;stroke-linejoin:round;stroke-miterlimit:100000"
             id="g179">
            <use
               height="100%"
               width="100%"
               id="use177"
               y="575.09998"
               xlink:href="#m01ce130cbd"
               x="746.14337"
               style="stroke:#000000;stroke-width:0.5;stroke-linecap:butt;stroke-linejoin:round;stroke-miterlimit:100000" />
          </g>
        </g>
        <g
           style="stroke-linecap:butt;stroke-linejoin:round;stroke-miterlimit:100000"
           id="line2d_18">
          <g
             style="stroke-linecap:butt;stroke-linejoin:round;stroke-miterlimit:100000"
             id="g184">
            <use
               height="100%"
               width="100%"
               id="use182"
               y="63.900002"
               xlink:href="#md20b04a11f"
               x="746.14337"
               style="stroke:#000000;stroke-width:0.5;stroke-linecap:butt;stroke-linejoin:round;stroke-miterlimit:100000" />
          </g>
        </g>
        <g
           style="stroke-linecap:butt;stroke-linejoin:round;stroke-miterlimit:100000"
           id="text_6">
          <!-- 300 -->
          <defs
             id="defs188">
            <path
               style="stroke-linecap:butt;stroke-linejoin:round;stroke-miterlimit:100000"
               inkscape:connector-curvature="0"
               id="BitstreamVeraSans-Roman-33"
               d="M 40.578125,39.3125 Q 47.65625,37.796875 51.625,33 q 3.984375,-4.78125 3.984375,-11.8125 0,-10.78125 -7.421875,-16.703125 -7.421875,-5.90625 -21.09375,-5.90625 -4.578125,0 -9.4375,0.90625 -4.859375,0.90625 -10.03125,2.71875 v 9.515625 q 4.09375,-2.390625 8.96875,-3.609375 4.890625,-1.21875 10.21875,-1.21875 9.265625,0 14.125,3.65625 4.859375,3.65625 4.859375,10.640625 0,6.453125 -4.515625,10.078125 -4.515625,3.640625 -12.5625,3.640625 h -8.5 v 8.109375 h 8.890625 q 7.265625,0 11.125,2.90625 3.859375,2.90625 3.859375,8.375 0,5.609375 -3.984375,8.609375 -3.96875,3.015625 -11.390625,3.015625 -4.0625,0 -8.703125,-0.890625 Q 15.375,64.15625 9.8125,62.3125 v 8.78125 q 5.625,1.5625 10.53125,2.34375 4.90625,0.78125 9.25,0.78125 11.234375,0 17.765625,-5.109375 6.546875,-5.09375 6.546875,-13.78125 0,-6.0625 -3.46875,-10.234375 -3.46875,-4.171875 -9.859375,-5.78125" />
          </defs>
          <g
             style="stroke-linecap:butt;stroke-linejoin:round;stroke-miterlimit:100000"
             id="g196"
             transform="matrix(0.12,0,0,-0.12,734.69089,588.21812)">
            <use
               height="100%"
               width="100%"
               y="0"
               x="0"
               style="stroke-linecap:butt;stroke-linejoin:round;stroke-miterlimit:100000"
               id="use190"
               xlink:href="#BitstreamVeraSans-Roman-33" />
            <use
               height="100%"
               width="100%"
               y="0"
               style="stroke-linecap:butt;stroke-linejoin:round;stroke-miterlimit:100000"
               id="use192"
               xlink:href="#BitstreamVeraSans-Roman-30"
               x="63.623047" />
            <use
               height="100%"
               width="100%"
               y="0"
               style="stroke-linecap:butt;stroke-linejoin:round;stroke-miterlimit:100000"
               id="use194"
               xlink:href="#BitstreamVeraSans-Roman-30"
               x="127.24609" />
          </g>
        </g>
      </g>
      <g
         style="stroke-linecap:butt;stroke-linejoin:round;stroke-miterlimit:100000"
         id="xtick_7">
        <g
           style="stroke-linecap:butt;stroke-linejoin:round;stroke-miterlimit:100000"
           id="line2d_19">
          <g
             style="stroke-linecap:butt;stroke-linejoin:round;stroke-miterlimit:100000"
             id="g202">
            <use
               height="100%"
               width="100%"
               id="use200"
               y="575.09998"
               xlink:href="#m01ce130cbd"
               x="819.17194"
               style="stroke:#000000;stroke-width:0.5;stroke-linecap:butt;stroke-linejoin:round;stroke-miterlimit:100000" />
          </g>
        </g>
        <g
           style="stroke-linecap:butt;stroke-linejoin:round;stroke-miterlimit:100000"
           id="line2d_20">
          <g
             style="stroke-linecap:butt;stroke-linejoin:round;stroke-miterlimit:100000"
             id="g207">
            <use
               height="100%"
               width="100%"
               id="use205"
               y="63.900002"
               xlink:href="#md20b04a11f"
               x="819.17194"
               style="stroke:#000000;stroke-width:0.5;stroke-linecap:butt;stroke-linejoin:round;stroke-miterlimit:100000" />
          </g>
        </g>
        <g
           style="stroke-linecap:butt;stroke-linejoin:round;stroke-miterlimit:100000"
           id="text_7">
          <!-- 400 -->
          <defs
             id="defs211">
            <path
               style="stroke-linecap:butt;stroke-linejoin:round;stroke-miterlimit:100000"
               inkscape:connector-curvature="0"
               id="BitstreamVeraSans-Roman-34"
               d="M 37.796875,64.3125 12.890625,25.390625 h 24.90625 z m -2.59375,8.59375 h 12.40625 V 25.390625 h 10.40625 V 17.1875 H 47.609375 V 0 h -9.8125 V 17.1875 H 4.890625 v 9.515625 z" />
          </defs>
          <g
             style="stroke-linecap:butt;stroke-linejoin:round;stroke-miterlimit:100000"
             id="g219"
             transform="matrix(0.12,0,0,-0.12,807.71946,588.21812)">
            <use
               height="100%"
               width="100%"
               y="0"
               x="0"
               style="stroke-linecap:butt;stroke-linejoin:round;stroke-miterlimit:100000"
               id="use213"
               xlink:href="#BitstreamVeraSans-Roman-34" />
            <use
               height="100%"
               width="100%"
               y="0"
               style="stroke-linecap:butt;stroke-linejoin:round;stroke-miterlimit:100000"
               id="use215"
               xlink:href="#BitstreamVeraSans-Roman-30"
               x="63.623047" />
            <use
               height="100%"
               width="100%"
               y="0"
               style="stroke-linecap:butt;stroke-linejoin:round;stroke-miterlimit:100000"
               id="use217"
               xlink:href="#BitstreamVeraSans-Roman-30"
               x="127.24609" />
          </g>
        </g>
      </g>
      <g
         style="stroke-linecap:butt;stroke-linejoin:round;stroke-miterlimit:100000"
         id="text_8">
        <!-- x (m) -->
        <defs
           id="defs228">
          <path
             style="stroke-linecap:butt;stroke-linejoin:round;stroke-miterlimit:100000"
             inkscape:connector-curvature="0"
             id="BitstreamVeraSans-Roman-29"
             d="m 8.015625,75.875 h 7.8125 q 7.3125,-11.515625 10.953125,-22.5625 3.640625,-11.03125 3.640625,-21.921875 0,-10.9375 -3.640625,-22.015625 -3.640625,-11.078125 -10.953125,-22.5625 h -7.8125 Q 14.5,-2 17.703125,9.0625 20.90625,20.125 20.90625,31.390625 q 0,11.28125 -3.203125,22.265625 -3.203125,11 -9.6875,22.21875" />
          <path
             style="stroke-linecap:butt;stroke-linejoin:round;stroke-miterlimit:100000"
             inkscape:connector-curvature="0"
             d=""
             id="BitstreamVeraSans-Roman-20" />
          <path
             style="stroke-linecap:butt;stroke-linejoin:round;stroke-miterlimit:100000"
             inkscape:connector-curvature="0"
             id="BitstreamVeraSans-Roman-6d"
             d="M 52,44.1875 Q 55.375,50.25 60.0625,53.125 64.75,56 71.09375,56 q 8.546875,0 13.1875,-5.984375 4.640625,-5.96875 4.640625,-17 V 0 h -9.03125 v 32.71875 q 0,7.859375 -2.796875,11.65625 -2.78125,3.8125 -8.484375,3.8125 -6.984375,0 -11.046875,-4.640625 -4.046875,-4.625 -4.046875,-12.640625 V 0 h -9.03125 v 32.71875 q 0,7.90625 -2.78125,11.6875 -2.78125,3.78125 -8.59375,3.78125 -6.890625,0 -10.953125,-4.65625 -4.046875,-4.65625 -4.046875,-12.625 V 0 h -9.03125 v 54.6875 h 9.03125 v -8.5 q 3.078125,5.03125 7.375,7.421875 Q 29.78125,56 35.6875,56 41.65625,56 45.828125,52.96875 50,49.953125 52,44.1875" />
          <path
             style="stroke-linecap:butt;stroke-linejoin:round;stroke-miterlimit:100000"
             inkscape:connector-curvature="0"
             id="BitstreamVeraSans-Roman-78"
             d="M 54.890625,54.6875 35.109375,28.078125 55.90625,0 H 45.3125 L 29.390625,21.484375 13.484375,0 H 2.875 L 24.125,28.609375 4.6875,54.6875 h 10.59375 l 14.5,-19.484375 14.5,19.484375 z" />
          <path
             style="stroke-linecap:butt;stroke-linejoin:round;stroke-miterlimit:100000"
             inkscape:connector-curvature="0"
             id="BitstreamVeraSans-Roman-28"
             d="M 31,75.875 Q 24.46875,64.65625 21.28125,53.65625 18.109375,42.671875 18.109375,31.390625 18.109375,20.125 21.3125,9.0625 24.515625,-2 31,-13.1875 H 23.1875 Q 15.875,-1.703125 12.234375,9.375 8.59375,20.453125 8.59375,31.390625 q 0,10.890625 3.609375,21.921875 3.625,11.046875 10.984375,22.5625 z" />
        </defs>
        <g
           style="stroke-linecap:butt;stroke-linejoin:round;stroke-miterlimit:100000"
           id="g240"
           transform="matrix(0.12,0,0,-0.12,584.10187,604.83187)">
          <use
             height="100%"
             width="100%"
             y="0"
             x="0"
             style="stroke-linecap:butt;stroke-linejoin:round;stroke-miterlimit:100000"
             id="use230"
             xlink:href="#BitstreamVeraSans-Roman-78" />
          <use
             height="100%"
             width="100%"
             y="0"
             style="stroke-linecap:butt;stroke-linejoin:round;stroke-miterlimit:100000"
             id="use232"
             xlink:href="#BitstreamVeraSans-Roman-20"
             x="59.179688" />
          <use
             height="100%"
             width="100%"
             y="0"
             style="stroke-linecap:butt;stroke-linejoin:round;stroke-miterlimit:100000"
             id="use234"
             xlink:href="#BitstreamVeraSans-Roman-28"
             x="90.966797" />
          <use
             height="100%"
             width="100%"
             y="0"
             style="stroke-linecap:butt;stroke-linejoin:round;stroke-miterlimit:100000"
             id="use236"
             xlink:href="#BitstreamVeraSans-Roman-6d"
             x="129.98047" />
          <use
             height="100%"
             width="100%"
             y="0"
             style="stroke-linecap:butt;stroke-linejoin:round;stroke-miterlimit:100000"
             id="use238"
             xlink:href="#BitstreamVeraSans-Roman-29"
             x="227.39258" />
        </g>
      </g>
    </g>
    <g
       style="stroke-linecap:butt;stroke-linejoin:round;stroke-miterlimit:100000"
       id="matplotlib.axis_2">
      <g
         style="stroke-linecap:butt;stroke-linejoin:round;stroke-miterlimit:100000"
         id="ytick_1">
        <g
           style="stroke-linecap:butt;stroke-linejoin:round;stroke-miterlimit:100000"
           id="line2d_21">
          <defs
             id="defs245">
            <path
               inkscape:connector-curvature="0"
               style="stroke:#000000;stroke-width:0.5;stroke-linecap:butt;stroke-linejoin:round;stroke-miterlimit:100000"
               id="m84bf2c1953"
               d="M 0,0 H 4" />
          </defs>
          <g
             style="stroke-linecap:butt;stroke-linejoin:round;stroke-miterlimit:100000"
             id="g249">
            <use
               height="100%"
               width="100%"
               id="use247"
               y="575.09998"
               xlink:href="#m84bf2c1953"
               x="381.00055"
               style="stroke:#000000;stroke-width:0.5;stroke-linecap:butt;stroke-linejoin:round;stroke-miterlimit:100000" />
          </g>
        </g>
        <g
           style="stroke-linecap:butt;stroke-linejoin:round;stroke-miterlimit:100000"
           id="line2d_22">
          <defs
             id="defs253">
            <path
               inkscape:connector-curvature="0"
               style="stroke:#000000;stroke-width:0.5;stroke-linecap:butt;stroke-linejoin:round;stroke-miterlimit:100000"
               id="m7b49c80157"
               d="M 0,0 H -4" />
          </defs>
          <g
             style="stroke-linecap:butt;stroke-linejoin:round;stroke-miterlimit:100000"
             id="g257">
            <use
               height="100%"
               width="100%"
               id="use255"
               y="575.09998"
               xlink:href="#m7b49c80157"
               x="819.17194"
               style="stroke:#000000;stroke-width:0.5;stroke-linecap:butt;stroke-linejoin:round;stroke-miterlimit:100000" />
          </g>
        </g>
        <g
           style="stroke-linecap:butt;stroke-linejoin:round;stroke-miterlimit:100000"
           id="text_9">
          <!-- −100 -->
          <g
             style="stroke-linecap:butt;stroke-linejoin:round;stroke-miterlimit:100000"
             id="g268"
             transform="matrix(0.12,0,0,-0.12,344.03991,578.41125)">
            <use
               height="100%"
               width="100%"
               y="0"
               x="0"
               style="stroke-linecap:butt;stroke-linejoin:round;stroke-miterlimit:100000"
               id="use260"
               xlink:href="#BitstreamVeraSans-Roman-2212" />
            <use
               height="100%"
               width="100%"
               y="0"
               style="stroke-linecap:butt;stroke-linejoin:round;stroke-miterlimit:100000"
               id="use262"
               xlink:href="#BitstreamVeraSans-Roman-31"
               x="83.789062" />
            <use
               height="100%"
               width="100%"
               y="0"
               style="stroke-linecap:butt;stroke-linejoin:round;stroke-miterlimit:100000"
               id="use264"
               xlink:href="#BitstreamVeraSans-Roman-30"
               x="147.41211" />
            <use
               height="100%"
               width="100%"
               y="0"
               style="stroke-linecap:butt;stroke-linejoin:round;stroke-miterlimit:100000"
               id="use266"
               xlink:href="#BitstreamVeraSans-Roman-30"
               x="211.03516" />
          </g>
        </g>
      </g>
      <g
         style="stroke-linecap:butt;stroke-linejoin:round;stroke-miterlimit:100000"
         id="ytick_2">
        <g
           style="stroke-linecap:butt;stroke-linejoin:round;stroke-miterlimit:100000"
           id="line2d_23">
          <g
             style="stroke-linecap:butt;stroke-linejoin:round;stroke-miterlimit:100000"
             id="g274">
            <use
               height="100%"
               width="100%"
               id="use272"
               y="502.07144"
               xlink:href="#m84bf2c1953"
               x="381.00055"
               style="stroke:#000000;stroke-width:0.5;stroke-linecap:butt;stroke-linejoin:round;stroke-miterlimit:100000" />
          </g>
        </g>
        <g
           style="stroke-linecap:butt;stroke-linejoin:round;stroke-miterlimit:100000"
           id="line2d_24">
          <g
             style="stroke-linecap:butt;stroke-linejoin:round;stroke-miterlimit:100000"
             id="g279">
            <use
               height="100%"
               width="100%"
               id="use277"
               y="502.07144"
               xlink:href="#m7b49c80157"
               x="819.17194"
               style="stroke:#000000;stroke-width:0.5;stroke-linecap:butt;stroke-linejoin:round;stroke-miterlimit:100000" />
          </g>
        </g>
        <g
           style="stroke-linecap:butt;stroke-linejoin:round;stroke-miterlimit:100000"
           id="text_10">
          <!-- 0 -->
          <g
             style="stroke-linecap:butt;stroke-linejoin:round;stroke-miterlimit:100000"
             id="g284"
             transform="matrix(0.12,0,0,-0.12,369.36554,505.38268)">
            <use
               height="100%"
               width="100%"
               y="0"
               x="0"
               style="stroke-linecap:butt;stroke-linejoin:round;stroke-miterlimit:100000"
               id="use282"
               xlink:href="#BitstreamVeraSans-Roman-30" />
          </g>
        </g>
      </g>
      <g
         style="stroke-linecap:butt;stroke-linejoin:round;stroke-miterlimit:100000"
         id="ytick_3">
        <g
           style="stroke-linecap:butt;stroke-linejoin:round;stroke-miterlimit:100000"
           id="line2d_25">
          <g
             style="stroke-linecap:butt;stroke-linejoin:round;stroke-miterlimit:100000"
             id="g290">
            <use
               height="100%"
               width="100%"
               id="use288"
               y="429.04285"
               xlink:href="#m84bf2c1953"
               x="381.00055"
               style="stroke:#000000;stroke-width:0.5;stroke-linecap:butt;stroke-linejoin:round;stroke-miterlimit:100000" />
          </g>
        </g>
        <g
           style="stroke-linecap:butt;stroke-linejoin:round;stroke-miterlimit:100000"
           id="line2d_26">
          <g
             style="stroke-linecap:butt;stroke-linejoin:round;stroke-miterlimit:100000"
             id="g295">
            <use
               height="100%"
               width="100%"
               id="use293"
               y="429.04285"
               xlink:href="#m7b49c80157"
               x="819.17194"
               style="stroke:#000000;stroke-width:0.5;stroke-linecap:butt;stroke-linejoin:round;stroke-miterlimit:100000" />
          </g>
        </g>
        <g
           style="stroke-linecap:butt;stroke-linejoin:round;stroke-miterlimit:100000"
           id="text_11">
          <!-- 100 -->
          <g
             style="stroke-linecap:butt;stroke-linejoin:round;stroke-miterlimit:100000"
             id="g304"
             transform="matrix(0.12,0,0,-0.12,354.09554,432.35411)">
            <use
               height="100%"
               width="100%"
               y="0"
               x="0"
               style="stroke-linecap:butt;stroke-linejoin:round;stroke-miterlimit:100000"
               id="use298"
               xlink:href="#BitstreamVeraSans-Roman-31" />
            <use
               height="100%"
               width="100%"
               y="0"
               style="stroke-linecap:butt;stroke-linejoin:round;stroke-miterlimit:100000"
               id="use300"
               xlink:href="#BitstreamVeraSans-Roman-30"
               x="63.623047" />
            <use
               height="100%"
               width="100%"
               y="0"
               style="stroke-linecap:butt;stroke-linejoin:round;stroke-miterlimit:100000"
               id="use302"
               xlink:href="#BitstreamVeraSans-Roman-30"
               x="127.24609" />
          </g>
        </g>
      </g>
      <g
         style="stroke-linecap:butt;stroke-linejoin:round;stroke-miterlimit:100000"
         id="ytick_4">
        <g
           style="stroke-linecap:butt;stroke-linejoin:round;stroke-miterlimit:100000"
           id="line2d_27">
          <g
             style="stroke-linecap:butt;stroke-linejoin:round;stroke-miterlimit:100000"
             id="g310">
            <use
               height="100%"
               width="100%"
               id="use308"
               y="356.01428"
               xlink:href="#m84bf2c1953"
               x="381.00055"
               style="stroke:#000000;stroke-width:0.5;stroke-linecap:butt;stroke-linejoin:round;stroke-miterlimit:100000" />
          </g>
        </g>
        <g
           style="stroke-linecap:butt;stroke-linejoin:round;stroke-miterlimit:100000"
           id="line2d_28">
          <g
             style="stroke-linecap:butt;stroke-linejoin:round;stroke-miterlimit:100000"
             id="g315">
            <use
               height="100%"
               width="100%"
               id="use313"
               y="356.01428"
               xlink:href="#m7b49c80157"
               x="819.17194"
               style="stroke:#000000;stroke-width:0.5;stroke-linecap:butt;stroke-linejoin:round;stroke-miterlimit:100000" />
          </g>
        </g>
        <g
           style="stroke-linecap:butt;stroke-linejoin:round;stroke-miterlimit:100000"
           id="text_12">
          <!-- 200 -->
          <g
             style="stroke-linecap:butt;stroke-linejoin:round;stroke-miterlimit:100000"
             id="g324"
             transform="matrix(0.12,0,0,-0.12,354.09554,359.32554)">
            <use
               height="100%"
               width="100%"
               y="0"
               x="0"
               style="stroke-linecap:butt;stroke-linejoin:round;stroke-miterlimit:100000"
               id="use318"
               xlink:href="#BitstreamVeraSans-Roman-32" />
            <use
               height="100%"
               width="100%"
               y="0"
               style="stroke-linecap:butt;stroke-linejoin:round;stroke-miterlimit:100000"
               id="use320"
               xlink:href="#BitstreamVeraSans-Roman-30"
               x="63.623047" />
            <use
               height="100%"
               width="100%"
               y="0"
               style="stroke-linecap:butt;stroke-linejoin:round;stroke-miterlimit:100000"
               id="use322"
               xlink:href="#BitstreamVeraSans-Roman-30"
               x="127.24609" />
          </g>
        </g>
      </g>
      <g
         style="stroke-linecap:butt;stroke-linejoin:round;stroke-miterlimit:100000"
         id="ytick_5">
        <g
           style="stroke-linecap:butt;stroke-linejoin:round;stroke-miterlimit:100000"
           id="line2d_29">
          <g
             style="stroke-linecap:butt;stroke-linejoin:round;stroke-miterlimit:100000"
             id="g330">
            <use
               height="100%"
               width="100%"
               id="use328"
               y="282.98572"
               xlink:href="#m84bf2c1953"
               x="381.00055"
               style="stroke:#000000;stroke-width:0.5;stroke-linecap:butt;stroke-linejoin:round;stroke-miterlimit:100000" />
          </g>
        </g>
        <g
           style="stroke-linecap:butt;stroke-linejoin:round;stroke-miterlimit:100000"
           id="line2d_30">
          <g
             style="stroke-linecap:butt;stroke-linejoin:round;stroke-miterlimit:100000"
             id="g335">
            <use
               height="100%"
               width="100%"
               id="use333"
               y="282.98572"
               xlink:href="#m7b49c80157"
               x="819.17194"
               style="stroke:#000000;stroke-width:0.5;stroke-linecap:butt;stroke-linejoin:round;stroke-miterlimit:100000" />
          </g>
        </g>
        <g
           style="stroke-linecap:butt;stroke-linejoin:round;stroke-miterlimit:100000"
           id="text_13">
          <!-- 300 -->
          <g
             style="stroke-linecap:butt;stroke-linejoin:round;stroke-miterlimit:100000"
             id="g344"
             transform="matrix(0.12,0,0,-0.12,354.09554,286.29696)">
            <use
               height="100%"
               width="100%"
               y="0"
               x="0"
               style="stroke-linecap:butt;stroke-linejoin:round;stroke-miterlimit:100000"
               id="use338"
               xlink:href="#BitstreamVeraSans-Roman-33" />
            <use
               height="100%"
               width="100%"
               y="0"
               style="stroke-linecap:butt;stroke-linejoin:round;stroke-miterlimit:100000"
               id="use340"
               xlink:href="#BitstreamVeraSans-Roman-30"
               x="63.623047" />
            <use
               height="100%"
               width="100%"
               y="0"
               style="stroke-linecap:butt;stroke-linejoin:round;stroke-miterlimit:100000"
               id="use342"
               xlink:href="#BitstreamVeraSans-Roman-30"
               x="127.24609" />
          </g>
        </g>
      </g>
      <g
         style="stroke-linecap:butt;stroke-linejoin:round;stroke-miterlimit:100000"
         id="ytick_6">
        <g
           style="stroke-linecap:butt;stroke-linejoin:round;stroke-miterlimit:100000"
           id="line2d_31">
          <g
             style="stroke-linecap:butt;stroke-linejoin:round;stroke-miterlimit:100000"
             id="g350">
            <use
               height="100%"
               width="100%"
               id="use348"
               y="209.95714"
               xlink:href="#m84bf2c1953"
               x="381.00055"
               style="stroke:#000000;stroke-width:0.5;stroke-linecap:butt;stroke-linejoin:round;stroke-miterlimit:100000" />
          </g>
        </g>
        <g
           style="stroke-linecap:butt;stroke-linejoin:round;stroke-miterlimit:100000"
           id="line2d_32">
          <g
             style="stroke-linecap:butt;stroke-linejoin:round;stroke-miterlimit:100000"
             id="g355">
            <use
               height="100%"
               width="100%"
               id="use353"
               y="209.95714"
               xlink:href="#m7b49c80157"
               x="819.17194"
               style="stroke:#000000;stroke-width:0.5;stroke-linecap:butt;stroke-linejoin:round;stroke-miterlimit:100000" />
          </g>
        </g>
        <g
           style="stroke-linecap:butt;stroke-linejoin:round;stroke-miterlimit:100000"
           id="text_14">
          <!-- 400 -->
          <g
             style="stroke-linecap:butt;stroke-linejoin:round;stroke-miterlimit:100000"
             id="g364"
             transform="matrix(0.12,0,0,-0.12,354.09554,213.26839)">
            <use
               height="100%"
               width="100%"
               y="0"
               x="0"
               style="stroke-linecap:butt;stroke-linejoin:round;stroke-miterlimit:100000"
               id="use358"
               xlink:href="#BitstreamVeraSans-Roman-34" />
            <use
               height="100%"
               width="100%"
               y="0"
               style="stroke-linecap:butt;stroke-linejoin:round;stroke-miterlimit:100000"
               id="use360"
               xlink:href="#BitstreamVeraSans-Roman-30"
               x="63.623047" />
            <use
               height="100%"
               width="100%"
               y="0"
               style="stroke-linecap:butt;stroke-linejoin:round;stroke-miterlimit:100000"
               id="use362"
               xlink:href="#BitstreamVeraSans-Roman-30"
               x="127.24609" />
          </g>
        </g>
      </g>
      <g
         style="stroke-linecap:butt;stroke-linejoin:round;stroke-miterlimit:100000"
         id="ytick_7">
        <g
           style="stroke-linecap:butt;stroke-linejoin:round;stroke-miterlimit:100000"
           id="line2d_33">
          <g
             style="stroke-linecap:butt;stroke-linejoin:round;stroke-miterlimit:100000"
             id="g370">
            <use
               height="100%"
               width="100%"
               id="use368"
               y="136.92857"
               xlink:href="#m84bf2c1953"
               x="381.00055"
               style="stroke:#000000;stroke-width:0.5;stroke-linecap:butt;stroke-linejoin:round;stroke-miterlimit:100000" />
          </g>
        </g>
        <g
           style="stroke-linecap:butt;stroke-linejoin:round;stroke-miterlimit:100000"
           id="line2d_34">
          <g
             style="stroke-linecap:butt;stroke-linejoin:round;stroke-miterlimit:100000"
             id="g375">
            <use
               height="100%"
               width="100%"
               id="use373"
               y="136.92857"
               xlink:href="#m7b49c80157"
               x="819.17194"
               style="stroke:#000000;stroke-width:0.5;stroke-linecap:butt;stroke-linejoin:round;stroke-miterlimit:100000" />
          </g>
        </g>
        <g
           style="stroke-linecap:butt;stroke-linejoin:round;stroke-miterlimit:100000"
           id="text_15">
          <!-- 500 -->
          <defs
             id="defs379">
            <path
               style="stroke-linecap:butt;stroke-linejoin:round;stroke-miterlimit:100000"
               inkscape:connector-curvature="0"
               id="BitstreamVeraSans-Roman-35"
               d="m 10.796875,72.90625 h 38.71875 v -8.3125 h -29.6875 V 46.734375 q 2.140625,0.734375 4.28125,1.09375 2.15625,0.359375 4.3125,0.359375 Q 40.625,48.1875 47.75,41.5 54.890625,34.8125 54.890625,23.390625 54.890625,11.625 47.5625,5.09375 40.234375,-1.421875 26.90625,-1.421875 q -4.59375,0 -9.359375,0.78125 -4.75,0.78125 -9.828125,2.34375 V 11.625 q 4.390625,-2.390625 9.078125,-3.5625 4.6875,-1.171875 9.90625,-1.171875 8.453125,0 13.375,4.4375 4.9375,4.4375 4.9375,12.0625 0,7.609375 -4.9375,12.046875 -4.921875,4.453125 -13.375,4.453125 -3.953125,0 -7.890625,-0.875 -3.921875,-0.875 -8.015625,-2.734375 z" />
          </defs>
          <g
             style="stroke-linecap:butt;stroke-linejoin:round;stroke-miterlimit:100000"
             id="g387"
             transform="matrix(0.12,0,0,-0.12,354.09554,140.23982)">
            <use
               height="100%"
               width="100%"
               y="0"
               x="0"
               style="stroke-linecap:butt;stroke-linejoin:round;stroke-miterlimit:100000"
               id="use381"
               xlink:href="#BitstreamVeraSans-Roman-35" />
            <use
               height="100%"
               width="100%"
               y="0"
               style="stroke-linecap:butt;stroke-linejoin:round;stroke-miterlimit:100000"
               id="use383"
               xlink:href="#BitstreamVeraSans-Roman-30"
               x="63.623047" />
            <use
               height="100%"
               width="100%"
               y="0"
               style="stroke-linecap:butt;stroke-linejoin:round;stroke-miterlimit:100000"
               id="use385"
               xlink:href="#BitstreamVeraSans-Roman-30"
               x="127.24609" />
          </g>
        </g>
      </g>
      <g
         style="stroke-linecap:butt;stroke-linejoin:round;stroke-miterlimit:100000"
         id="ytick_8">
        <g
           style="stroke-linecap:butt;stroke-linejoin:round;stroke-miterlimit:100000"
           id="line2d_35">
          <g
             style="stroke-linecap:butt;stroke-linejoin:round;stroke-miterlimit:100000"
             id="g393">
            <use
               height="100%"
               width="100%"
               id="use391"
               y="63.900002"
               xlink:href="#m84bf2c1953"
               x="381.00055"
               style="stroke:#000000;stroke-width:0.5;stroke-linecap:butt;stroke-linejoin:round;stroke-miterlimit:100000" />
          </g>
        </g>
        <g
           style="stroke-linecap:butt;stroke-linejoin:round;stroke-miterlimit:100000"
           id="line2d_36">
          <g
             style="stroke-linecap:butt;stroke-linejoin:round;stroke-miterlimit:100000"
             id="g398">
            <use
               height="100%"
               width="100%"
               id="use396"
               y="63.900002"
               xlink:href="#m7b49c80157"
               x="819.17194"
               style="stroke:#000000;stroke-width:0.5;stroke-linecap:butt;stroke-linejoin:round;stroke-miterlimit:100000" />
          </g>
        </g>
        <g
           style="stroke-linecap:butt;stroke-linejoin:round;stroke-miterlimit:100000"
           id="text_16">
          <!-- 600 -->
          <defs
             id="defs402">
            <path
               style="stroke-linecap:butt;stroke-linejoin:round;stroke-miterlimit:100000"
               inkscape:connector-curvature="0"
               id="BitstreamVeraSans-Roman-36"
               d="m 33.015625,40.375 q -6.640625,0 -10.53125,-4.546875 -3.875,-4.53125 -3.875,-12.4375 0,-7.859375 3.875,-12.4375 3.890625,-4.5625 10.53125,-4.5625 6.640625,0 10.515625,4.5625 3.875,4.578125 3.875,12.4375 0,7.90625 -3.875,12.4375 Q 39.65625,40.375 33.015625,40.375 M 52.59375,71.296875 V 62.3125 q -3.71875,1.75 -7.5,2.671875 -3.78125,0.9375 -7.5,0.9375 -9.765625,0 -14.921875,-6.59375 -5.140625,-6.59375 -5.875,-19.921875 2.875,4.25 7.21875,6.515625 4.359375,2.265625 9.578125,2.265625 10.984375,0 17.359375,-6.671875 6.375,-6.65625 6.375,-18.125 0,-11.234375 -6.640625,-18.03125 -6.640625,-6.78125 -17.671875,-6.78125 -12.65625,0 -19.34375,9.6875 -6.6875,9.703125 -6.6875,28.109375 0,17.28125 8.203125,27.5625 8.203125,10.28125 22.015625,10.28125 3.71875,0 7.5,-0.734375 3.78125,-0.734375 7.890625,-2.1875" />
          </defs>
          <g
             style="stroke-linecap:butt;stroke-linejoin:round;stroke-miterlimit:100000"
             id="g410"
             transform="matrix(0.12,0,0,-0.12,354.09554,67.21125)">
            <use
               height="100%"
               width="100%"
               y="0"
               x="0"
               style="stroke-linecap:butt;stroke-linejoin:round;stroke-miterlimit:100000"
               id="use404"
               xlink:href="#BitstreamVeraSans-Roman-36" />
            <use
               height="100%"
               width="100%"
               y="0"
               style="stroke-linecap:butt;stroke-linejoin:round;stroke-miterlimit:100000"
               id="use406"
               xlink:href="#BitstreamVeraSans-Roman-30"
               x="63.623047" />
            <use
               height="100%"
               width="100%"
               y="0"
               style="stroke-linecap:butt;stroke-linejoin:round;stroke-miterlimit:100000"
               id="use408"
               xlink:href="#BitstreamVeraSans-Roman-30"
               x="127.24609" />
          </g>
        </g>
      </g>
      <g
         style="stroke-linecap:butt;stroke-linejoin:round;stroke-miterlimit:100000"
         id="text_17">
        <!-- z (m) -->
        <defs
           id="defs415">
          <path
             style="stroke-linecap:butt;stroke-linejoin:round;stroke-miterlimit:100000"
             inkscape:connector-curvature="0"
             id="BitstreamVeraSans-Roman-7a"
             d="M 5.515625,54.6875 H 48.1875 V 46.484375 L 14.40625,7.171875 H 48.1875 V 0 H 4.296875 v 8.203125 l 33.796875,39.3125 H 5.515625 Z" />
        </defs>
        <g
           style="stroke-linecap:butt;stroke-linejoin:round;stroke-miterlimit:100000"
           id="g427"
           transform="matrix(0,-0.12,-0.12,0,336.54429,335.08219)">
          <use
             height="100%"
             width="100%"
             y="0"
             x="0"
             style="stroke-linecap:butt;stroke-linejoin:round;stroke-miterlimit:100000"
             id="use417"
             xlink:href="#BitstreamVeraSans-Roman-7a" />
          <use
             height="100%"
             width="100%"
             y="0"
             style="stroke-linecap:butt;stroke-linejoin:round;stroke-miterlimit:100000"
             id="use419"
             xlink:href="#BitstreamVeraSans-Roman-20"
             x="52.490234" />
          <use
             height="100%"
             width="100%"
             y="0"
             style="stroke-linecap:butt;stroke-linejoin:round;stroke-miterlimit:100000"
             id="use421"
             xlink:href="#BitstreamVeraSans-Roman-28"
             x="84.277344" />
          <use
             height="100%"
             width="100%"
             y="0"
             style="stroke-linecap:butt;stroke-linejoin:round;stroke-miterlimit:100000"
             id="use423"
             xlink:href="#BitstreamVeraSans-Roman-6d"
             x="123.29102" />
          <use
             height="100%"
             width="100%"
             y="0"
             style="stroke-linecap:butt;stroke-linejoin:round;stroke-miterlimit:100000"
             id="use425"
             xlink:href="#BitstreamVeraSans-Roman-29"
             x="220.70312" />
        </g>
      </g>
    </g>
    <g
       style="stroke-linecap:butt;stroke-linejoin:round;stroke-miterlimit:100000"
       id="legend_1">
      <g
         style="stroke-linecap:butt;stroke-linejoin:round;stroke-miterlimit:100000"
         id="patch_7">
        <path
           inkscape:connector-curvature="0"
           id="path431"
           style="fill:#ffffff;stroke:#000000;stroke-linecap:butt;stroke-linejoin:miter;stroke-miterlimit:100000"
           d="M 389.40493,257.2065 H 570.97768 V 188.676 H 389.40493 Z" />
      </g>
      <g
         style="stroke-linecap:butt;stroke-linejoin:round;stroke-miterlimit:100000"
         id="line2d_37">
        <path
           inkscape:connector-curvature="0"
           id="path434"
           style="fill:none;stroke:#ff0000;stroke-width:1.5;stroke-linecap:square;stroke-linejoin:round;stroke-miterlimit:100000"
           d="m 399.48493,200.33775 h 20.16" />
      </g>
      <g
         style="stroke-linecap:butt;stroke-linejoin:round;stroke-miterlimit:100000"
         id="line2d_38" />
      <g
         style="stroke-linecap:butt;stroke-linejoin:round;stroke-miterlimit:100000"
         id="text_18">
        <!-- ground truth -->
        <defs
           id="defs446">
          <path
             style="stroke-linecap:butt;stroke-linejoin:round;stroke-miterlimit:100000"
             inkscape:connector-curvature="0"
             id="BitstreamVeraSans-Roman-6e"
             d="M 54.890625,33.015625 V 0 H 45.90625 v 32.71875 q 0,7.765625 -3.03125,11.609375 -3.03125,3.859375 -9.078125,3.859375 -7.28125,0 -11.484375,-4.640625 -4.203125,-4.625 -4.203125,-12.640625 V 0 h -9.03125 v 54.6875 h 9.03125 v -8.5 q 3.234375,4.9375 7.59375,7.375 4.375,2.4375 10.09375,2.4375 9.421875,0 14.25,-5.828125 4.84375,-5.828125 4.84375,-17.15625" />
          <path
             style="stroke-linecap:butt;stroke-linejoin:round;stroke-miterlimit:100000"
             inkscape:connector-curvature="0"
             id="BitstreamVeraSans-Roman-6f"
             d="m 30.609375,48.390625 q -7.21875,0 -11.421875,-5.640625 -4.203125,-5.640625 -4.203125,-15.453125 0,-9.8125 4.171875,-15.453125 4.1875,-5.640625 11.453125,-5.640625 7.1875,0 11.375,5.65625 4.203125,5.671875 4.203125,15.4375 0,9.71875 -4.203125,15.40625 -4.1875,5.6875 -11.375,5.6875 m 0,7.609375 q 11.71875,0 18.40625,-7.625 6.703125,-7.609375 6.703125,-21.078125 0,-13.421875 -6.703125,-21.078125 -6.6875,-7.640625 -18.40625,-7.640625 -11.765625,0 -18.4375,7.640625 -6.65625,7.65625 -6.65625,21.078125 0,13.46875 6.65625,21.078125 Q 18.84375,56 30.609375,56" />
          <path
             style="stroke-linecap:butt;stroke-linejoin:round;stroke-miterlimit:100000"
             inkscape:connector-curvature="0"
             id="BitstreamVeraSans-Roman-68"
             d="M 54.890625,33.015625 V 0 H 45.90625 v 32.71875 q 0,7.765625 -3.03125,11.609375 -3.03125,3.859375 -9.078125,3.859375 -7.28125,0 -11.484375,-4.640625 -4.203125,-4.625 -4.203125,-12.640625 V 0 h -9.03125 v 75.984375 h 9.03125 V 46.1875 q 3.234375,4.9375 7.59375,7.375 4.375,2.4375 10.09375,2.4375 9.421875,0 14.25,-5.828125 4.84375,-5.828125 4.84375,-17.15625" />
          <path
             style="stroke-linecap:butt;stroke-linejoin:round;stroke-miterlimit:100000"
             inkscape:connector-curvature="0"
             id="BitstreamVeraSans-Roman-64"
             d="m 45.40625,46.390625 v 29.59375 h 8.984375 V 0 H 45.40625 v 8.203125 q -2.828125,-4.875 -7.15625,-7.25 -4.3125,-2.375 -10.375,-2.375 -9.90625,0 -16.140625,7.90625 -6.21875,7.921875 -6.21875,20.8125 0,12.890625 6.21875,20.796875 Q 17.96875,56 27.875,56 q 6.0625,0 10.375,-2.375 4.328125,-2.359375 7.15625,-7.234375 M 14.796875,27.296875 q 0,-9.90625 4.078125,-15.546875 4.078125,-5.640625 11.203125,-5.640625 7.125,0 11.21875,5.640625 4.109375,5.640625 4.109375,15.546875 0,9.90625 -4.109375,15.546875 -4.09375,5.640625 -11.21875,5.640625 -7.125,0 -11.203125,-5.640625 -4.078125,-5.640625 -4.078125,-15.546875" />
          <path
             style="stroke-linecap:butt;stroke-linejoin:round;stroke-miterlimit:100000"
             inkscape:connector-curvature="0"
             id="BitstreamVeraSans-Roman-67"
             d="m 45.40625,27.984375 q 0,9.765625 -4.03125,15.125 -4.015625,5.375 -11.296875,5.375 -7.21875,0 -11.25,-5.375 -4.03125,-5.359375 -4.03125,-15.125 0,-9.71875 4.03125,-15.09375 4.03125,-5.375 11.25,-5.375 7.28125,0 11.296875,5.375 4.03125,5.375 4.03125,15.09375 M 54.390625,6.78125 q 0,-13.953125 -6.203125,-20.765625 -6.1875,-6.8125 -18.984375,-6.8125 -4.734375,0 -8.9375,0.703125 -4.203125,0.703125 -8.15625,2.171875 V -9.1875 q 3.953125,-2.140625 7.8125,-3.15625 3.859375,-1.03125 7.859375,-1.03125 8.84375,0 13.234375,4.609375 4.390625,4.609375 4.390625,13.9375 V 9.625 Q 42.625,4.78125 38.28125,2.390625 33.9375,0 27.875,0 17.828125,0 11.671875,7.65625 q -6.15625,7.671875 -6.15625,20.328125 0,12.6875 6.15625,20.34375 Q 17.828125,56 27.875,56 q 6.0625,0 10.40625,-2.390625 4.34375,-2.390625 7.125,-7.21875 V 54.6875 h 8.984375 z" />
          <path
             style="stroke-linecap:butt;stroke-linejoin:round;stroke-miterlimit:100000"
             inkscape:connector-curvature="0"
             id="BitstreamVeraSans-Roman-75"
             d="M 8.5,21.578125 V 54.6875 h 8.984375 V 21.921875 q 0,-7.765625 3.015625,-11.65625 3.03125,-3.875 9.09375,-3.875 7.265625,0 11.484375,4.640625 4.234375,4.640625 4.234375,12.65625 v 31 h 8.984375 V 0 H 45.3125 V 8.40625 Q 42.046875,3.421875 37.71875,1 33.40625,-1.421875 27.6875,-1.421875 18.265625,-1.421875 13.375,4.4375 8.5,10.296875 8.5,21.578125" />
          <path
             style="stroke-linecap:butt;stroke-linejoin:round;stroke-miterlimit:100000"
             inkscape:connector-curvature="0"
             id="BitstreamVeraSans-Roman-72"
             d="m 41.109375,46.296875 q -1.515625,0.875 -3.296875,1.28125 Q 36.03125,48 33.890625,48 26.265625,48 22.1875,43.046875 18.109375,38.09375 18.109375,28.8125 V 0 h -9.03125 v 54.6875 h 9.03125 v -8.5 q 2.84375,4.984375 7.375,7.390625 Q 30.03125,56 36.53125,56 q 0.921875,0 2.046875,-0.125 1.125,-0.109375 2.484375,-0.359375 z" />
          <path
             style="stroke-linecap:butt;stroke-linejoin:round;stroke-miterlimit:100000"
             inkscape:connector-curvature="0"
             id="BitstreamVeraSans-Roman-74"
             d="M 18.3125,70.21875 V 54.6875 h 18.5 v -6.984375 h -18.5 v -29.6875 q 0,-6.6875 1.828125,-8.59375 1.828125,-1.90625 7.453125,-1.90625 H 36.8125 V 0 H 27.59375 Q 17.1875,0 13.234375,3.875 9.28125,7.765625 9.28125,18.015625 v 29.6875 H 2.6875 V 54.6875 h 6.59375 v 15.53125 z" />
        </defs>
        <g
           style="stroke-linecap:butt;stroke-linejoin:round;stroke-miterlimit:100000"
           id="g472"
           transform="matrix(0.144,0,0,-0.144,435.48493,205.37775)">
          <use
             height="100%"
             width="100%"
             y="0"
             x="0"
             style="stroke-linecap:butt;stroke-linejoin:round;stroke-miterlimit:100000"
             id="use448"
             xlink:href="#BitstreamVeraSans-Roman-67" />
          <use
             height="100%"
             width="100%"
             y="0"
             style="stroke-linecap:butt;stroke-linejoin:round;stroke-miterlimit:100000"
             id="use450"
             xlink:href="#BitstreamVeraSans-Roman-72"
             x="63.476562" />
          <use
             height="100%"
             width="100%"
             y="0"
             style="stroke-linecap:butt;stroke-linejoin:round;stroke-miterlimit:100000"
             id="use452"
             xlink:href="#BitstreamVeraSans-Roman-6f"
             x="104.55859" />
          <use
             height="100%"
             width="100%"
             y="0"
             style="stroke-linecap:butt;stroke-linejoin:round;stroke-miterlimit:100000"
             id="use454"
             xlink:href="#BitstreamVeraSans-Roman-75"
             x="165.74023" />
          <use
             height="100%"
             width="100%"
             y="0"
             style="stroke-linecap:butt;stroke-linejoin:round;stroke-miterlimit:100000"
             id="use456"
             xlink:href="#BitstreamVeraSans-Roman-6e"
             x="229.11914" />
          <use
             height="100%"
             width="100%"
             y="0"
             style="stroke-linecap:butt;stroke-linejoin:round;stroke-miterlimit:100000"
             id="use458"
             xlink:href="#BitstreamVeraSans-Roman-64"
             x="292.49805" />
          <use
             height="100%"
             width="100%"
             y="0"
             style="stroke-linecap:butt;stroke-linejoin:round;stroke-miterlimit:100000"
             id="use460"
             xlink:href="#BitstreamVeraSans-Roman-20"
             x="355.97461" />
          <use
             height="100%"
             width="100%"
             y="0"
             style="stroke-linecap:butt;stroke-linejoin:round;stroke-miterlimit:100000"
             id="use462"
             xlink:href="#BitstreamVeraSans-Roman-74"
             x="387.76172" />
          <use
             height="100%"
             width="100%"
             y="0"
             style="stroke-linecap:butt;stroke-linejoin:round;stroke-miterlimit:100000"
             id="use464"
             xlink:href="#BitstreamVeraSans-Roman-72"
             x="426.9707" />
          <use
             height="100%"
             width="100%"
             y="0"
             style="stroke-linecap:butt;stroke-linejoin:round;stroke-miterlimit:100000"
             id="use466"
             xlink:href="#BitstreamVeraSans-Roman-75"
             x="468.08398" />
          <use
             height="100%"
             width="100%"
             y="0"
             style="stroke-linecap:butt;stroke-linejoin:round;stroke-miterlimit:100000"
             id="use468"
             xlink:href="#BitstreamVeraSans-Roman-74"
             x="531.46289" />
          <use
             height="100%"
             width="100%"
             y="0"
             style="stroke-linecap:butt;stroke-linejoin:round;stroke-miterlimit:100000"
             id="use470"
             xlink:href="#BitstreamVeraSans-Roman-68"
             x="570.67188" />
        </g>
      </g>
      <g
         style="stroke-linecap:butt;stroke-linejoin:round;stroke-miterlimit:100000"
         id="line2d_39">
        <path
           inkscape:connector-curvature="0"
           id="path475"
           style="fill:none;stroke:#0072bd;stroke-width:1.5;stroke-linecap:square;stroke-linejoin:round;stroke-miterlimit:100000"
           d="m 399.48493,221.47425 h 20.16" />
      </g>
      <g
         style="stroke-linecap:butt;stroke-linejoin:round;stroke-miterlimit:100000"
         id="line2d_40" />
      <g
         style="stroke-linecap:butt;stroke-linejoin:round;stroke-miterlimit:100000"
         id="text_19">
        <!-- fast_anms_ldb.log -->
        <defs
           id="defs486">
          <path
             style="stroke-linecap:butt;stroke-linejoin:round;stroke-miterlimit:100000"
             inkscape:connector-curvature="0"
             id="BitstreamVeraSans-Roman-5f"
             d="m 50.984375,-16.609375 v -6.96875 h -51.96875 v 6.96875 z" />
          <path
             style="stroke-linecap:butt;stroke-linejoin:round;stroke-miterlimit:100000"
             inkscape:connector-curvature="0"
             id="BitstreamVeraSans-Roman-6c"
             d="M 9.421875,75.984375 H 18.40625 V 0 H 9.421875 Z" />
          <path
             style="stroke-linecap:butt;stroke-linejoin:round;stroke-miterlimit:100000"
             inkscape:connector-curvature="0"
             id="BitstreamVeraSans-Roman-2e"
             d="M 10.6875,12.40625 H 21 V 0 H 10.6875 Z" />
          <path
             style="stroke-linecap:butt;stroke-linejoin:round;stroke-miterlimit:100000"
             inkscape:connector-curvature="0"
             id="BitstreamVeraSans-Roman-66"
             d="M 37.109375,75.984375 V 68.5 h -8.59375 q -4.828125,0 -6.71875,-1.953125 -1.875,-1.953125 -1.875,-7.03125 V 54.6875 H 34.71875 V 47.703125 H 19.921875 V 0 h -9.03125 V 47.703125 H 2.296875 V 54.6875 h 8.59375 V 58.5 q 0,9.125 4.25,13.296875 4.25,4.1875 13.46875,4.1875 z" />
          <path
             style="stroke-linecap:butt;stroke-linejoin:round;stroke-miterlimit:100000"
             inkscape:connector-curvature="0"
             id="BitstreamVeraSans-Roman-61"
             d="m 34.28125,27.484375 q -10.890625,0 -15.09375,-2.484375 -4.203125,-2.484375 -4.203125,-8.5 0,-4.78125 3.15625,-7.59375 3.15625,-2.796875 8.5625,-2.796875 7.484375,0 12,5.296875 4.515625,5.296875 4.515625,14.078125 v 2 z m 17.921875,3.71875 V 0 H 43.21875 v 8.296875 q -3.078125,-4.96875 -7.671875,-7.34375 -4.59375,-2.375 -11.234375,-2.375 -8.390625,0 -13.359375,4.71875 Q 6,8.015625 6,15.921875 q 0,9.21875 6.171875,13.90625 6.1875,4.6875 18.4375,4.6875 H 43.21875 v 0.890625 q 0,6.203125 -4.078125,9.59375 -4.078125,3.390625 -11.453125,3.390625 -4.6875,0 -9.140625,-1.125 -4.4375,-1.125 -8.53125,-3.375 v 8.3125 q 4.921875,1.90625 9.5625,2.84375 Q 24.21875,56 28.609375,56 q 11.875,0 17.734375,-6.15625 5.859375,-6.140625 5.859375,-18.640625" />
          <path
             style="stroke-linecap:butt;stroke-linejoin:round;stroke-miterlimit:100000"
             inkscape:connector-curvature="0"
             id="BitstreamVeraSans-Roman-73"
             d="m 44.28125,53.078125 v -8.5 Q 40.484375,46.53125 36.375,47.5 q -4.09375,0.984375 -8.5,0.984375 -6.6875,0 -10.03125,-2.046875 Q 14.5,44.390625 14.5,40.28125 q 0,-3.125 2.390625,-4.90625 2.390625,-1.78125 9.625,-3.390625 l 3.078125,-0.6875 Q 39.15625,29.25 43.1875,25.515625 47.21875,21.78125 47.21875,15.09375 q 0,-7.625 -6.03125,-12.078125 -6.03125,-4.4375 -16.578125,-4.4375 -4.390625,0 -9.15625,0.859375 Q 10.6875,0.296875 5.421875,2 v 9.28125 q 4.984375,-2.59375 9.8125,-3.890625 4.828125,-1.28125 9.578125,-1.28125 6.34375,0 9.75,2.171875 3.421875,2.171875 3.421875,6.125 0,3.65625 -2.46875,5.609375 -2.453125,1.953125 -10.8125,3.765625 l -3.125,0.734375 q -8.34375,1.75 -12.0625,5.390625 -3.703125,3.640625 -3.703125,9.984375 0,7.71875 5.46875,11.90625 Q 16.75,56 26.8125,56 q 4.96875,0 9.359375,-0.734375 4.40625,-0.71875 8.109375,-2.1875" />
          <path
             style="stroke-linecap:butt;stroke-linejoin:round;stroke-miterlimit:100000"
             inkscape:connector-curvature="0"
             id="BitstreamVeraSans-Roman-62"
             d="m 48.6875,27.296875 q 0,9.90625 -4.078125,15.546875 -4.078125,5.640625 -11.203125,5.640625 -7.140625,0 -11.21875,-5.640625 -4.078125,-5.640625 -4.078125,-15.546875 0,-9.90625 4.078125,-15.546875 4.078125,-5.640625 11.21875,-5.640625 7.125,0 11.203125,5.640625 4.078125,5.640625 4.078125,15.546875 m -30.578125,19.09375 q 2.84375,4.875 7.15625,7.234375 Q 29.59375,56 35.59375,56 q 9.96875,0 16.1875,-7.90625 6.234375,-7.90625 6.234375,-20.796875 0,-12.890625 -6.234375,-20.8125 -6.21875,-7.90625 -16.1875,-7.90625 -6,0 -10.328125,2.375 -4.3125,2.375 -7.15625,7.25 V 0 h -9.03125 v 75.984375 h 9.03125 z" />
        </defs>
        <g
           style="stroke-linecap:butt;stroke-linejoin:round;stroke-miterlimit:100000"
           id="g522"
           transform="matrix(0.144,0,0,-0.144,435.48493,226.51425)">
          <use
             height="100%"
             width="100%"
             y="0"
             x="0"
             style="stroke-linecap:butt;stroke-linejoin:round;stroke-miterlimit:100000"
             id="use488"
             xlink:href="#BitstreamVeraSans-Roman-66" />
          <use
             height="100%"
             width="100%"
             y="0"
             style="stroke-linecap:butt;stroke-linejoin:round;stroke-miterlimit:100000"
             id="use490"
             xlink:href="#BitstreamVeraSans-Roman-61"
             x="35.205078" />
          <use
             height="100%"
             width="100%"
             y="0"
             style="stroke-linecap:butt;stroke-linejoin:round;stroke-miterlimit:100000"
             id="use492"
             xlink:href="#BitstreamVeraSans-Roman-73"
             x="96.484375" />
          <use
             height="100%"
             width="100%"
             y="0"
             style="stroke-linecap:butt;stroke-linejoin:round;stroke-miterlimit:100000"
             id="use494"
             xlink:href="#BitstreamVeraSans-Roman-74"
             x="148.58398" />
          <use
             height="100%"
             width="100%"
             y="0"
             style="stroke-linecap:butt;stroke-linejoin:round;stroke-miterlimit:100000"
             id="use496"
             xlink:href="#BitstreamVeraSans-Roman-5f"
             x="187.79297" />
          <use
             height="100%"
             width="100%"
             y="0"
             style="stroke-linecap:butt;stroke-linejoin:round;stroke-miterlimit:100000"
             id="use498"
             xlink:href="#BitstreamVeraSans-Roman-61"
             x="237.79297" />
          <use
             height="100%"
             width="100%"
             y="0"
             style="stroke-linecap:butt;stroke-linejoin:round;stroke-miterlimit:100000"
             id="use500"
             xlink:href="#BitstreamVeraSans-Roman-6e"
             x="299.07227" />
          <use
             height="100%"
             width="100%"
             y="0"
             style="stroke-linecap:butt;stroke-linejoin:round;stroke-miterlimit:100000"
             id="use502"
             xlink:href="#BitstreamVeraSans-Roman-6d"
             x="362.45117" />
          <use
             height="100%"
             width="100%"
             y="0"
             style="stroke-linecap:butt;stroke-linejoin:round;stroke-miterlimit:100000"
             id="use504"
             xlink:href="#BitstreamVeraSans-Roman-73"
             x="459.86328" />
          <use
             height="100%"
             width="100%"
             y="0"
             style="stroke-linecap:butt;stroke-linejoin:round;stroke-miterlimit:100000"
             id="use506"
             xlink:href="#BitstreamVeraSans-Roman-5f"
             x="511.96289" />
          <use
             height="100%"
             width="100%"
             y="0"
             style="stroke-linecap:butt;stroke-linejoin:round;stroke-miterlimit:100000"
             id="use508"
             xlink:href="#BitstreamVeraSans-Roman-6c"
             x="561.96289" />
          <use
             height="100%"
             width="100%"
             y="0"
             style="stroke-linecap:butt;stroke-linejoin:round;stroke-miterlimit:100000"
             id="use510"
             xlink:href="#BitstreamVeraSans-Roman-64"
             x="589.74609" />
          <use
             height="100%"
             width="100%"
             y="0"
             style="stroke-linecap:butt;stroke-linejoin:round;stroke-miterlimit:100000"
             id="use512"
             xlink:href="#BitstreamVeraSans-Roman-62"
             x="653.22266" />
        </g>
      </g>
      <g
         style="stroke-linecap:butt;stroke-linejoin:round;stroke-miterlimit:100000"
         id="line2d_41">
        <path
           inkscape:connector-curvature="0"
           id="path525"
           style="fill:none;stroke:#d95319;stroke-width:1.5;stroke-linecap:square;stroke-linejoin:round;stroke-miterlimit:100000"
           d="m 399.48493,243.01125 h 20.16" />
      </g>
      <g
         style="stroke-linecap:butt;stroke-linejoin:round;stroke-miterlimit:100000"
         id="line2d_42" />
      <g
         style="stroke-linecap:butt;stroke-linejoin:round;stroke-miterlimit:100000"
         id="text_20">
        <!-- gftt_brisk.log -->
        <defs
           id="defs531">
          <path
             style="stroke-linecap:butt;stroke-linejoin:round;stroke-miterlimit:100000"
             inkscape:connector-curvature="0"
             id="BitstreamVeraSans-Roman-69"
             d="M 9.421875,54.6875 H 18.40625 V 0 H 9.421875 Z m 0,21.296875 H 18.40625 V 64.59375 H 9.421875 Z" />
          <path
             style="stroke-linecap:butt;stroke-linejoin:round;stroke-miterlimit:100000"
             inkscape:connector-curvature="0"
             id="BitstreamVeraSans-Roman-6b"
             d="m 9.078125,75.984375 h 9.03125 v -44.875 l 26.8125,23.578125 h 11.46875 l -29,-25.578125 L 57.625,0 H 45.90625 L 18.109375,26.703125 V 0 h -9.03125 z" />
        </defs>
        <g
           style="stroke-linecap:butt;stroke-linejoin:round;stroke-miterlimit:100000"
           id="g561"
           transform="matrix(0.144,0,0,-0.144,435.48493,248.05125)">
          <use
             height="100%"
             width="100%"
             y="0"
             x="0"
             style="stroke-linecap:butt;stroke-linejoin:round;stroke-miterlimit:100000"
             id="use533"
             xlink:href="#BitstreamVeraSans-Roman-67" />
          <use
             height="100%"
             width="100%"
             y="0"
             style="stroke-linecap:butt;stroke-linejoin:round;stroke-miterlimit:100000"
             id="use535"
             xlink:href="#BitstreamVeraSans-Roman-66"
             x="63.476562" />
          <use
             height="100%"
             width="100%"
             y="0"
             style="stroke-linecap:butt;stroke-linejoin:round;stroke-miterlimit:100000"
             id="use537"
             xlink:href="#BitstreamVeraSans-Roman-74"
             x="98.666016" />
          <use
             height="100%"
             width="100%"
             y="0"
             style="stroke-linecap:butt;stroke-linejoin:round;stroke-miterlimit:100000"
             id="use539"
             xlink:href="#BitstreamVeraSans-Roman-74"
             x="137.875" />
          <use
             height="100%"
             width="100%"
             y="0"
             style="stroke-linecap:butt;stroke-linejoin:round;stroke-miterlimit:100000"
             id="use541"
             xlink:href="#BitstreamVeraSans-Roman-5f"
             x="177.08398" />
          <use
             height="100%"
             width="100%"
             y="0"
             style="stroke-linecap:butt;stroke-linejoin:round;stroke-miterlimit:100000"
             id="use543"
             xlink:href="#BitstreamVeraSans-Roman-62"
             x="227.08398" />
          <use
             height="100%"
             width="100%"
             y="0"
             style="stroke-linecap:butt;stroke-linejoin:round;stroke-miterlimit:100000"
             id="use545"
             xlink:href="#BitstreamVeraSans-Roman-72"
             x="290.56055" />
          <use
             height="100%"
             width="100%"
             y="0"
             style="stroke-linecap:butt;stroke-linejoin:round;stroke-miterlimit:100000"
             id="use547"
             xlink:href="#BitstreamVeraSans-Roman-69"
             x="331.67383" />
          <use
             height="100%"
             width="100%"
             y="0"
             style="stroke-linecap:butt;stroke-linejoin:round;stroke-miterlimit:100000"
             id="use549"
             xlink:href="#BitstreamVeraSans-Roman-73"
             x="359.45703" />
          <use
             height="100%"
             width="100%"
             y="0"
             style="stroke-linecap:butt;stroke-linejoin:round;stroke-miterlimit:100000"
             id="use551"
             xlink:href="#BitstreamVeraSans-Roman-6b"
             x="411.55664" />
        </g>
      </g>
    </g>
  </g>
  <defs
     id="defs570">
    <clipPath
       id="p3aeefc34c3">
      <rect
         height="511.20000000000005"
         width="438.1714285714285"
         x="381.0005357142857"
         y="63.89999999999998"
         id="rect567" />
    </clipPath>
  </defs>
</svg>
