<?xml version="1.0" encoding="UTF-8" standalone="no"?>
<!-- Created with Inkscape (http://www.inkscape.org/) -->

<svg
   xmlns:dc="http://purl.org/dc/elements/1.1/"
   xmlns:cc="http://creativecommons.org/ns#"
   xmlns:rdf="http://www.w3.org/1999/02/22-rdf-syntax-ns#"
   xmlns:svg="http://www.w3.org/2000/svg"
   xmlns="http://www.w3.org/2000/svg"
   xmlns:sodipodi="http://sodipodi.sourceforge.net/DTD/sodipodi-0.dtd"
   xmlns:inkscape="http://www.inkscape.org/namespaces/inkscape"
   version="1.1"
   id="svg2"
   xml:space="preserve"
   width="720.56653"
   height="270.39224"
   viewBox="0 0 720.56653 270.39223"
   sodipodi:docname="desarrollo_hardware.svg"
   inkscape:version="0.92.3 (unknown)"><metadata
     id="metadata8"><rdf:RDF><cc:Work
         rdf:about=""><dc:format>image/svg+xml</dc:format><dc:type
           rdf:resource="http://purl.org/dc/dcmitype/StillImage" /><dc:title /></cc:Work></rdf:RDF></metadata><defs
     id="defs6"><clipPath
       clipPathUnits="userSpaceOnUse"
       id="clipPath18"><path
         d="M 0,0 H 594 V 841.38013 H 0 Z"
         id="path16"
         inkscape:connector-curvature="0"
         style="clip-rule:evenodd" /></clipPath><clipPath
       clipPathUnits="userSpaceOnUse"
       id="clipPath32"><path
         d="M 0,0 H 594 V 840.66101 H 0 Z"
         id="path30"
         inkscape:connector-curvature="0"
         style="clip-rule:evenodd" /></clipPath></defs><sodipodi:namedview
     pagecolor="#ffffff"
     bordercolor="#666666"
     borderopacity="1"
     objecttolerance="10"
     gridtolerance="10"
     guidetolerance="10"
     inkscape:pageopacity="0"
     inkscape:pageshadow="2"
     inkscape:window-width="1301"
     inkscape:window-height="744"
     id="namedview4"
     showgrid="false"
     inkscape:zoom="0.21021376"
     inkscape:cx="-513.06302"
     inkscape:cy="-200.81034"
     inkscape:window-x="65"
     inkscape:window-y="24"
     inkscape:window-maximized="1"
     inkscape:current-layer="g10" /><g
     id="g10"
     inkscape:groupmode="layer"
     inkscape:label="desarrollo_hardware"
     transform="matrix(1.3333333,0,0,1.3333333,-59.927358,-90.130746)"><g
       id="g26"><g
         id="g28"
         clip-path="url(#clipPath32)"><g
           id="g34"
           transform="matrix(0.71912831,0,0,0.71912831,0.35956416,0.35956416)"><path
             d="m 173,233 h 21 v 97 h 15.63"
             style="fill:none;stroke:#000000;stroke-width:1;stroke-linecap:butt;stroke-linejoin:miter;stroke-miterlimit:10;stroke-dasharray:none;stroke-opacity:1"
             id="path36"
             inkscape:connector-curvature="0" /><path
             d="m 214.88,330 -7,3.5 1.75,-3.5 -1.75,-3.5 z"
             style="fill:#000000;fill-opacity:1;fill-rule:nonzero;stroke:none"
             id="path38"
             inkscape:connector-curvature="0" /><path
             d="m 214.88,330 -7,3.5 1.75,-3.5 -1.75,-3.5 z"
             style="fill:none;stroke:#000000;stroke-width:1;stroke-linecap:butt;stroke-linejoin:miter;stroke-miterlimit:10;stroke-dasharray:none;stroke-opacity:1"
             id="path40"
             inkscape:connector-curvature="0" /><path
             d="m 173,233 h 21 v -89 h 15.63"
             style="fill:none;stroke:#000000;stroke-width:1;stroke-linecap:butt;stroke-linejoin:miter;stroke-miterlimit:10;stroke-dasharray:none;stroke-opacity:1"
             id="path42"
             inkscape:connector-curvature="0" /><path
             d="m 214.88,144 -7,3.5 1.75,-3.5 -1.75,-3.5 z"
             style="fill:#000000;fill-opacity:1;fill-rule:nonzero;stroke:none"
             id="path44"
             inkscape:connector-curvature="0" /><path
             d="m 214.88,144 -7,3.5 1.75,-3.5 -1.75,-3.5 z"
             style="fill:none;stroke:#000000;stroke-width:1;stroke-linecap:butt;stroke-linejoin:miter;stroke-miterlimit:10;stroke-dasharray:none;stroke-opacity:1"
             id="path46"
             inkscape:connector-curvature="0" /><path
             d="m 73.75,195 h 87.5 c 3.1066,0 5.75824,1.09834 7.95494,3.29503 2.1967,2.1967 3.29504,4.84836 3.29506,7.95497 v 52.5 c -2e-5,3.1066 -1.09836,5.75824 -3.29506,7.95493 -2.1967,2.19668 -4.84834,3.29504 -7.95494,3.29507 h -87.5 c -3.106606,-3e-5 -5.758263,-1.09839 -7.954956,-3.29507 C 63.598343,264.50824 62.499996,261.8566 62.5,258.75 v -52.5 c -4e-6,-3.10661 1.098343,-5.75827 3.295044,-7.95497 C 67.991737,196.09834 70.643394,195 73.75,195 Z"
             style="fill:#ef7f3f;fill-opacity:1;fill-rule:nonzero;stroke:none"
             id="path48"
             inkscape:connector-curvature="0" /><path
             d="m 73.75,195 h 87.5 c 3.1066,0 5.75824,1.09834 7.95494,3.29503 2.1967,2.1967 3.29504,4.84836 3.29506,7.95497 v 52.5 c -2e-5,3.1066 -1.09836,5.75824 -3.29506,7.95493 -2.1967,2.19668 -4.84834,3.29504 -7.95494,3.29507 h -87.5 c -3.106606,-3e-5 -5.758263,-1.09839 -7.954956,-3.29507 C 63.598343,264.50824 62.499996,261.8566 62.5,258.75 v -52.5 c -4e-6,-3.10661 1.098343,-5.75827 3.295044,-7.95497 C 67.991737,196.09834 70.643394,195 73.75,195 Z"
             style="fill:none;stroke:#000000;stroke-width:1;stroke-linecap:butt;stroke-linejoin:miter;stroke-miterlimit:10;stroke-dasharray:none;stroke-opacity:1"
             id="path50"
             inkscape:connector-curvature="0" /></g><g
           id="g52"
           transform="matrix(0.71912831,0,0,0.71912831,46.74334,141.66827)"><path
   d="m 0,24 h 107 v 1 H 0 Z"
   style="fill:#9a9a9a;fill-opacity:1;fill-rule:nonzero;stroke:none"
   id="path54"
   inkscape:connector-curvature="0" /><path
   d="m 0,25 h 107 v 1 H 0 Z"
   style="fill:#eeeeee;fill-opacity:1;fill-rule:nonzero;stroke:none"
   id="path56"
   inkscape:connector-curvature="0" /><path
   d="m 106,25 v 1 h 1 v -2"
   style="fill:#eeeeee;fill-opacity:1;fill-rule:nonzero;stroke:none"
   id="path58"
   inkscape:connector-curvature="0" /><path
   d="m 0,24 v 2 l 1,-1 v -1"
   style="fill:#9a9a9a;fill-opacity:1;fill-rule:nonzero;stroke:none"
   id="path60"
   inkscape:connector-curvature="0" /><path
   d="m 24.8125,16 h 57.359375 v 1 H 24.8125 Z"
   style="fill:#000000;fill-opacity:1;fill-rule:nonzero;stroke:none"
   id="path62"
   inkscape:connector-curvature="0" /><text
   transform="translate(24.8125,15)"
   style="font-variant:normal;font-weight:bold;font-size:12px;font-family:Helvetica;-inkscape-font-specification:Helvetica-Bold;writing-mode:lr-tb;fill:#000000;fill-opacity:1;fill-rule:nonzero;stroke:none"
   id="text66"><tspan
     x="0 8.0039062 12.673828 20.003906 26.677734 33.351562 40.025391 47.355469 50.689453"
     y="0"
     sodipodi:role="line"
     id="tspan64">Proceso 1</tspan></text>

<text
   transform="translate(19.15625,43)"
   style="font-variant:normal;font-weight:bold;font-size:12px;font-family:Helvetica;-inkscape-font-specification:Helvetica-Bold;writing-mode:lr-tb;fill:#000000;fill-opacity:1;fill-rule:nonzero;stroke:none"
   id="text70"><tspan
     x="0 8.0039062 14.677734 18.011719 24.685547 31.359375 38.033203 41.367188 48.697266 56.027344 59.361328 66.691406 73.365234"
     y="0"
     sodipodi:role="line"
     id="tspan68">Selección de </tspan></text>

<text
   transform="translate(30.15625,57)"
   style="font-variant:normal;font-weight:bold;font-size:12px;font-family:Helvetica;-inkscape-font-specification:Helvetica-Bold;writing-mode:lr-tb;fill:#000000;fill-opacity:1;fill-rule:nonzero;stroke:none"
   id="text74"><tspan
     x="0 8.6660156 15.339844 20.009766 27.339844 36.673828 43.347656 48.017578"
     y="0"
     sodipodi:role="line"
     id="tspan72">Hardware</tspan></text>

</g><g
           id="g76"
           transform="matrix(0.71912831,0,0,0.71912831,0.35956416,0.35956416)"><path
             d="m 356,330 h 38.13"
             style="fill:none;stroke:#000000;stroke-width:1;stroke-linecap:butt;stroke-linejoin:miter;stroke-miterlimit:10;stroke-dasharray:none;stroke-opacity:1"
             id="path78"
             inkscape:connector-curvature="0" /><path
             d="m 399.38,330 -7,3.5 1.75,-3.5 -1.75,-3.5 z"
             style="fill:#000000;fill-opacity:1;fill-rule:nonzero;stroke:none"
             id="path80"
             inkscape:connector-curvature="0" /><path
             d="m 399.38,330 -7,3.5 1.75,-3.5 -1.75,-3.5 z"
             style="fill:none;stroke:#000000;stroke-width:1;stroke-linecap:butt;stroke-linejoin:miter;stroke-miterlimit:10;stroke-dasharray:none;stroke-opacity:1"
             id="path82"
             inkscape:connector-curvature="0" /><path
             d="m 216,310 h 140 v 40 H 216 Z"
             style="fill:#a7cb68;fill-opacity:1;fill-rule:nonzero;stroke:none"
             id="path84"
             inkscape:connector-curvature="0" /><path
             d="m 216,310 h 140 v 40 H 216 Z"
             style="fill:none;stroke:#000000;stroke-width:1;stroke-linecap:butt;stroke-linejoin:miter;stroke-miterlimit:10;stroke-dasharray:none;stroke-opacity:1"
             id="path86"
             inkscape:connector-curvature="0" /></g><g
           id="g88"
           transform="matrix(0.71912831,0,0,0.71912831,173.30992,232.99757)"><text
   transform="translate(0.96875,11)"
   style="font-variant:normal;font-weight:bold;font-size:12px;font-family:Helvetica;-inkscape-font-specification:Helvetica-Bold;writing-mode:lr-tb;fill:#000000;fill-opacity:1;fill-rule:nonzero;stroke:none"
   id="text92"><tspan
     x="0 8.6660156 15.339844 26.009766 32.683594 37.353516 44.027344 47.361328 54.035156 60.708984 64.705078 71.378906 76.048828 82.722656"
     y="0"
     sodipodi:role="line"
     id="tspan90">Cámara estéreo</tspan></text>

</g><g
           id="g94"
           transform="matrix(0.71912831,0,0,0.71912831,0.35956416,0.35956416)"><path
             d="m 526,144 h 74.63"
             style="fill:none;stroke:#000000;stroke-width:1;stroke-linecap:butt;stroke-linejoin:miter;stroke-miterlimit:10;stroke-dasharray:none;stroke-opacity:1"
             id="path96"
             inkscape:connector-curvature="0" /><path
             d="m 605.88,144 -7,3.5 1.75,-3.5 -1.75,-3.5 z"
             style="fill:#000000;fill-opacity:1;fill-rule:nonzero;stroke:none"
             id="path98"
             inkscape:connector-curvature="0" /><path
             d="m 605.88,144 -7,3.5 1.75,-3.5 -1.75,-3.5 z"
             style="fill:none;stroke:#000000;stroke-width:1;stroke-linecap:butt;stroke-linejoin:miter;stroke-miterlimit:10;stroke-dasharray:none;stroke-opacity:1"
             id="path100"
             inkscape:connector-curvature="0" /><path
             d="m 415.5,94 h 95 c 4.14209,0 7.67761,1.464462 10.60657,4.393387 2.92889,2.928933 4.39337,6.464473 4.39343,10.606613 v 70 c -6e-5,4.14214 -1.46454,7.67766 -4.39343,10.60658 -2.92896,2.92894 -6.46448,4.3934 -10.60657,4.39342 h -95 c -4.14215,-2e-5 -7.67767,-1.46448 -10.6066,-4.39342 C 401.96448,186.67766 400.5,183.14214 400.5,179 v -70 c 0,-4.14214 1.46448,-7.67768 4.3934,-10.606613 C 407.82233,95.464462 411.35785,94 415.5,94 Z"
             style="fill:#ef7f3f;fill-opacity:1;fill-rule:nonzero;stroke:none"
             id="path102"
             inkscape:connector-curvature="0" /><path
             d="m 415.5,94 h 95 c 4.14209,0 7.67761,1.464462 10.60657,4.393387 2.92889,2.928933 4.39337,6.464473 4.39343,10.606613 v 70 c -6e-5,4.14214 -1.46454,7.67766 -4.39343,10.60658 -2.92896,2.92894 -6.46448,4.3934 -10.60657,4.39342 h -95 c -4.14215,-2e-5 -7.67767,-1.46448 -10.6066,-4.39342 C 401.96448,186.67766 400.5,183.14214 400.5,179 v -70 c 0,-4.14214 1.46448,-7.67768 4.3934,-10.606613 C 407.82233,95.464462 411.35785,94 415.5,94 Z"
             style="fill:none;stroke:#000000;stroke-width:1;stroke-linecap:butt;stroke-linejoin:miter;stroke-miterlimit:10;stroke-dasharray:none;stroke-opacity:1"
             id="path104"
             inkscape:connector-curvature="0" /></g><g
           id="g106"
           transform="matrix(0.71912831,0,0,0.71912831,289.80872,69.036316)"><path
   d="m 0,24 h 122 v 1 H 0 Z"
   style="fill:#9a9a9a;fill-opacity:1;fill-rule:nonzero;stroke:none"
   id="path108"
   inkscape:connector-curvature="0" /><path
   d="m 0,25 h 122 v 1 H 0 Z"
   style="fill:#eeeeee;fill-opacity:1;fill-rule:nonzero;stroke:none"
   id="path110"
   inkscape:connector-curvature="0" /><path
   d="m 121,25 v 1 h 1 v -2"
   style="fill:#eeeeee;fill-opacity:1;fill-rule:nonzero;stroke:none"
   id="path112"
   inkscape:connector-curvature="0" /><path
   d="m 0,24 v 2 l 1,-1 v -1"
   style="fill:#9a9a9a;fill-opacity:1;fill-rule:nonzero;stroke:none"
   id="path114"
   inkscape:connector-curvature="0" /><path
   d="m 32.3125,16 h 57.359375 v 1 H 32.3125 Z"
   style="fill:#000000;fill-opacity:1;fill-rule:nonzero;stroke:none"
   id="path116"
   inkscape:connector-curvature="0" /><text
   transform="translate(32.3125,15)"
   style="font-variant:normal;font-weight:bold;font-size:12px;font-family:Helvetica;-inkscape-font-specification:Helvetica-Bold;writing-mode:lr-tb;fill:#000000;fill-opacity:1;fill-rule:nonzero;stroke:none"
   id="text120"><tspan
     x="0 8.0039062 12.673828 20.003906 26.677734 33.351562 40.025391 47.355469 50.689453"
     y="0"
     sodipodi:role="line"
     id="tspan118">Proceso 2</tspan></text>

<text
   transform="translate(19.328125,43)"
   style="font-variant:normal;font-weight:bold;font-size:12px;font-family:Helvetica;-inkscape-font-specification:Helvetica-Bold;writing-mode:lr-tb;fill:#000000;fill-opacity:1;fill-rule:nonzero;stroke:none"
   id="text124"><tspan
     x="0 3.3339844 14.003906 21.333984 24.667969 31.341797 42.011719 48.685547 56.015625 60.011719 66.685547 73.359375 76.693359 84.023438"
     y="0"
     sodipodi:role="line"
     id="tspan122">Implementación</tspan></text>

<text
   transform="translate(13.65625,57)"
   style="font-variant:normal;font-weight:bold;font-size:12px;font-family:Helvetica;-inkscape-font-specification:Helvetica-Bold;writing-mode:lr-tb;fill:#000000;fill-opacity:1;fill-rule:nonzero;stroke:none"
   id="text128"><tspan
     x="0 7.3300781 14.003906 17.337891 24.011719 27.345703 34.019531 38.015625 44.689453 55.359375 62.033203 65.367188 73.371094 80.701172 89.367188 99.363281"
     y="0"
     sodipodi:role="line"
     id="tspan126">de sistema SLAM </tspan></text>

<text
   transform="translate(17.984375,71)"
   style="font-variant:normal;font-weight:bold;font-size:12px;font-family:Helvetica;-inkscape-font-specification:Helvetica-Bold;writing-mode:lr-tb;fill:#000000;fill-opacity:1;fill-rule:nonzero;stroke:none"
   id="text132"><tspan
     x="0 6.6738281 14.003906 21.333984 24.667969 28.001953 35.332031 42.005859 45.339844 52.013672 58.6875 69.357422 76.6875 80.021484 87.351562"
     y="0"
     sodipodi:role="line"
     id="tspan130">con los cambios</tspan></text>

<text
   transform="translate(35.65625,85)"
   style="font-variant:normal;font-weight:bold;font-size:12px;font-family:Helvetica;-inkscape-font-specification:Helvetica-Bold;writing-mode:lr-tb;fill:#000000;fill-opacity:1;fill-rule:nonzero;stroke:none"
   id="text136"><tspan
     x="0 4.6699219 11.34375 18.017578 21.351562 24.685547 30.685547 37.359375 44.689453 52.019531"
     y="0"
     sodipodi:role="line"
     id="tspan134">realizados</tspan></text>

</g><g
           id="g138"
           transform="matrix(0.71912831,0,0,0.71912831,0.35956416,0.35956416)"><path
             d="m 518,330 h 85.63"
             style="fill:none;stroke:#000000;stroke-width:1;stroke-linecap:butt;stroke-linejoin:miter;stroke-miterlimit:10;stroke-dasharray:none;stroke-opacity:1"
             id="path140"
             inkscape:connector-curvature="0" /><path
             d="m 608.88,330 -7,3.5 1.75,-3.5 -1.75,-3.5 z"
             style="fill:#000000;fill-opacity:1;fill-rule:nonzero;stroke:none"
             id="path142"
             inkscape:connector-curvature="0" /><path
             d="m 608.88,330 -7,3.5 1.75,-3.5 -1.75,-3.5 z"
             style="fill:none;stroke:#000000;stroke-width:1;stroke-linecap:butt;stroke-linejoin:miter;stroke-miterlimit:10;stroke-dasharray:none;stroke-opacity:1"
             id="path144"
             inkscape:connector-curvature="0" /><path
             d="m 414,285 h 90 c 3.72787,0 6.90985,1.31802 9.5459,3.95404 2.63605,2.63605 3.95404,5.81802 3.9541,9.54596 v 63 c -6e-5,3.72791 -1.31805,6.90988 -3.9541,9.54593 -2.63605,2.63602 -5.81803,3.95404 -9.5459,3.95407 h -90 c -3.72794,-3e-5 -6.90991,-1.31805 -9.54596,-3.95407 C 401.81802,368.40988 400.5,365.22791 400.5,361.5 v -63 c 0,-3.72794 1.31802,-6.90991 3.95404,-9.54596 C 407.09009,286.31802 410.27206,285 414,285 Z"
             style="fill:#ef7f3f;fill-opacity:1;fill-rule:nonzero;stroke:none"
             id="path146"
             inkscape:connector-curvature="0" /><path
             d="m 414,285 h 90 c 3.72787,0 6.90985,1.31802 9.5459,3.95404 2.63605,2.63605 3.95404,5.81802 3.9541,9.54596 v 63 c -6e-5,3.72791 -1.31805,6.90988 -3.9541,9.54593 -2.63605,2.63602 -5.81803,3.95404 -9.5459,3.95407 h -90 c -3.72794,-3e-5 -6.90991,-1.31805 -9.54596,-3.95407 C 401.81802,368.40988 400.5,365.22791 400.5,361.5 v -63 c 0,-3.72794 1.31802,-6.90991 3.95404,-9.54596 C 407.09009,286.31802 410.27206,285 414,285 Z"
             style="fill:none;stroke:#000000;stroke-width:1;stroke-linecap:butt;stroke-linejoin:miter;stroke-miterlimit:10;stroke-dasharray:none;stroke-opacity:1"
             id="path148"
             inkscape:connector-curvature="0" /></g><g
           id="g150"
           transform="matrix(0.71912831,0,0,0.71912831,289.80872,206.38983)"><path
   d="m 0,24 h 114 v 1 H 0 Z"
   style="fill:#9a9a9a;fill-opacity:1;fill-rule:nonzero;stroke:none"
   id="path152"
   inkscape:connector-curvature="0" /><path
   d="m 0,25 h 114 v 1 H 0 Z"
   style="fill:#eeeeee;fill-opacity:1;fill-rule:nonzero;stroke:none"
   id="path154"
   inkscape:connector-curvature="0" /><path
   d="m 113,25 v 1 h 1 v -2"
   style="fill:#eeeeee;fill-opacity:1;fill-rule:nonzero;stroke:none"
   id="path156"
   inkscape:connector-curvature="0" /><path
   d="m 0,24 v 2 l 1,-1 v -1"
   style="fill:#9a9a9a;fill-opacity:1;fill-rule:nonzero;stroke:none"
   id="path158"
   inkscape:connector-curvature="0" /><path
   d="m 28.3125,16 h 57.359375 v 1 H 28.3125 Z"
   style="fill:#000000;fill-opacity:1;fill-rule:nonzero;stroke:none"
   id="path160"
   inkscape:connector-curvature="0" /><text
   transform="translate(28.3125,15)"
   style="font-variant:normal;font-weight:bold;font-size:12px;font-family:Helvetica;-inkscape-font-specification:Helvetica-Bold;writing-mode:lr-tb;fill:#000000;fill-opacity:1;fill-rule:nonzero;stroke:none"
   id="text164"><tspan
     x="0 8.0039062 12.673828 20.003906 26.677734 33.351562 40.025391 47.355469 50.689453"
     y="0"
     sodipodi:role="line"
     id="tspan162">Proceso 3</tspan></text>

<text
   transform="translate(12.984375,43)"
   style="font-variant:normal;font-weight:bold;font-size:12px;font-family:Helvetica;-inkscape-font-specification:Helvetica-Bold;writing-mode:lr-tb;fill:#000000;fill-opacity:1;fill-rule:nonzero;stroke:none"
   id="text168"><tspan
     x="0 8.0039062 15.333984 19.330078 23.326172 32.660156 39.333984 44.003906 50.677734 54.011719 61.341797 68.015625 72.685547 79.359375 82.693359 86.027344 92.701172"
     y="0"
     sodipodi:role="line"
     id="tspan166">Software para la </tspan></text>

<text
   transform="translate(34.984375,57)"
   style="font-variant:normal;font-weight:bold;font-size:12px;font-family:Helvetica;-inkscape-font-specification:Helvetica-Bold;writing-mode:lr-tb;fill:#000000;fill-opacity:1;fill-rule:nonzero;stroke:none"
   id="text172"><tspan
     x="0 6.6738281 13.347656 24.017578 30.691406 35.361328 42.035156 45.369141"
     y="0"
     sodipodi:role="line"
     id="tspan170">camará y</tspan></text>

<text
   transform="translate(29.328125,71)"
   style="font-variant:normal;font-weight:bold;font-size:12px;font-family:Helvetica;-inkscape-font-specification:Helvetica-Bold;writing-mode:lr-tb;fill:#000000;fill-opacity:1;fill-rule:nonzero;stroke:none"
   id="text176"><tspan
     x="0 6.6738281 13.347656 16.681641 20.015625 27.345703 32.015625 38.689453 45.363281 48.697266 56.027344"
     y="0"
     sodipodi:role="line"
     id="tspan174">calibración</tspan></text>

</g><g
           id="g178"
           transform="matrix(0.71912831,0,0,0.71912831,0.35956416,0.35956416)"><path
             d="m 671.25,200 h 130.5 c 3.10657,0 5.75818,1.09834 7.9549,3.29504 2.19671,2.1967 3.29504,4.84835 3.2951,7.95496 v 52.5 c -6e-5,3.1066 -1.09839,5.75824 -3.2951,7.95493 -2.19672,2.19668 -4.84833,3.29504 -7.9549,3.29507 h -130.5 c -3.10663,-3e-5 -5.7583,-1.09839 -7.95502,-3.29507 C 661.09827,269.50824 659.99994,266.8566 660,263.75 v -52.5 c -6e-5,-3.10661 1.09827,-5.75826 3.29498,-7.95496 C 665.4917,201.09834 668.14337,200 671.25,200 Z"
             style="fill:#ef7f3f;fill-opacity:1;fill-rule:nonzero;stroke:none"
             id="path180"
             inkscape:connector-curvature="0" /><path
             d="m 671.25,200 h 130.5 c 3.10657,0 5.75818,1.09834 7.9549,3.29504 2.19671,2.1967 3.29504,4.84835 3.2951,7.95496 v 52.5 c -6e-5,3.1066 -1.09839,5.75824 -3.2951,7.95493 -2.19672,2.19668 -4.84833,3.29504 -7.9549,3.29507 h -130.5 c -3.10663,-3e-5 -5.7583,-1.09839 -7.95502,-3.29507 C 661.09827,269.50824 659.99994,266.8566 660,263.75 v -52.5 c -6e-5,-3.10661 1.09827,-5.75826 3.29498,-7.95496 C 665.4917,201.09834 668.14337,200 671.25,200 Z"
             style="fill:none;stroke:#000000;stroke-width:1;stroke-linecap:butt;stroke-linejoin:miter;stroke-miterlimit:10;stroke-dasharray:none;stroke-opacity:1"
             id="path182"
             inkscape:connector-curvature="0" /></g><g
           id="g184"
           transform="matrix(0.71912831,0,0,0.71912831,476.06293,145.26392)"><path
   d="m 0,24 h 150 v 1 H 0 Z"
   style="fill:#9a9a9a;fill-opacity:1;fill-rule:nonzero;stroke:none"
   id="path186"
   inkscape:connector-curvature="0" /><path
   d="m 0,25 h 150 v 1 H 0 Z"
   style="fill:#eeeeee;fill-opacity:1;fill-rule:nonzero;stroke:none"
   id="path188"
   inkscape:connector-curvature="0" /><path
   d="m 149,25 v 1 h 1 v -2"
   style="fill:#eeeeee;fill-opacity:1;fill-rule:nonzero;stroke:none"
   id="path190"
   inkscape:connector-curvature="0" /><path
   d="m 0,24 v 2 l 1,-1 v -1"
   style="fill:#9a9a9a;fill-opacity:1;fill-rule:nonzero;stroke:none"
   id="path192"
   inkscape:connector-curvature="0" /><path
   d="m 46.3125,16 h 57.35938 v 1 H 46.3125 Z"
   style="fill:#000000;fill-opacity:1;fill-rule:nonzero;stroke:none"
   id="path194"
   inkscape:connector-curvature="0" /><text
   transform="translate(46.3125,15)"
   style="font-variant:normal;font-weight:bold;font-size:12px;font-family:Helvetica;-inkscape-font-specification:Helvetica-Bold;writing-mode:lr-tb;fill:#000000;fill-opacity:1;fill-rule:nonzero;stroke:none"
   id="text198"><tspan
     x="0 8.0039062 12.673828 20.003906 26.677734 33.351562 40.025391 47.355469 50.689453"
     y="0"
     sodipodi:role="line"
     id="tspan196">Proceso 4</tspan></text>

<text
   transform="translate(19.984375,43)"
   style="font-variant:normal;font-weight:bold;font-size:12px;font-family:Helvetica;-inkscape-font-specification:Helvetica-Bold;writing-mode:lr-tb;fill:#000000;fill-opacity:1;fill-rule:nonzero;stroke:none"
   id="text202"><tspan
     x="0 8.0039062 14.677734 22.007812 28.681641 33.351562 36.685547 47.355469 54.029297 61.359375 65.355469 72.029297 78.703125 82.037109 89.367188 96.697266 100.03125 106.70508"
     y="0"
     sodipodi:role="line"
     id="tspan200">Experimentación y </tspan></text>

<text
   transform="translate(23.984375,57)"
   style="font-variant:normal;font-weight:bold;font-size:12px;font-family:Helvetica;-inkscape-font-specification:Helvetica-Bold;writing-mode:lr-tb;fill:#000000;fill-opacity:1;fill-rule:nonzero;stroke:none"
   id="text206"><tspan
     x="0 4.6699219 11.34375 18.017578 25.347656 28.681641 32.677734 39.351562 46.681641 54.011719 60.685547 64.019531 71.349609 78.679688 85.353516 88.6875 95.361328"
     y="0"
     sodipodi:role="line"
     id="tspan204">resultados ﬁnales</tspan></text>

</g><g
           id="g208"
           transform="scale(0.71912831)"><text
   transform="translate(742.47656,311)"
   style="font-variant:normal;font-weight:normal;font-size:12px;font-family:Helvetica;-inkscape-font-specification:Helvetica;writing-mode:lr-tb;fill:#000000;fill-opacity:1;fill-rule:nonzero;stroke:none"
   id="text212"><tspan
     x="0 8.0039062 14.677734 21.351562 28.025391 31.359375 38.033203 44.033203 46.699219 53.373047"
     y="0"
     sodipodi:role="line"
     id="tspan210">Adaptación</tspan></text>

<text
   transform="translate(745.82227,325)"
   style="font-variant:normal;font-weight:normal;font-size:12px;font-family:Helvetica;-inkscape-font-specification:Helvetica;writing-mode:lr-tb;fill:#000000;fill-opacity:1;fill-rule:nonzero;stroke:none"
   id="text216"><tspan
     x="0 6.6738281 9.3398438 12.673828 16.007812 22.681641 26.677734 36.673828 43.347656 46.681641"
     y="0"
     sodipodi:role="line"
     id="tspan214">al formato</tspan></text>

<text
   transform="translate(754.1543,339)"
   style="font-variant:normal;font-weight:normal;font-size:12px;font-family:Helvetica;-inkscape-font-specification:Helvetica;writing-mode:lr-tb;fill:#000000;fill-opacity:1;fill-rule:nonzero;stroke:none"
   id="text220"><tspan
     x="0 3.9960938 10.669922 16.669922 23.34375 30.017578"
     y="0"
     sodipodi:role="line"
     id="tspan218">rosbag</tspan></text>

</g><g
           id="g222"
           transform="matrix(0.71912831,0,0,0.71912831,0.35956416,0.35956416)"><path
             d="m 356,144 h 38.63"
             style="fill:none;stroke:#000000;stroke-width:1;stroke-linecap:butt;stroke-linejoin:miter;stroke-miterlimit:10;stroke-dasharray:none;stroke-opacity:1"
             id="path224"
             inkscape:connector-curvature="0" /><path
             d="m 399.88,144 -7,3.5 1.75,-3.5 -1.75,-3.5 z"
             style="fill:#000000;fill-opacity:1;fill-rule:nonzero;stroke:none"
             id="path226"
             inkscape:connector-curvature="0" /><path
             d="m 399.88,144 -7,3.5 1.75,-3.5 -1.75,-3.5 z"
             style="fill:none;stroke:#000000;stroke-width:1;stroke-linecap:butt;stroke-linejoin:miter;stroke-miterlimit:10;stroke-dasharray:none;stroke-opacity:1"
             id="path228"
             inkscape:connector-curvature="0" /><path
             d="m 216,124 h 140 v 40 H 216 Z"
             style="fill:#a7cb68;fill-opacity:1;fill-rule:nonzero;stroke:none"
             id="path230"
             inkscape:connector-curvature="0" /><path
             d="m 216,124 h 140 v 40 H 216 Z"
             style="fill:none;stroke:#000000;stroke-width:1;stroke-linecap:butt;stroke-linejoin:miter;stroke-miterlimit:10;stroke-dasharray:none;stroke-opacity:1"
             id="path232"
             inkscape:connector-curvature="0" /></g><g
           id="g234"
           transform="matrix(0.71912831,0,0,0.71912831,163.96126,99.239708)"><text
   transform="translate(0.984375,11)"
   style="font-variant:normal;font-weight:bold;font-size:12px;font-family:Helvetica;-inkscape-font-specification:Helvetica-Bold;writing-mode:lr-tb;fill:#000000;fill-opacity:1;fill-rule:nonzero;stroke:none"
   id="text238"><tspan
     x="0 8.6660156 12 18.673828 26.003906 33.333984 40.007812 43.341797 47.337891 50.671875 57.345703 64.675781 68.009766 75.339844 82.669922 90 97.330078 104.00391 108.67383"
     y="0"
     sodipodi:role="line"
     id="tspan236">Dispositivo onboard</tspan></text>

</g><g
           id="g240"
           transform="matrix(0.71912831,0,0,0.71912831,0.35956416,0.35956416)"><path
             d="m 690,330 h 47 v -48.63"
             style="fill:none;stroke:#000000;stroke-width:1;stroke-linecap:butt;stroke-linejoin:miter;stroke-miterlimit:10;stroke-dasharray:none;stroke-opacity:1"
             id="path242"
             inkscape:connector-curvature="0" /><path
             d="m 737,276.12 3.5,7 -3.5,-1.75 -3.5,1.75 z"
             style="fill:#000000;fill-opacity:1;fill-rule:nonzero;stroke:none"
             id="path244"
             inkscape:connector-curvature="0" /><path
             d="m 737,276.12 3.5,7 -3.5,-1.75 -3.5,1.75 z"
             style="fill:none;stroke:#000000;stroke-width:1;stroke-linecap:butt;stroke-linejoin:miter;stroke-miterlimit:10;stroke-dasharray:none;stroke-opacity:1"
             id="path246"
             inkscape:connector-curvature="0" /><path
             d="m 610,305 h 80 v 50 h -80 z"
             style="fill:#a7cb68;fill-opacity:1;fill-rule:nonzero;stroke:none"
             id="path248"
             inkscape:connector-curvature="0" /><path
             d="m 610,305 h 80 v 50 h -80 z"
             style="fill:none;stroke:#000000;stroke-width:1;stroke-linecap:butt;stroke-linejoin:miter;stroke-miterlimit:10;stroke-dasharray:none;stroke-opacity:1"
             id="path250"
             inkscape:connector-curvature="0" /></g><g
           id="g252"
           transform="matrix(0.71912831,0,0,0.71912831,440.82565,227.96367)"><text
   transform="translate(3.984375,11)"
   style="font-variant:normal;font-weight:bold;font-size:12px;font-family:Helvetica;-inkscape-font-specification:Helvetica-Bold;writing-mode:lr-tb;fill:#000000;fill-opacity:1;fill-rule:nonzero;stroke:none"
   id="text256"><tspan
     x="0 8.0039062 14.677734 21.351562 28.681641 35.355469 42.685547 49.359375 52.693359 59.367188"
     y="0"
     sodipodi:role="line"
     id="tspan254">Secuencias</tspan></text>

<text
   transform="translate(15.328125,25)"
   style="font-variant:normal;font-weight:bold;font-size:12px;font-family:Helvetica;-inkscape-font-specification:Helvetica-Bold;writing-mode:lr-tb;fill:#000000;fill-opacity:1;fill-rule:nonzero;stroke:none"
   id="text260"><tspan
     x="0 7.3300781 12 19.330078 26.660156 29.994141 36.667969"
     y="0"
     sodipodi:role="line"
     id="tspan258">propias</tspan></text>

</g><g
           id="g262"
           transform="matrix(0.71912831,0,0,0.71912831,0.35956416,0.35956416)"><path
             d="m 700,144 h 37 v 49.63"
             style="fill:none;stroke:#000000;stroke-width:1;stroke-linecap:butt;stroke-linejoin:miter;stroke-miterlimit:10;stroke-dasharray:none;stroke-opacity:1"
             id="path264"
             inkscape:connector-curvature="0" /><path
             d="m 737,198.88 -3.5,-7 3.5,1.75 3.5,-1.75 z"
             style="fill:#000000;fill-opacity:1;fill-rule:nonzero;stroke:none"
             id="path266"
             inkscape:connector-curvature="0" /><path
             d="m 737,198.88 -3.5,-7 3.5,1.75 3.5,-1.75 z"
             style="fill:none;stroke:#000000;stroke-width:1;stroke-linecap:butt;stroke-linejoin:miter;stroke-miterlimit:10;stroke-dasharray:none;stroke-opacity:1"
             id="path268"
             inkscape:connector-curvature="0" /><path
             d="m 606.5,119 h 93 v 50 h -93 z"
             style="fill:#a7cb68;fill-opacity:1;fill-rule:nonzero;stroke:none"
             id="path270"
             inkscape:connector-curvature="0" /><path
             d="m 606.5,119 h 93 v 50 h -93 z"
             style="fill:none;stroke:#000000;stroke-width:1;stroke-linecap:butt;stroke-linejoin:miter;stroke-miterlimit:10;stroke-dasharray:none;stroke-opacity:1"
             id="path272"
             inkscape:connector-curvature="0" /></g><g
           id="g274"
           transform="matrix(0.71912831,0,0,0.71912831,438.66827,94.205811)"><text
   transform="translate(2.828125,11)"
   style="font-variant:normal;font-weight:bold;font-size:12px;font-family:Helvetica;-inkscape-font-specification:Helvetica-Bold;writing-mode:lr-tb;fill:#000000;fill-opacity:1;fill-rule:nonzero;stroke:none"
   id="text278"><tspan
     x="0 8.6660156 15.996094 23.326172 30.65625 37.986328 45.316406 49.986328 56.660156 63.333984 66.667969 73.998047"
     y="0"
     sodipodi:role="line"
     id="tspan276">Conﬁguración</tspan></text>

<text
   transform="translate(15.8125,25)"
   style="font-variant:normal;font-weight:bold;font-size:12px;font-family:Helvetica;-inkscape-font-specification:Helvetica-Bold;writing-mode:lr-tb;fill:#000000;fill-opacity:1;fill-rule:nonzero;stroke:none"
   id="text282"><tspan
     x="0 6.6738281 14.003906 20.677734 27.351562 34.681641 41.355469 48.685547"
     y="0"
     sodipodi:role="line"
     id="tspan280">adecuada</tspan></text>

</g><g
           id="g284"
           transform="scale(0.71912831)"><text
   transform="translate(535.81738,303)"
   style="font-variant:normal;font-weight:normal;font-size:12px;font-family:Helvetica;-inkscape-font-specification:Helvetica;writing-mode:lr-tb;fill:#000000;fill-opacity:1;fill-rule:nonzero;stroke:none"
   id="text288"><tspan
     x="0 9.3339844 13.330078 20.003906 26.677734 33.351562 39.351562 42.017578 48.691406"
     y="0"
     sodipodi:role="line"
     id="tspan286">Grabación</tspan></text>

</g></g></g></g></svg>