<?xml version="1.0" encoding="UTF-8" standalone="no"?>
<!-- Created with Inkscape (http://www.inkscape.org/) -->

<svg
   xmlns:dc="http://purl.org/dc/elements/1.1/"
   xmlns:cc="http://creativecommons.org/ns#"
   xmlns:rdf="http://www.w3.org/1999/02/22-rdf-syntax-ns#"
   xmlns:svg="http://www.w3.org/2000/svg"
   xmlns="http://www.w3.org/2000/svg"
   xmlns:sodipodi="http://sodipodi.sourceforge.net/DTD/sodipodi-0.dtd"
   xmlns:inkscape="http://www.inkscape.org/namespaces/inkscape"
   version="1.1"
   id="svg2"
   xml:space="preserve"
   width="455.22937"
   height="176.84001"
   viewBox="0 0 455.22937 176.84001"
   sodipodi:docname="agast_2.svg"
   inkscape:version="0.92.3 (unknown)"><metadata
     id="metadata8"><rdf:RDF><cc:Work
         rdf:about=""><dc:format>image/svg+xml</dc:format><dc:type
           rdf:resource="http://purl.org/dc/dcmitype/StillImage" /><dc:title></dc:title></cc:Work></rdf:RDF></metadata><defs
     id="defs6"><inkscape:path-effect
       effect="powerstroke"
       id="path-effect2996"
       is_visible="true"
       offset_points="0.93382363,0.16525422"
       sort_points="true"
       interpolator_type="CubicBezierJohan"
       interpolator_beta="0.2"
       start_linecap_type="zerowidth"
       linejoin_type="extrp_arc"
       miter_limit="4"
       end_linecap_type="zerowidth" /><inkscape:path-effect
       effect="bspline"
       id="path-effect2994"
       is_visible="true"
       weight="33.333333"
       steps="2"
       helper_size="0"
       apply_no_weight="true"
       apply_with_weight="true"
       only_selected="false" /><clipPath
       clipPathUnits="userSpaceOnUse"
       id="clipPath26"><path
         d="M 1347.6,5388.46 H 4762.52 V 6751.1 H 1347.6 Z"
         id="path24"
         inkscape:connector-curvature="0"
         style="clip-rule:evenodd" /></clipPath></defs><sodipodi:namedview
     pagecolor="#ffffff"
     bordercolor="#666666"
     borderopacity="1"
     objecttolerance="10"
     gridtolerance="10"
     guidetolerance="10"
     inkscape:pageopacity="0"
     inkscape:pageshadow="2"
     inkscape:window-width="1301"
     inkscape:window-height="744"
     id="namedview4"
     showgrid="false"
     inkscape:zoom="0.89393939"
     inkscape:cx="212.04366"
     inkscape:cy="-95.311158"
     inkscape:window-x="65"
     inkscape:window-y="24"
     inkscape:window-maximized="1"
     inkscape:current-layer="g10" /><g
     id="g10"
     inkscape:groupmode="layer"
     inkscape:label="agast"
     transform="matrix(1.3333333,0,0,-1.3333333,-179.7733,895.34103)"><g
       id="g3388"><path
         d="m 257.754,647.899 c -1.961,0 -3.551,1.592 -3.551,3.556 0,1.965 1.59,3.557 3.551,3.557 1.949,0 3.538,-1.592 3.538,-3.557 0,-1.964 -1.589,-3.556 -3.538,-3.556"
         style="fill:#fefefe;fill-opacity:1;fill-rule:evenodd;stroke:none;stroke-width:0.1"
         id="path28"
         inkscape:connector-curvature="0" /><g
         id="g30"
         transform="scale(0.0999118,0.100088)"><path
           d="m 2579.81,6473.28 c -19.63,0 -35.54,15.91 -35.54,35.53 0,19.63 15.91,35.54 35.54,35.54 19.51,0 35.42,-15.91 35.42,-35.54 0,-19.62 -15.91,-35.53 -35.42,-35.53 z"
           style="fill:none;stroke:#000000;stroke-width:7.50000477;stroke-linecap:butt;stroke-linejoin:round;stroke-miterlimit:10;stroke-dasharray:none;stroke-opacity:1"
           id="path32"
           inkscape:connector-curvature="0" /></g><g
         id="g34"
         transform="scale(0.0999118,0.100088)"><path
           d="M 2544.15,6505.45 2248.13,6402.32"
           style="fill:none;stroke:#000000;stroke-width:7.50000477;stroke-linecap:butt;stroke-linejoin:round;stroke-miterlimit:10;stroke-dasharray:none;stroke-opacity:1"
           id="path36"
           inkscape:connector-curvature="0" /></g><path
         d="m 224.325,633.683 c -1.961,0 -3.551,1.592 -3.551,3.557 0,1.964 1.59,3.556 3.551,3.556 1.949,0 3.539,-1.592 3.539,-3.556 0,-1.965 -1.59,-3.557 -3.539,-3.557"
         style="fill:#fefefe;fill-opacity:1;fill-rule:evenodd;stroke:none;stroke-width:0.1"
         id="path38"
         inkscape:connector-curvature="0" /><g
         id="g40"
         transform="scale(0.0999118,0.100088)"><path
           d="m 2245.23,6331.24 c -19.63,0 -35.54,15.92 -35.54,35.54 0,19.63 15.91,35.54 35.54,35.54 19.51,0 35.42,-15.91 35.42,-35.54 0,-19.62 -15.91,-35.54 -35.42,-35.54 z"
           style="fill:none;stroke:#000000;stroke-width:7.50000477;stroke-linecap:butt;stroke-linejoin:round;stroke-miterlimit:10;stroke-dasharray:none;stroke-opacity:1"
           id="path42"
           inkscape:connector-curvature="0" /></g><g
         id="g44"
         transform="scale(0.0999118,0.100088)"><path
           d="m 2213.64,6349.59 -143.66,-89.3"
           style="fill:none;stroke:#000000;stroke-width:7.50000477;stroke-linecap:butt;stroke-linejoin:round;stroke-miterlimit:10;stroke-dasharray:none;stroke-opacity:1"
           id="path46"
           inkscape:connector-curvature="0" /></g><path
         d="m 242.008,619.467 c -1.961,0 -3.551,1.593 -3.551,3.557 0,1.965 1.59,3.557 3.551,3.557 1.961,0 3.551,-1.592 3.551,-3.557 0,-1.964 -1.59,-3.557 -3.551,-3.557"
         style="fill:#fefefe;fill-opacity:1;fill-rule:evenodd;stroke:none;stroke-width:0.1"
         id="path48"
         inkscape:connector-curvature="0" /><g
         id="g50"
         transform="scale(0.0999118,0.100088)"><path
           d="m 2422.21,6189.21 c -19.62,0 -35.53,15.91 -35.53,35.54 0,19.63 15.91,35.54 35.53,35.54 19.63,0 35.54,-15.91 35.54,-35.54 0,-19.63 -15.91,-35.54 -35.54,-35.54 z"
           style="fill:none;stroke:#000000;stroke-width:7.50000477;stroke-linecap:butt;stroke-linejoin:round;stroke-miterlimit:10;stroke-dasharray:none;stroke-opacity:1"
           id="path52"
           inkscape:connector-curvature="0" /></g><g
         id="g54"
         transform="scale(0.0999118,0.100088)"><path
           d="m 2390.74,6207.56 -60.97,-81.52"
           style="fill:none;stroke:#000000;stroke-width:7.50000477;stroke-linecap:butt;stroke-linejoin:round;stroke-miterlimit:10;stroke-dasharray:none;stroke-opacity:1"
           id="path56"
           inkscape:connector-curvature="0" /></g><g
         id="g58"
         transform="scale(0.0999118,0.100088)"><path
           d="m 2514.66,6127.55 -60.97,81.52"
           style="fill:none;stroke:#000000;stroke-width:7.50000477;stroke-linecap:butt;stroke-linejoin:round;stroke-miterlimit:10;stroke-dasharray:none;stroke-opacity:1"
           id="path60"
           inkscape:connector-curvature="0" /></g><g
         id="g62"
         transform="scale(0.0999118,0.100088)"><path
           d="m 2413.97,6260.29 -138.55,88.49"
           style="fill:none;stroke:#000000;stroke-width:7.50000477;stroke-linecap:butt;stroke-linejoin:round;stroke-miterlimit:10;stroke-dasharray:none;stroke-opacity:1"
           id="path64"
           inkscape:connector-curvature="0" /></g><path
         d="m 291.368,633.683 c -1.961,0 -3.551,1.592 -3.551,3.557 0,1.964 1.59,3.556 3.551,3.556 1.949,0 3.539,-1.592 3.539,-3.556 0,-1.965 -1.59,-3.557 -3.539,-3.557"
         style="fill:#fefefe;fill-opacity:1;fill-rule:evenodd;stroke:none;stroke-width:0.1"
         id="path66"
         inkscape:connector-curvature="0" /><g
         id="g68"
         transform="scale(0.0999118,0.100088)"><path
           d="m 2916.25,6331.24 c -19.63,0 -35.54,15.92 -35.54,35.54 0,19.63 15.91,35.54 35.54,35.54 19.51,0 35.42,-15.91 35.42,-35.54 0,-19.62 -15.91,-35.54 -35.42,-35.54 z"
           style="fill:none;stroke:#000000;stroke-width:7.50000477;stroke-linecap:butt;stroke-linejoin:round;stroke-miterlimit:10;stroke-dasharray:none;stroke-opacity:1"
           id="path70"
           inkscape:connector-curvature="0" /></g><g
         id="g72"
         transform="scale(0.0999118,0.100088)"><path
           d="m 2884.77,6349.59 -106.49,-89.3"
           style="fill:none;stroke:#000000;stroke-width:7.50000477;stroke-linecap:butt;stroke-linejoin:round;stroke-miterlimit:10;stroke-dasharray:none;stroke-opacity:1"
           id="path74"
           inkscape:connector-curvature="0" /></g><g
         id="g76"
         transform="scale(0.0999118,0.100088)"><path
           d="m 3053.06,6259.48 -106.5,89.3"
           style="fill:none;stroke:#000000;stroke-width:7.50000477;stroke-linecap:butt;stroke-linejoin:round;stroke-miterlimit:10;stroke-dasharray:none;stroke-opacity:1"
           id="path78"
           inkscape:connector-curvature="0" /></g><path
         d="m 206.816,619.467 c -1.961,0 -3.551,1.593 -3.551,3.557 0,1.965 1.59,3.557 3.551,3.557 1.949,0 3.539,-1.592 3.539,-3.557 0,-1.964 -1.59,-3.557 -3.539,-3.557"
         style="fill:#fefefe;fill-opacity:1;fill-rule:evenodd;stroke:none;stroke-width:0.1"
         id="path80"
         inkscape:connector-curvature="0" /><g
         id="g82"
         transform="scale(0.0999118,0.100088)"><path
           d="m 2069.98,6189.21 c -19.62,0 -35.54,15.91 -35.54,35.54 0,19.63 15.92,35.54 35.54,35.54 19.51,0 35.42,-15.91 35.42,-35.54 0,-19.63 -15.91,-35.54 -35.42,-35.54 z"
           style="fill:none;stroke:#000000;stroke-width:7.50000477;stroke-linecap:butt;stroke-linejoin:round;stroke-miterlimit:10;stroke-dasharray:none;stroke-opacity:1"
           id="path84"
           inkscape:connector-curvature="0" /></g><g
         id="g86"
         transform="scale(0.0999118,0.100088)"><path
           d="m 2038.39,6207.56 -60.97,-81.52"
           style="fill:none;stroke:#000000;stroke-width:7.50000477;stroke-linecap:butt;stroke-linejoin:round;stroke-miterlimit:10;stroke-dasharray:none;stroke-opacity:1"
           id="path88"
           inkscape:connector-curvature="0" /></g><g
         id="g90"
         transform="scale(0.0999118,0.100088)"><path
           d="m 2162.42,6127.55 -60.96,81.52"
           style="fill:none;stroke:#000000;stroke-width:7.50000477;stroke-linecap:butt;stroke-linejoin:round;stroke-miterlimit:10;stroke-dasharray:none;stroke-opacity:1"
           id="path92"
           inkscape:connector-curvature="0" /></g><path
         d="m 216.307,606.6 c -1.961,0 -3.551,1.592 -3.551,3.545 0,1.964 1.59,3.557 3.551,3.557 1.961,0 3.55,-1.593 3.55,-3.557 0,-1.953 -1.589,-3.545 -3.55,-3.545"
         style="fill:#fefefe;fill-opacity:1;fill-rule:evenodd;stroke:none;stroke-width:0.1"
         id="path94"
         inkscape:connector-curvature="0" /><g
         id="g96"
         transform="scale(0.0999118,0.100088)"><path
           d="m 2164.98,6060.65 c -19.63,0 -35.54,15.91 -35.54,35.43 0,19.62 15.91,35.53 35.54,35.53 19.63,0 35.54,-15.91 35.54,-35.53 0,-19.52 -15.91,-35.43 -35.54,-35.43 z"
           style="fill:none;stroke:#000000;stroke-width:7.50000477;stroke-linecap:butt;stroke-linejoin:round;stroke-miterlimit:10;stroke-dasharray:none;stroke-opacity:1"
           id="path98"
           inkscape:connector-curvature="0" /></g><g
         id="g100"
         transform="scale(0.0999118,0.100088)"><path
           d="m 2133.51,6078.89 -60.97,-81.53"
           style="fill:none;stroke:#000000;stroke-width:7.50000477;stroke-linecap:butt;stroke-linejoin:round;stroke-miterlimit:10;stroke-dasharray:none;stroke-opacity:1"
           id="path102"
           inkscape:connector-curvature="0" /></g><g
         id="g104"
         transform="scale(0.0999118,0.100088)"><path
           d="m 2257.42,5998.87 -60.97,81.52"
           style="fill:none;stroke:#000000;stroke-width:7.50000477;stroke-linecap:butt;stroke-linejoin:round;stroke-miterlimit:10;stroke-dasharray:none;stroke-opacity:1"
           id="path106"
           inkscape:connector-curvature="0" /></g><path
         d="m 197.87,606.6 c -1.961,0 -3.551,1.592 -3.551,3.545 0,1.964 1.59,3.557 3.551,3.557 1.96,0 3.55,-1.593 3.55,-3.557 0,-1.953 -1.59,-3.545 -3.55,-3.545"
         style="fill:#e5e5e5;fill-opacity:1;fill-rule:evenodd;stroke:none;stroke-width:0.1"
         id="path108"
         inkscape:connector-curvature="0" /><g
         id="g110"
         transform="scale(0.0999118,0.100088)"><path
           d="m 1980.44,6060.65 c -19.62,0 -35.53,15.91 -35.53,35.43 0,19.62 15.91,35.53 35.53,35.53 19.63,0 35.54,-15.91 35.54,-35.53 0,-19.52 -15.91,-35.43 -35.54,-35.43 z"
           style="fill:none;stroke:#000000;stroke-width:7.50000477;stroke-linecap:butt;stroke-linejoin:round;stroke-miterlimit:10;stroke-dasharray:none;stroke-opacity:1"
           id="path112"
           inkscape:connector-curvature="0" /></g><path
         d="m 206.816,593.163 c -1.961,0 -3.551,1.592 -3.551,3.557 0,1.964 1.59,3.557 3.551,3.557 1.949,0 3.539,-1.593 3.539,-3.557 0,-1.965 -1.59,-3.557 -3.539,-3.557"
         style="fill:#fefefe;fill-opacity:1;fill-rule:evenodd;stroke:none;stroke-width:0.1"
         id="path114"
         inkscape:connector-curvature="0" /><g
         id="g116"
         transform="scale(0.0999118,0.100088)"><path
           d="m 2069.98,5926.4 c -19.62,0 -35.54,15.91 -35.54,35.54 0,19.63 15.92,35.54 35.54,35.54 19.51,0 35.42,-15.91 35.42,-35.54 0,-19.63 -15.91,-35.54 -35.42,-35.54 z"
           style="fill:none;stroke:#000000;stroke-width:7.50000477;stroke-linecap:butt;stroke-linejoin:round;stroke-miterlimit:10;stroke-dasharray:none;stroke-opacity:1"
           id="path118"
           inkscape:connector-curvature="0" /></g><g
         id="g120"
         transform="scale(0.0999118,0.100088)"><path
           d="m 2038.39,5944.75 -60.97,-81.52"
           style="fill:none;stroke:#000000;stroke-width:7.50000477;stroke-linecap:butt;stroke-linejoin:round;stroke-miterlimit:10;stroke-dasharray:none;stroke-opacity:1"
           id="path122"
           inkscape:connector-curvature="0" /></g><g
         id="g124"
         transform="scale(0.0999118,0.100088)"><path
           d="m 2162.42,5864.74 -60.96,81.52"
           style="fill:none;stroke:#000000;stroke-width:7.50000477;stroke-linecap:butt;stroke-linejoin:round;stroke-miterlimit:10;stroke-dasharray:none;stroke-opacity:1"
           id="path126"
           inkscape:connector-curvature="0" /></g><path
         d="m 197.312,579.738 c -1.96,0 -3.55,1.592 -3.55,3.545 0,1.964 1.59,3.557 3.55,3.557 1.961,0 3.551,-1.593 3.551,-3.557 0,-1.953 -1.59,-3.545 -3.551,-3.545"
         style="fill:#656565;fill-opacity:1;fill-rule:evenodd;stroke:none;stroke-width:0.1"
         id="path128"
         inkscape:connector-curvature="0" /><g
         id="g130"
         transform="scale(0.0999118,0.100088)"><path
           d="m 1974.87,5792.27 c -19.63,0 -35.54,15.91 -35.54,35.42 0,19.63 15.91,35.54 35.54,35.54 19.62,0 35.54,-15.91 35.54,-35.54 0,-19.51 -15.92,-35.42 -35.54,-35.42 z"
           style="fill:none;stroke:#000000;stroke-width:7.50000477;stroke-linecap:butt;stroke-linejoin:round;stroke-miterlimit:10;stroke-dasharray:none;stroke-opacity:1"
           id="path132"
           inkscape:connector-curvature="0" /></g><path
         d="m 225.81,593.721 c -1.961,0 -3.551,1.592 -3.551,3.557 0,1.964 1.59,3.557 3.551,3.557 1.949,0 3.539,-1.593 3.539,-3.557 0,-1.965 -1.59,-3.557 -3.539,-3.557"
         style="fill:#b2b2b2;fill-opacity:1;fill-rule:evenodd;stroke:none;stroke-width:0.1"
         id="path134"
         inkscape:connector-curvature="0" /><g
         id="g136"
         transform="scale(0.0999118,0.100088)"><path
           d="m 2260.09,5931.98 c -19.63,0 -35.53,15.91 -35.53,35.53 0,19.63 15.9,35.54 35.53,35.54 19.51,0 35.42,-15.91 35.42,-35.54 0,-19.62 -15.91,-35.53 -35.42,-35.53 z"
           style="fill:none;stroke:#000000;stroke-width:7.50000477;stroke-linecap:butt;stroke-linejoin:round;stroke-miterlimit:10;stroke-dasharray:none;stroke-opacity:1"
           id="path138"
           inkscape:connector-curvature="0" /></g><path
         d="m 216.423,579.889 c -1.961,0 -3.551,1.592 -3.551,3.545 0,1.964 1.59,3.557 3.551,3.557 1.949,0 3.539,-1.593 3.539,-3.557 0,-1.953 -1.59,-3.545 -3.539,-3.545"
         style="fill:#fefefe;fill-opacity:1;fill-rule:evenodd;stroke:none;stroke-width:0.1"
         id="path140"
         inkscape:connector-curvature="0" /><g
         id="g142"
         transform="scale(0.0999118,0.100088)"><path
           d="m 2166.14,5793.78 c -19.63,0 -35.54,15.91 -35.54,35.42 0,19.63 15.91,35.54 35.54,35.54 19.51,0 35.42,-15.91 35.42,-35.54 0,-19.51 -15.91,-35.42 -35.42,-35.42 z"
           style="fill:none;stroke:#000000;stroke-width:7.50000477;stroke-linecap:butt;stroke-linejoin:round;stroke-miterlimit:10;stroke-dasharray:none;stroke-opacity:1"
           id="path144"
           inkscape:connector-curvature="0" /></g><g
         id="g146"
         transform="scale(0.0999118,0.100088)"><path
           d="m 2134.67,5812.01 -60.97,-81.53"
           style="fill:none;stroke:#000000;stroke-width:7.50000477;stroke-linecap:butt;stroke-linejoin:round;stroke-miterlimit:10;stroke-dasharray:none;stroke-opacity:1"
           id="path148"
           inkscape:connector-curvature="0" /></g><g
         id="g150"
         transform="scale(0.0999118,0.100088)"><path
           d="m 2258.58,5731.99 -60.97,81.53"
           style="fill:none;stroke:#000000;stroke-width:7.50000477;stroke-linecap:butt;stroke-linejoin:round;stroke-miterlimit:10;stroke-dasharray:none;stroke-opacity:1"
           id="path152"
           inkscape:connector-curvature="0" /></g><path
         d="m 251.615,606.193 c -1.961,0 -3.55,1.593 -3.55,3.545 0,1.965 1.589,3.557 3.55,3.557 1.961,0 3.551,-1.592 3.551,-3.557 0,-1.952 -1.59,-3.545 -3.551,-3.545"
         style="fill:#fefefe;fill-opacity:1;fill-rule:evenodd;stroke:none;stroke-width:0.1"
         id="path154"
         inkscape:connector-curvature="0" /><g
         id="g156"
         transform="scale(0.0999118,0.100088)"><path
           d="m 2518.37,6056.59 c -19.62,0 -35.53,15.91 -35.53,35.42 0,19.63 15.91,35.54 35.53,35.54 19.63,0 35.54,-15.91 35.54,-35.54 0,-19.51 -15.91,-35.42 -35.54,-35.42 z"
           style="fill:none;stroke:#000000;stroke-width:7.50000477;stroke-linecap:butt;stroke-linejoin:round;stroke-miterlimit:10;stroke-dasharray:none;stroke-opacity:1"
           id="path158"
           inkscape:connector-curvature="0" /></g><g
         id="g160"
         transform="scale(0.0999118,0.100088)"><path
           d="m 2486.9,6074.82 -60.97,-81.52"
           style="fill:none;stroke:#000000;stroke-width:7.50000477;stroke-linecap:butt;stroke-linejoin:round;stroke-miterlimit:10;stroke-dasharray:none;stroke-opacity:1"
           id="path162"
           inkscape:connector-curvature="0" /></g><g
         id="g164"
         transform="scale(0.0999118,0.100088)"><path
           d="m 2610.93,5994.81 -60.97,81.52"
           style="fill:none;stroke:#000000;stroke-width:7.50000477;stroke-linecap:butt;stroke-linejoin:round;stroke-miterlimit:10;stroke-dasharray:none;stroke-opacity:1"
           id="path166"
           inkscape:connector-curvature="0" /></g><path
         d="m 261.791,593.732 c -1.961,0 -3.55,1.593 -3.55,3.546 0,1.964 1.589,3.557 3.55,3.557 1.95,0 3.539,-1.593 3.539,-3.557 0,-1.953 -1.589,-3.546 -3.539,-3.546"
         style="fill:#fefefe;fill-opacity:1;fill-rule:evenodd;stroke:none;stroke-width:0.1"
         id="path168"
         inkscape:connector-curvature="0" /><g
         id="g170"
         transform="scale(0.0999118,0.100088)"><path
           d="m 2620.23,5932.09 c -19.63,0 -35.54,15.91 -35.54,35.42 0,19.63 15.91,35.54 35.54,35.54 19.5,0 35.41,-15.91 35.41,-35.54 0,-19.51 -15.91,-35.42 -35.41,-35.42 z"
           style="fill:none;stroke:#000000;stroke-width:7.50000477;stroke-linecap:butt;stroke-linejoin:round;stroke-miterlimit:10;stroke-dasharray:none;stroke-opacity:1"
           id="path172"
           inkscape:connector-curvature="0" /></g><g
         id="g174"
         transform="scale(0.0999118,0.100088)"><path
           d="m 2651.58,5950.33 60.97,-81.53"
           style="fill:none;stroke:#000000;stroke-width:7.50000477;stroke-linecap:butt;stroke-linejoin:round;stroke-miterlimit:10;stroke-dasharray:none;stroke-opacity:1"
           id="path176"
           inkscape:connector-curvature="0" /></g><g
         id="g178"
         transform="scale(0.0999118,0.100088)"><path
           d="m 2527.66,5870.31 60.97,81.53"
           style="fill:none;stroke:#000000;stroke-width:7.50000477;stroke-linecap:butt;stroke-linejoin:round;stroke-miterlimit:10;stroke-dasharray:none;stroke-opacity:1"
           id="path180"
           inkscape:connector-curvature="0" /></g><path
         d="m 305.361,619.479 c -1.961,0 -3.55,1.592 -3.55,3.545 0,1.965 1.589,3.557 3.55,3.557 1.961,0 3.551,-1.592 3.551,-3.557 0,-1.953 -1.59,-3.545 -3.551,-3.545"
         style="fill:#fefefe;fill-opacity:1;fill-rule:evenodd;stroke:none;stroke-width:0.1"
         id="path182"
         inkscape:connector-curvature="0" /><g
         id="g184"
         transform="scale(0.0999118,0.100088)"><path
           d="m 3056.31,6189.33 c -19.63,0 -35.54,15.91 -35.54,35.42 0,19.63 15.91,35.54 35.54,35.54 19.62,0 35.53,-15.91 35.53,-35.54 0,-19.51 -15.91,-35.42 -35.53,-35.42 z"
           style="fill:none;stroke:#000000;stroke-width:7.50000477;stroke-linecap:butt;stroke-linejoin:round;stroke-miterlimit:10;stroke-dasharray:none;stroke-opacity:1"
           id="path186"
           inkscape:connector-curvature="0" /></g><g
         id="g188"
         transform="scale(0.0999118,0.100088)"><path
           d="m 3087.78,6207.56 60.97,-81.52"
           style="fill:none;stroke:#000000;stroke-width:7.50000477;stroke-linecap:butt;stroke-linejoin:round;stroke-miterlimit:10;stroke-dasharray:none;stroke-opacity:1"
           id="path190"
           inkscape:connector-curvature="0" /></g><g
         id="g192"
         transform="scale(0.0999118,0.100088)"><path
           d="m 2963.75,6127.55 60.97,81.52"
           style="fill:none;stroke:#000000;stroke-width:7.50000477;stroke-linecap:butt;stroke-linejoin:round;stroke-miterlimit:10;stroke-dasharray:none;stroke-opacity:1"
           id="path194"
           inkscape:connector-curvature="0" /></g><path
         d="m 295.87,606.6 c -1.961,0 -3.551,1.592 -3.551,3.557 0,1.964 1.59,3.557 3.551,3.557 1.949,0 3.539,-1.593 3.539,-3.557 0,-1.965 -1.59,-3.557 -3.539,-3.557"
         style="fill:#fefefe;fill-opacity:1;fill-rule:evenodd;stroke:none;stroke-width:0.1"
         id="path196"
         inkscape:connector-curvature="0" /><g
         id="g198"
         transform="scale(0.0999118,0.100088)"><path
           d="m 2961.31,6060.65 c -19.63,0 -35.54,15.91 -35.54,35.54 0,19.63 15.91,35.54 35.54,35.54 19.51,0 35.42,-15.91 35.42,-35.54 0,-19.63 -15.91,-35.54 -35.42,-35.54 z"
           style="fill:none;stroke:#000000;stroke-width:7.50000477;stroke-linecap:butt;stroke-linejoin:round;stroke-miterlimit:10;stroke-dasharray:none;stroke-opacity:1"
           id="path200"
           inkscape:connector-curvature="0" /></g><g
         id="g202"
         transform="scale(0.0999118,0.100088)"><path
           d="m 2992.66,6079 60.97,-81.52"
           style="fill:none;stroke:#000000;stroke-width:7.50000477;stroke-linecap:butt;stroke-linejoin:round;stroke-miterlimit:10;stroke-dasharray:none;stroke-opacity:1"
           id="path204"
           inkscape:connector-curvature="0" /></g><g
         id="g206"
         transform="scale(0.0999118,0.100088)"><path
           d="m 2868.75,5998.99 60.97,81.52"
           style="fill:none;stroke:#000000;stroke-width:7.50000477;stroke-linecap:butt;stroke-linejoin:round;stroke-miterlimit:10;stroke-dasharray:none;stroke-opacity:1"
           id="path208"
           inkscape:connector-curvature="0" /></g><path
         d="m 314.307,606.6 c -1.961,0 -3.55,1.592 -3.55,3.557 0,1.964 1.589,3.557 3.55,3.557 1.949,0 3.539,-1.593 3.539,-3.557 0,-1.965 -1.59,-3.557 -3.539,-3.557"
         style="fill:#cbcbcb;fill-opacity:1;fill-rule:evenodd;stroke:none;stroke-width:0.1"
         id="path210"
         inkscape:connector-curvature="0" /><g
         id="g212"
         transform="scale(0.0999118,0.100088)"><path
           d="m 3145.85,6060.65 c -19.63,0 -35.54,15.91 -35.54,35.54 0,19.63 15.91,35.54 35.54,35.54 19.5,0 35.42,-15.91 35.42,-35.54 0,-19.63 -15.92,-35.54 -35.42,-35.54 z"
           style="fill:none;stroke:#000000;stroke-width:7.50000477;stroke-linecap:butt;stroke-linejoin:round;stroke-miterlimit:10;stroke-dasharray:none;stroke-opacity:1"
           id="path214"
           inkscape:connector-curvature="0" /></g><path
         d="m 305.361,593.175 c -1.961,0 -3.55,1.592 -3.55,3.545 0,1.964 1.589,3.557 3.55,3.557 1.961,0 3.551,-1.593 3.551,-3.557 0,-1.953 -1.59,-3.545 -3.551,-3.545"
         style="fill:#fefefe;fill-opacity:1;fill-rule:evenodd;stroke:none;stroke-width:0.1"
         id="path216"
         inkscape:connector-curvature="0" /><g
         id="g218"
         transform="scale(0.0999118,0.100088)"><path
           d="m 3056.31,5926.52 c -19.63,0 -35.54,15.91 -35.54,35.42 0,19.63 15.91,35.54 35.54,35.54 19.62,0 35.53,-15.91 35.53,-35.54 0,-19.51 -15.91,-35.42 -35.53,-35.42 z"
           style="fill:none;stroke:#000000;stroke-width:7.50000477;stroke-linecap:butt;stroke-linejoin:round;stroke-miterlimit:10;stroke-dasharray:none;stroke-opacity:1"
           id="path220"
           inkscape:connector-curvature="0" /></g><g
         id="g222"
         transform="scale(0.0999118,0.100088)"><path
           d="m 3087.78,5944.75 60.97,-81.52"
           style="fill:none;stroke:#000000;stroke-width:7.50000477;stroke-linecap:butt;stroke-linejoin:round;stroke-miterlimit:10;stroke-dasharray:none;stroke-opacity:1"
           id="path224"
           inkscape:connector-curvature="0" /></g><g
         id="g226"
         transform="scale(0.0999118,0.100088)"><path
           d="m 2963.75,5864.74 60.97,81.52"
           style="fill:none;stroke:#000000;stroke-width:7.50000477;stroke-linecap:butt;stroke-linejoin:round;stroke-miterlimit:10;stroke-dasharray:none;stroke-opacity:1"
           id="path228"
           inkscape:connector-curvature="0" /></g><path
         d="m 314.864,579.738 c -1.961,0 -3.551,1.592 -3.551,3.557 0,1.964 1.59,3.557 3.551,3.557 1.961,0 3.55,-1.593 3.55,-3.557 0,-1.965 -1.589,-3.557 -3.55,-3.557"
         style="fill:#656565;fill-opacity:1;fill-rule:evenodd;stroke:none;stroke-width:0.1"
         id="path230"
         inkscape:connector-curvature="0" /><g
         id="g232"
         transform="scale(0.0999118,0.100088)"><path
           d="m 3151.42,5792.27 c -19.63,0 -35.54,15.91 -35.54,35.54 0,19.62 15.91,35.53 35.54,35.53 19.63,0 35.54,-15.91 35.54,-35.53 0,-19.63 -15.91,-35.54 -35.54,-35.54 z"
           style="fill:none;stroke:#000000;stroke-width:7.50000477;stroke-linecap:butt;stroke-linejoin:round;stroke-miterlimit:10;stroke-dasharray:none;stroke-opacity:1"
           id="path234"
           inkscape:connector-curvature="0" /></g><path
         d="m 241.938,592.756 c -1.961,0 -3.55,1.592 -3.55,3.557 0,1.964 1.589,3.557 3.55,3.557 1.95,0 3.539,-1.593 3.539,-3.557 0,-1.965 -1.589,-3.557 -3.539,-3.557"
         style="fill:#989898;fill-opacity:1;fill-rule:evenodd;stroke:none;stroke-width:0.1"
         id="path236"
         inkscape:connector-curvature="0" /><g
         id="g238"
         transform="scale(0.0999118,0.100088)"><path
           d="m 2421.52,5922.34 c -19.63,0 -35.54,15.91 -35.54,35.53 0,19.63 15.91,35.54 35.54,35.54 19.51,0 35.42,-15.91 35.42,-35.54 0,-19.62 -15.91,-35.53 -35.42,-35.53 z"
           style="fill:none;stroke:#000000;stroke-width:7.50000477;stroke-linecap:butt;stroke-linejoin:round;stroke-miterlimit:10;stroke-dasharray:none;stroke-opacity:1"
           id="path240"
           inkscape:connector-curvature="0" /></g><path
         d="m 295.754,579.889 c -1.961,0 -3.551,1.592 -3.551,3.557 0,1.964 1.59,3.556 3.551,3.556 1.96,0 3.55,-1.592 3.55,-3.556 0,-1.965 -1.59,-3.557 -3.55,-3.557"
         style="fill:#fefefe;fill-opacity:1;fill-rule:evenodd;stroke:none;stroke-width:0.1"
         id="path242"
         inkscape:connector-curvature="0" /><g
         id="g244"
         transform="scale(0.0999118,0.100088)"><path
           d="m 2960.15,5793.78 c -19.63,0 -35.54,15.91 -35.54,35.54 0,19.62 15.91,35.53 35.54,35.53 19.62,0 35.54,-15.91 35.54,-35.53 0,-19.63 -15.92,-35.54 -35.54,-35.54 z"
           style="fill:none;stroke:#000000;stroke-width:7.50000477;stroke-linecap:butt;stroke-linejoin:round;stroke-miterlimit:10;stroke-dasharray:none;stroke-opacity:1"
           id="path246"
           inkscape:connector-curvature="0" /></g><g
         id="g248"
         transform="scale(0.0999118,0.100088)"><path
           d="m 2991.62,5812.13 60.97,-81.53"
           style="fill:none;stroke:#000000;stroke-width:7.50000477;stroke-linecap:butt;stroke-linejoin:round;stroke-miterlimit:10;stroke-dasharray:none;stroke-opacity:1"
           id="path250"
           inkscape:connector-curvature="0" /></g><g
         id="g252"
         transform="scale(0.0999118,0.100088)"><path
           d="m 2867.59,5732.11 60.97,81.53"
           style="fill:none;stroke:#000000;stroke-width:7.50000477;stroke-linecap:butt;stroke-linejoin:round;stroke-miterlimit:10;stroke-dasharray:none;stroke-opacity:1"
           id="path254"
           inkscape:connector-curvature="0" /></g><path
         d="m 252.172,580.447 c -1.961,0 -3.551,1.592 -3.551,3.557 0,1.964 1.59,3.557 3.551,3.557 1.961,0 3.551,-1.593 3.551,-3.557 0,-1.965 -1.59,-3.557 -3.551,-3.557"
         style="fill:#fefefe;fill-opacity:1;fill-rule:evenodd;stroke:none;stroke-width:0.1"
         id="path256"
         inkscape:connector-curvature="0" /><g
         id="g258"
         transform="scale(0.0999118,0.100088)"><path
           d="m 2523.95,5799.35 c -19.63,0 -35.54,15.91 -35.54,35.54 0,19.63 15.91,35.54 35.54,35.54 19.63,0 35.53,-15.91 35.53,-35.54 0,-19.63 -15.9,-35.54 -35.53,-35.54 z"
           style="fill:none;stroke:#000000;stroke-width:7.50000477;stroke-linecap:butt;stroke-linejoin:round;stroke-miterlimit:10;stroke-dasharray:none;stroke-opacity:1"
           id="path260"
           inkscape:connector-curvature="0" /></g><g
         id="g262"
         transform="scale(0.0999118,0.100088)"><path
           d="m 2555.42,5817.7 60.97,-81.53"
           style="fill:none;stroke:#000000;stroke-width:7.50000477;stroke-linecap:butt;stroke-linejoin:round;stroke-miterlimit:10;stroke-dasharray:none;stroke-opacity:1"
           id="path264"
           inkscape:connector-curvature="0" /></g><g
         id="g266"
         transform="scale(0.0999118,0.100088)"><path
           d="m 2431.39,5737.69 60.97,81.52"
           style="fill:none;stroke:#000000;stroke-width:7.50000477;stroke-linecap:butt;stroke-linejoin:round;stroke-miterlimit:10;stroke-dasharray:none;stroke-opacity:1"
           id="path268"
           inkscape:connector-curvature="0" /></g><g
         id="g270"
         transform="scale(0.0999118,0.100088)"><path
           d="m 2615.23,6505.45 296.03,-103.13"
           style="fill:none;stroke:#000000;stroke-width:7.50000477;stroke-linecap:butt;stroke-linejoin:round;stroke-miterlimit:10;stroke-dasharray:none;stroke-opacity:1"
           id="path272"
           inkscape:connector-curvature="0" /></g><path
         d="m 206.978,566.452 c -1.961,0 -3.551,1.593 -3.551,3.557 0,1.964 1.59,3.557 3.551,3.557 1.949,0 3.539,-1.593 3.539,-3.557 0,-1.964 -1.59,-3.557 -3.539,-3.557"
         style="fill:#4b4b4b;fill-opacity:1;fill-rule:evenodd;stroke:none;stroke-width:0.1"
         id="path274"
         inkscape:connector-curvature="0" /><g
         id="g276"
         transform="scale(0.0999118,0.100088)"><path
           d="m 2071.61,5659.53 c -19.63,0 -35.54,15.91 -35.54,35.53 0,19.63 15.91,35.54 35.54,35.54 19.51,0 35.42,-15.91 35.42,-35.54 0,-19.62 -15.91,-35.53 -35.42,-35.53 z"
           style="fill:none;stroke:#000000;stroke-width:7.50000477;stroke-linecap:butt;stroke-linejoin:round;stroke-miterlimit:10;stroke-dasharray:none;stroke-opacity:1"
           id="path278"
           inkscape:connector-curvature="0" /></g><path
         d="m 226.17,566.603 c -1.961,0 -3.551,1.592 -3.551,3.557 0,1.964 1.59,3.557 3.551,3.557 1.96,0 3.55,-1.593 3.55,-3.557 0,-1.965 -1.59,-3.557 -3.55,-3.557"
         style="fill:#333333;fill-opacity:1;fill-rule:evenodd;stroke:none;stroke-width:0.1"
         id="path280"
         inkscape:connector-curvature="0" /><g
         id="g282"
         transform="scale(0.0999118,0.100088)"><path
           d="m 2263.69,5661.04 c -19.62,0 -35.53,15.91 -35.53,35.53 0,19.63 15.91,35.54 35.53,35.54 19.63,0 35.54,-15.91 35.54,-35.54 0,-19.62 -15.91,-35.53 -35.54,-35.53 z"
           style="fill:none;stroke:#000000;stroke-width:7.50000477;stroke-linecap:butt;stroke-linejoin:round;stroke-miterlimit:10;stroke-dasharray:none;stroke-opacity:1"
           id="path284"
           inkscape:connector-curvature="0" /></g><path
         d="m 242.391,567.173 c -1.961,0 -3.551,1.592 -3.551,3.545 0,1.964 1.59,3.557 3.551,3.557 1.961,0 3.55,-1.593 3.55,-3.557 0,-1.953 -1.589,-3.545 -3.55,-3.545"
         style="fill:#4b4b4b;fill-opacity:1;fill-rule:evenodd;stroke:none;stroke-width:0.1"
         id="path286"
         inkscape:connector-curvature="0" /><g
         id="g288"
         transform="scale(0.0999118,0.100088)"><path
           d="m 2426.05,5666.73 c -19.63,0 -35.54,15.91 -35.54,35.42 0,19.62 15.91,35.54 35.54,35.54 19.62,0 35.54,-15.92 35.54,-35.54 0,-19.51 -15.92,-35.42 -35.54,-35.42 z"
           style="fill:none;stroke:#000000;stroke-width:7.50000477;stroke-linecap:butt;stroke-linejoin:round;stroke-miterlimit:10;stroke-dasharray:none;stroke-opacity:1"
           id="path290"
           inkscape:connector-curvature="0" /></g><path
         d="m 261.826,567.021 c -1.961,0 -3.551,1.593 -3.551,3.546 0,1.964 1.59,3.556 3.551,3.556 1.949,0 3.539,-1.592 3.539,-3.556 0,-1.953 -1.59,-3.546 -3.539,-3.546"
         style="fill:#333333;fill-opacity:1;fill-rule:evenodd;stroke:none;stroke-width:0.1"
         id="path292"
         inkscape:connector-curvature="0" /><g
         id="g294"
         transform="scale(0.0999118,0.100088)"><path
           d="m 2620.57,5665.22 c -19.62,0 -35.54,15.91 -35.54,35.42 0,19.63 15.92,35.53 35.54,35.53 19.51,0 35.42,-15.9 35.42,-35.53 0,-19.51 -15.91,-35.42 -35.42,-35.42 z"
           style="fill:none;stroke:#000000;stroke-width:7.50000477;stroke-linecap:butt;stroke-linejoin:round;stroke-miterlimit:10;stroke-dasharray:none;stroke-opacity:1"
           id="path296"
           inkscape:connector-curvature="0" /></g><path
         d="m 271.19,580.296 c -1.961,0 -3.551,1.592 -3.551,3.556 0,1.965 1.59,3.557 3.551,3.557 1.949,0 3.539,-1.592 3.539,-3.557 0,-1.964 -1.59,-3.556 -3.539,-3.556"
         style="fill:#989898;fill-opacity:1;fill-rule:evenodd;stroke:none;stroke-width:0.1"
         id="path298"
         inkscape:connector-curvature="0" /><g
         id="g300"
         transform="scale(0.0999118,0.100088)"><path
           d="m 2714.29,5797.84 c -19.62,0 -35.54,15.91 -35.54,35.54 0,19.63 15.92,35.54 35.54,35.54 19.51,0 35.42,-15.91 35.42,-35.54 0,-19.63 -15.91,-35.54 -35.42,-35.54 z"
           style="fill:none;stroke:#000000;stroke-width:7.50000477;stroke-linecap:butt;stroke-linejoin:round;stroke-miterlimit:10;stroke-dasharray:none;stroke-opacity:1"
           id="path302"
           inkscape:connector-curvature="0" /></g><path
         d="m 232.343,606.042 c -1.961,0 -3.551,1.592 -3.551,3.545 0,1.965 1.59,3.557 3.551,3.557 1.949,0 3.538,-1.592 3.538,-3.557 0,-1.953 -1.589,-3.545 -3.538,-3.545"
         style="fill:#cbcbcb;fill-opacity:1;fill-rule:evenodd;stroke:none;stroke-width:0.1"
         id="path304"
         inkscape:connector-curvature="0" /><g
         id="g306"
         transform="scale(0.0999118,0.100088)"><path
           d="m 2325.48,6055.08 c -19.63,0 -35.54,15.91 -35.54,35.42 0,19.63 15.91,35.54 35.54,35.54 19.51,0 35.41,-15.91 35.41,-35.54 0,-19.51 -15.9,-35.42 -35.41,-35.42 z"
           style="fill:none;stroke:#000000;stroke-width:7.50000477;stroke-linecap:butt;stroke-linejoin:round;stroke-miterlimit:10;stroke-dasharray:none;stroke-opacity:1"
           id="path308"
           inkscape:connector-curvature="0" /></g><path
         d="m 277.351,619.467 c -1.961,0 -3.551,1.593 -3.551,3.557 0,1.965 1.59,3.557 3.551,3.557 1.961,0 3.551,-1.592 3.551,-3.557 0,-1.964 -1.59,-3.557 -3.551,-3.557"
         style="fill:#e5e5e5;fill-opacity:1;fill-rule:evenodd;stroke:none;stroke-width:0.1"
         id="path310"
         inkscape:connector-curvature="0" /><g
         id="g312"
         transform="scale(0.0999118,0.100088)"><path
           d="m 2775.96,6189.21 c -19.63,0 -35.54,15.91 -35.54,35.54 0,19.63 15.91,35.54 35.54,35.54 19.63,0 35.54,-15.91 35.54,-35.54 0,-19.63 -15.91,-35.54 -35.54,-35.54 z"
           style="fill:none;stroke:#000000;stroke-width:7.50000477;stroke-linecap:butt;stroke-linejoin:round;stroke-miterlimit:10;stroke-dasharray:none;stroke-opacity:1"
           id="path314"
           inkscape:connector-curvature="0" /></g><path
         d="m 286.262,593.326 c -1.961,0 -3.55,1.592 -3.55,3.545 0,1.964 1.589,3.557 3.55,3.557 1.961,0 3.551,-1.593 3.551,-3.557 0,-1.953 -1.59,-3.545 -3.551,-3.545"
         style="fill:#b2b2b2;fill-opacity:1;fill-rule:evenodd;stroke:none;stroke-width:0.1"
         id="path316"
         inkscape:connector-curvature="0" /><g
         id="g318"
         transform="scale(0.0999118,0.100088)"><path
           d="m 2865.15,5928.03 c -19.63,0 -35.54,15.91 -35.54,35.42 0,19.62 15.91,35.54 35.54,35.54 19.62,0 35.54,-15.92 35.54,-35.54 0,-19.51 -15.92,-35.42 -35.54,-35.42 z"
           style="fill:none;stroke:#000000;stroke-width:7.50000477;stroke-linecap:butt;stroke-linejoin:round;stroke-miterlimit:10;stroke-dasharray:none;stroke-opacity:1"
           id="path320"
           inkscape:connector-curvature="0" /></g><path
         d="m 286.529,566.603 c -1.961,0 -3.55,1.592 -3.55,3.557 0,1.964 1.589,3.557 3.55,3.557 1.95,0 3.539,-1.593 3.539,-3.557 0,-1.965 -1.589,-3.557 -3.539,-3.557"
         style="fill:#333333;fill-opacity:1;fill-rule:evenodd;stroke:none;stroke-width:0.1"
         id="path322"
         inkscape:connector-curvature="0" /><g
         id="g324"
         transform="scale(0.0999118,0.100088)"><path
           d="m 2867.82,5661.04 c -19.62,0 -35.54,15.91 -35.54,35.53 0,19.63 15.92,35.54 35.54,35.54 19.51,0 35.42,-15.91 35.42,-35.54 0,-19.62 -15.91,-35.53 -35.42,-35.53 z"
           style="fill:none;stroke:#000000;stroke-width:7.50000477;stroke-linecap:butt;stroke-linejoin:round;stroke-miterlimit:10;stroke-dasharray:none;stroke-opacity:1"
           id="path326"
           inkscape:connector-curvature="0" /></g><path
         d="m 305.048,566.452 c -1.961,0 -3.551,1.593 -3.551,3.557 0,1.964 1.59,3.557 3.551,3.557 1.949,0 3.539,-1.593 3.539,-3.557 0,-1.964 -1.59,-3.557 -3.539,-3.557"
         style="fill:#4b4b4b;fill-opacity:1;fill-rule:evenodd;stroke:none;stroke-width:0.1"
         id="path328"
         inkscape:connector-curvature="0" /><g
         id="g330"
         transform="scale(0.0999118,0.100088)"><path
           d="m 3053.17,5659.53 c -19.63,0 -35.54,15.91 -35.54,35.53 0,19.63 15.91,35.54 35.54,35.54 19.51,0 35.42,-15.91 35.42,-35.54 0,-19.62 -15.91,-35.53 -35.42,-35.53 z"
           style="fill:none;stroke:#000000;stroke-width:7.50000477;stroke-linecap:butt;stroke-linejoin:round;stroke-miterlimit:10;stroke-dasharray:none;stroke-opacity:1"
           id="path332"
           inkscape:connector-curvature="0" /></g><path
         d="m 406.981,558.49 c 1.961,0 3.551,-1.593 3.551,-3.557 0,-1.965 -1.59,-3.557 -3.539,-3.557 -1.961,0 -3.55,1.592 -3.55,3.557 0,1.964 1.589,3.557 3.538,3.557"
         style="fill:#fefefe;fill-opacity:1;fill-rule:evenodd;stroke:none;stroke-width:0.1"
         id="path334"
         inkscape:connector-curvature="0" /><g
         id="g336"
         transform="scale(0.0999118,0.100088)"><path
           d="m 4073.41,5579.98 c 19.62,0 35.53,-15.92 35.53,-35.54 0,-19.63 -15.91,-35.54 -35.42,-35.54 -19.62,0 -35.53,15.91 -35.53,35.54 0,19.62 15.91,35.54 35.42,35.54 z"
           style="fill:none;stroke:#000000;stroke-width:7.50000477;stroke-linecap:butt;stroke-linejoin:round;stroke-miterlimit:10;stroke-dasharray:none;stroke-opacity:1"
           id="path338"
           inkscape:connector-curvature="0" /></g><g
         id="g340"
         transform="scale(0.0999118,0.100088)"><path
           d="m 4037.87,5547.81 -296.03,103.12"
           style="fill:none;stroke:#000000;stroke-width:7.50000477;stroke-linecap:butt;stroke-linejoin:round;stroke-miterlimit:10;stroke-dasharray:none;stroke-opacity:1"
           id="path342"
           inkscape:connector-curvature="0" /></g><path
         d="m 373.553,572.705 c 1.961,0 3.55,-1.592 3.55,-3.557 0,-1.964 -1.589,-3.556 -3.539,-3.556 -1.96,0 -3.55,1.592 -3.55,3.556 0,1.965 1.59,3.557 3.539,3.557"
         style="fill:#fefefe;fill-opacity:1;fill-rule:evenodd;stroke:none;stroke-width:0.1"
         id="path344"
         inkscape:connector-curvature="0" /><g
         id="g346"
         transform="scale(0.0999118,0.100088)"><path
           d="m 3738.83,5722.01 c 19.62,0 35.53,-15.91 35.53,-35.54 0,-19.62 -15.91,-35.54 -35.42,-35.54 -19.62,0 -35.54,15.92 -35.54,35.54 0,19.63 15.92,35.54 35.43,35.54 z"
           style="fill:none;stroke:#000000;stroke-width:7.50000477;stroke-linecap:butt;stroke-linejoin:round;stroke-miterlimit:10;stroke-dasharray:none;stroke-opacity:1"
           id="path348"
           inkscape:connector-curvature="0" /></g><g
         id="g350"
         transform="scale(0.0999118,0.100088)"><path
           d="m 3707.35,5703.66 -143.66,89.3"
           style="fill:none;stroke:#000000;stroke-width:7.50000477;stroke-linecap:butt;stroke-linejoin:round;stroke-miterlimit:10;stroke-dasharray:none;stroke-opacity:1"
           id="path352"
           inkscape:connector-curvature="0" /></g><path
         d="m 391.248,586.921 c 1.961,0 3.55,-1.592 3.55,-3.557 0,-1.964 -1.589,-3.557 -3.55,-3.557 -1.961,0 -3.551,1.593 -3.551,3.557 0,1.965 1.59,3.557 3.551,3.557"
         style="fill:#fefefe;fill-opacity:1;fill-rule:evenodd;stroke:none;stroke-width:0.1"
         id="path354"
         inkscape:connector-curvature="0" /><g
         id="g356"
         transform="scale(0.0999118,0.100088)"><path
           d="m 3915.93,5864.04 c 19.63,0 35.54,-15.91 35.54,-35.54 0,-19.62 -15.91,-35.54 -35.54,-35.54 -19.63,0 -35.54,15.92 -35.54,35.54 0,19.63 15.91,35.54 35.54,35.54 z"
           style="fill:none;stroke:#000000;stroke-width:7.50000477;stroke-linecap:butt;stroke-linejoin:round;stroke-miterlimit:10;stroke-dasharray:none;stroke-opacity:1"
           id="path358"
           inkscape:connector-curvature="0" /></g><g
         id="g360"
         transform="scale(0.0999118,0.100088)"><path
           d="m 3884.46,5845.69 -60.97,81.53"
           style="fill:none;stroke:#000000;stroke-width:7.50000477;stroke-linecap:butt;stroke-linejoin:round;stroke-miterlimit:10;stroke-dasharray:none;stroke-opacity:1"
           id="path362"
           inkscape:connector-curvature="0" /></g><g
         id="g364"
         transform="scale(0.0999118,0.100088)"><path
           d="m 4008.37,5925.71 -60.97,-81.53"
           style="fill:none;stroke:#000000;stroke-width:7.50000477;stroke-linecap:butt;stroke-linejoin:round;stroke-miterlimit:10;stroke-dasharray:none;stroke-opacity:1"
           id="path366"
           inkscape:connector-curvature="0" /></g><g
         id="g368"
         transform="scale(0.0999118,0.100088)"><path
           d="m 3907.68,5792.96 -138.54,-88.49"
           style="fill:none;stroke:#000000;stroke-width:7.50000477;stroke-linecap:butt;stroke-linejoin:round;stroke-miterlimit:10;stroke-dasharray:none;stroke-opacity:1"
           id="path370"
           inkscape:connector-curvature="0" /></g><path
         d="m 440.596,572.705 c 1.961,0 3.55,-1.592 3.55,-3.557 0,-1.964 -1.589,-3.556 -3.539,-3.556 -1.961,0 -3.55,1.592 -3.55,3.556 0,1.965 1.589,3.557 3.539,3.557"
         style="fill:#fefefe;fill-opacity:1;fill-rule:evenodd;stroke:none;stroke-width:0.1"
         id="path372"
         inkscape:connector-curvature="0" /><g
         id="g374"
         transform="scale(0.0999118,0.100088)"><path
           d="m 4409.85,5722.01 c 19.62,0 35.54,-15.91 35.54,-35.54 0,-19.62 -15.92,-35.54 -35.43,-35.54 -19.62,0 -35.54,15.92 -35.54,35.54 0,19.63 15.92,35.54 35.43,35.54 z"
           style="fill:none;stroke:#000000;stroke-width:7.50000477;stroke-linecap:butt;stroke-linejoin:round;stroke-miterlimit:10;stroke-dasharray:none;stroke-opacity:1"
           id="path376"
           inkscape:connector-curvature="0" /></g><g
         id="g378"
         transform="scale(0.0999118,0.100088)"><path
           d="m 4378.49,5703.66 -106.5,89.3"
           style="fill:none;stroke:#000000;stroke-width:7.50000477;stroke-linecap:butt;stroke-linejoin:round;stroke-miterlimit:10;stroke-dasharray:none;stroke-opacity:1"
           id="path380"
           inkscape:connector-curvature="0" /></g><g
         id="g382"
         transform="scale(0.0999118,0.100088)"><path
           d="m 4546.77,5793.78 -106.49,-89.31"
           style="fill:none;stroke:#000000;stroke-width:7.50000477;stroke-linecap:butt;stroke-linejoin:round;stroke-miterlimit:10;stroke-dasharray:none;stroke-opacity:1"
           id="path384"
           inkscape:connector-curvature="0" /></g><path
         d="m 356.044,586.921 c 1.961,0 3.55,-1.592 3.55,-3.557 0,-1.964 -1.589,-3.557 -3.539,-3.557 -1.961,0 -3.55,1.593 -3.55,3.557 0,1.965 1.589,3.557 3.539,3.557"
         style="fill:#fefefe;fill-opacity:1;fill-rule:evenodd;stroke:none;stroke-width:0.1"
         id="path386"
         inkscape:connector-curvature="0" /><g
         id="g388"
         transform="scale(0.0999118,0.100088)"><path
           d="m 3563.58,5864.04 c 19.63,0 35.54,-15.91 35.54,-35.54 0,-19.62 -15.91,-35.54 -35.43,-35.54 -19.62,0 -35.53,15.92 -35.53,35.54 0,19.63 15.91,35.54 35.42,35.54 z"
           style="fill:none;stroke:#000000;stroke-width:7.50000477;stroke-linecap:butt;stroke-linejoin:round;stroke-miterlimit:10;stroke-dasharray:none;stroke-opacity:1"
           id="path390"
           inkscape:connector-curvature="0" /></g><g
         id="g392"
         transform="scale(0.0999118,0.100088)"><path
           d="m 3532.11,5845.69 -60.97,81.53"
           style="fill:none;stroke:#000000;stroke-width:7.50000477;stroke-linecap:butt;stroke-linejoin:round;stroke-miterlimit:10;stroke-dasharray:none;stroke-opacity:1"
           id="path394"
           inkscape:connector-curvature="0" /></g><g
         id="g396"
         transform="scale(0.0999118,0.100088)"><path
           d="m 3656.14,5925.71 -60.97,-81.53"
           style="fill:none;stroke:#000000;stroke-width:7.50000477;stroke-linecap:butt;stroke-linejoin:round;stroke-miterlimit:10;stroke-dasharray:none;stroke-opacity:1"
           id="path398"
           inkscape:connector-curvature="0" /></g><path
         d="m 365.546,599.789 c 1.961,0 3.551,-1.593 3.551,-3.557 0,-1.953 -1.59,-3.546 -3.551,-3.546 -1.96,0 -3.55,1.593 -3.55,3.546 0,1.964 1.59,3.557 3.55,3.557"
         style="fill:#656565;fill-opacity:1;fill-rule:evenodd;stroke:none;stroke-width:0.1"
         id="path400"
         inkscape:connector-curvature="0" /><g
         id="g402"
         transform="scale(0.0999118,0.100088)"><path
           d="m 3658.69,5992.6 c 19.63,0 35.54,-15.91 35.54,-35.54 0,-19.51 -15.91,-35.42 -35.54,-35.42 -19.62,0 -35.53,15.91 -35.53,35.42 0,19.63 15.91,35.54 35.53,35.54 z"
           style="fill:none;stroke:#000000;stroke-width:7.50000477;stroke-linecap:butt;stroke-linejoin:round;stroke-miterlimit:10;stroke-dasharray:none;stroke-opacity:1"
           id="path404"
           inkscape:connector-curvature="0" /></g><g
         id="g406"
         transform="scale(0.0999118,0.100088)"><path
           d="m 3453.02,5974.25 -60.97,81.53"
           style="fill:none;stroke:#000000;stroke-width:7.50000477;stroke-linecap:butt;stroke-linejoin:round;stroke-miterlimit:10;stroke-dasharray:none;stroke-opacity:1"
           id="path408"
           inkscape:connector-curvature="0" /></g><g
         id="g410"
         transform="scale(0.0999118,0.100088)"><path
           d="m 3565.32,6054.27 -60.97,-81.53"
           style="fill:none;stroke:#000000;stroke-width:7.50000477;stroke-linecap:butt;stroke-linejoin:round;stroke-miterlimit:10;stroke-dasharray:none;stroke-opacity:1"
           id="path412"
           inkscape:connector-curvature="0" /></g><path
         d="m 347.109,599.789 c 1.961,0 3.551,-1.593 3.551,-3.557 0,-1.953 -1.59,-3.546 -3.551,-3.546 -1.961,0 -3.55,1.593 -3.55,3.546 0,1.964 1.589,3.557 3.55,3.557"
         style="fill:#fefefe;fill-opacity:1;fill-rule:evenodd;stroke:none;stroke-width:0.1"
         id="path414"
         inkscape:connector-curvature="0" /><g
         id="g416"
         transform="scale(0.0999118,0.100088)"><path
           d="m 3474.16,5992.6 c 19.62,0 35.53,-15.91 35.53,-35.54 0,-19.51 -15.91,-35.42 -35.53,-35.42 -19.63,0 -35.54,15.91 -35.54,35.42 0,19.63 15.91,35.54 35.54,35.54 z"
           style="fill:none;stroke:#000000;stroke-width:7.50000477;stroke-linecap:butt;stroke-linejoin:round;stroke-miterlimit:10;stroke-dasharray:none;stroke-opacity:1"
           id="path418"
           inkscape:connector-curvature="0" /></g><path
         d="m 338.639,613.225 c 1.961,0 3.55,-1.592 3.55,-3.556 0,-1.965 -1.589,-3.557 -3.539,-3.557 -1.961,0 -3.55,1.592 -3.55,3.557 0,1.964 1.589,3.556 3.539,3.556"
         style="fill:#fefefe;fill-opacity:1;fill-rule:evenodd;stroke:none;stroke-width:0.1"
         id="path420"
         inkscape:connector-curvature="0" /><g
         id="g422"
         transform="scale(0.0999118,0.100088)"><path
           d="m 3389.38,6126.85 c 19.63,0 35.54,-15.91 35.54,-35.54 0,-19.62 -15.91,-35.53 -35.43,-35.53 -19.62,0 -35.53,15.91 -35.53,35.53 0,19.63 15.91,35.54 35.42,35.54 z"
           style="fill:none;stroke:#000000;stroke-width:7.50000477;stroke-linecap:butt;stroke-linejoin:round;stroke-miterlimit:10;stroke-dasharray:none;stroke-opacity:1"
           id="path424"
           inkscape:connector-curvature="0" /></g><g
         id="g426"
         transform="scale(0.0999118,0.100088)"><path
           d="m 3357.91,6108.5 -60.97,81.53"
           style="fill:none;stroke:#000000;stroke-width:7.50000477;stroke-linecap:butt;stroke-linejoin:round;stroke-miterlimit:10;stroke-dasharray:none;stroke-opacity:1"
           id="path428"
           inkscape:connector-curvature="0" /></g><g
         id="g430"
         transform="scale(0.0999118,0.100088)"><path
           d="m 3481.94,6188.52 -60.97,-81.53"
           style="fill:none;stroke:#000000;stroke-width:7.50000477;stroke-linecap:butt;stroke-linejoin:round;stroke-miterlimit:10;stroke-dasharray:none;stroke-opacity:1"
           id="path432"
           inkscape:connector-curvature="0" /></g><path
         d="m 329.148,626.651 c 1.961,0 3.55,-1.593 3.55,-3.557 0,-1.953 -1.589,-3.545 -3.55,-3.545 -1.961,0 -3.551,1.592 -3.551,3.545 0,1.964 1.59,3.557 3.551,3.557"
         style="fill:#fefefe;fill-opacity:1;fill-rule:evenodd;stroke:none;stroke-width:0.1"
         id="path434"
         inkscape:connector-curvature="0" /><g
         id="g436"
         transform="scale(0.0999118,0.100088)"><path
           d="m 3294.38,6260.99 c 19.63,0 35.54,-15.92 35.54,-35.54 0,-19.51 -15.91,-35.42 -35.54,-35.42 -19.62,0 -35.54,15.91 -35.54,35.42 0,19.62 15.92,35.54 35.54,35.54 z"
           style="fill:none;stroke:#000000;stroke-width:7.50000477;stroke-linecap:butt;stroke-linejoin:round;stroke-miterlimit:10;stroke-dasharray:none;stroke-opacity:1"
           id="path438"
           inkscape:connector-curvature="0" /></g><path
         d="m 356.473,612.668 c 1.961,0 3.55,-1.593 3.55,-3.557 0,-1.965 -1.589,-3.557 -3.539,-3.557 -1.961,0 -3.55,1.592 -3.55,3.557 0,1.964 1.589,3.557 3.539,3.557"
         style="fill:#656565;fill-opacity:1;fill-rule:evenodd;stroke:none;stroke-width:0.1"
         id="path440"
         inkscape:connector-curvature="0" /><g
         id="g442"
         transform="scale(0.0999118,0.100088)"><path
           d="m 3567.88,6121.28 c 19.62,0 35.53,-15.92 35.53,-35.54 0,-19.63 -15.91,-35.54 -35.42,-35.54 -19.63,0 -35.53,15.91 -35.53,35.54 0,19.62 15.9,35.54 35.42,35.54 z"
           style="fill:none;stroke:#000000;stroke-width:7.50000477;stroke-linecap:butt;stroke-linejoin:round;stroke-miterlimit:10;stroke-dasharray:none;stroke-opacity:1"
           id="path444"
           inkscape:connector-curvature="0" /></g><path
         d="m 348.246,626.5 c 1.961,0 3.551,-1.593 3.551,-3.557 0,-1.953 -1.59,-3.545 -3.539,-3.545 -1.961,0 -3.551,1.592 -3.551,3.545 0,1.964 1.59,3.557 3.539,3.557"
         style="fill:#b2b2b2;fill-opacity:1;fill-rule:evenodd;stroke:none;stroke-width:0.1"
         id="path446"
         inkscape:connector-curvature="0" /><g
         id="g448"
         transform="scale(0.0999118,0.100088)"><path
           d="m 3485.54,6259.48 c 19.62,0 35.53,-15.92 35.53,-35.54 0,-19.51 -15.91,-35.42 -35.42,-35.42 -19.62,0 -35.53,15.91 -35.53,35.42 0,19.62 15.91,35.54 35.42,35.54 z"
           style="fill:none;stroke:#000000;stroke-width:7.50000477;stroke-linecap:butt;stroke-linejoin:round;stroke-miterlimit:10;stroke-dasharray:none;stroke-opacity:1"
           id="path450"
           inkscape:connector-curvature="0" /></g><g
         id="g452"
         transform="scale(0.0999118,0.100088)"><path
           d="m 3261.05,6244.26 -60.97,81.53"
           style="fill:none;stroke:#000000;stroke-width:7.50000477;stroke-linecap:butt;stroke-linejoin:round;stroke-miterlimit:10;stroke-dasharray:none;stroke-opacity:1"
           id="path454"
           inkscape:connector-curvature="0" /></g><g
         id="g456"
         transform="scale(0.0999118,0.100088)"><path
           d="m 3384.97,6324.28 -60.98,-81.53"
           style="fill:none;stroke:#000000;stroke-width:7.50000477;stroke-linecap:butt;stroke-linejoin:round;stroke-miterlimit:10;stroke-dasharray:none;stroke-opacity:1"
           id="path458"
           inkscape:connector-curvature="0" /></g><path
         d="m 400.855,600.195 c 1.961,0 3.55,-1.592 3.55,-3.557 0,-1.952 -1.589,-3.545 -3.55,-3.545 -1.961,0 -3.551,1.593 -3.551,3.545 0,1.965 1.59,3.557 3.551,3.557"
         style="fill:#fefefe;fill-opacity:1;fill-rule:evenodd;stroke:none;stroke-width:0.1"
         id="path460"
         inkscape:connector-curvature="0" /><g
         id="g462"
         transform="scale(0.0999118,0.100088)"><path
           d="m 4012.09,5996.66 c 19.63,0 35.53,-15.91 35.53,-35.54 0,-19.51 -15.9,-35.41 -35.53,-35.41 -19.63,0 -35.54,15.9 -35.54,35.41 0,19.63 15.91,35.54 35.54,35.54 z"
           style="fill:none;stroke:#000000;stroke-width:7.50000477;stroke-linecap:butt;stroke-linejoin:round;stroke-miterlimit:10;stroke-dasharray:none;stroke-opacity:1"
           id="path464"
           inkscape:connector-curvature="0" /></g><g
         id="g466"
         transform="scale(0.0999118,0.100088)"><path
           d="m 3980.62,5978.31 -60.98,81.53"
           style="fill:none;stroke:#000000;stroke-width:7.50000477;stroke-linecap:butt;stroke-linejoin:round;stroke-miterlimit:10;stroke-dasharray:none;stroke-opacity:1"
           id="path468"
           inkscape:connector-curvature="0" /></g><g
         id="g470"
         transform="scale(0.0999118,0.100088)"><path
           d="m 4104.65,6058.33 -60.97,-81.52"
           style="fill:none;stroke:#000000;stroke-width:7.50000477;stroke-linecap:butt;stroke-linejoin:round;stroke-miterlimit:10;stroke-dasharray:none;stroke-opacity:1"
           id="path472"
           inkscape:connector-curvature="0" /></g><path
         d="m 411.019,612.656 c 1.961,0 3.551,-1.593 3.551,-3.557 0,-1.953 -1.59,-3.545 -3.539,-3.545 -1.961,0 -3.551,1.592 -3.551,3.545 0,1.964 1.59,3.557 3.539,3.557"
         style="fill:#fefefe;fill-opacity:1;fill-rule:evenodd;stroke:none;stroke-width:0.1"
         id="path474"
         inkscape:connector-curvature="0" /><g
         id="g476"
         transform="scale(0.0999118,0.100088)"><path
           d="m 4113.82,6121.16 c 19.63,0 35.54,-15.91 35.54,-35.54 0,-19.51 -15.91,-35.42 -35.42,-35.42 -19.63,0 -35.54,15.91 -35.54,35.42 0,19.63 15.91,35.54 35.42,35.54 z"
           style="fill:none;stroke:#000000;stroke-width:7.50000477;stroke-linecap:butt;stroke-linejoin:round;stroke-miterlimit:10;stroke-dasharray:none;stroke-opacity:1"
           id="path478"
           inkscape:connector-curvature="0" /></g><g
         id="g480"
         transform="scale(0.0999118,0.100088)"><path
           d="m 4145.29,6102.81 60.97,81.52"
           style="fill:none;stroke:#000000;stroke-width:7.50000477;stroke-linecap:butt;stroke-linejoin:round;stroke-miterlimit:10;stroke-dasharray:none;stroke-opacity:1"
           id="path482"
           inkscape:connector-curvature="0" /></g><g
         id="g484"
         transform="scale(0.0999118,0.100088)"><path
           d="m 4021.38,6182.83 60.97,-81.53"
           style="fill:none;stroke:#000000;stroke-width:7.50000477;stroke-linecap:butt;stroke-linejoin:round;stroke-miterlimit:10;stroke-dasharray:none;stroke-opacity:1"
           id="path486"
           inkscape:connector-curvature="0" /></g><path
         d="m 454.601,586.909 c 1.961,0 3.55,-1.592 3.55,-3.556 0,-1.953 -1.589,-3.546 -3.55,-3.546 -1.961,0 -3.551,1.593 -3.551,3.546 0,1.964 1.59,3.556 3.551,3.556"
         style="fill:#fefefe;fill-opacity:1;fill-rule:evenodd;stroke:none;stroke-width:0.1"
         id="path488"
         inkscape:connector-curvature="0" /><g
         id="g490"
         transform="scale(0.0999118,0.100088)"><path
           d="m 4550.02,5863.92 c 19.63,0 35.54,-15.91 35.54,-35.53 0,-19.51 -15.91,-35.43 -35.54,-35.43 -19.63,0 -35.54,15.92 -35.54,35.43 0,19.62 15.91,35.53 35.54,35.53 z"
           style="fill:none;stroke:#000000;stroke-width:7.50000477;stroke-linecap:butt;stroke-linejoin:round;stroke-miterlimit:10;stroke-dasharray:none;stroke-opacity:1"
           id="path492"
           inkscape:connector-curvature="0" /></g><g
         id="g494"
         transform="scale(0.0999118,0.100088)"><path
           d="m 4581.49,5845.57 60.97,81.53"
           style="fill:none;stroke:#000000;stroke-width:7.50000477;stroke-linecap:butt;stroke-linejoin:round;stroke-miterlimit:10;stroke-dasharray:none;stroke-opacity:1"
           id="path496"
           inkscape:connector-curvature="0" /></g><g
         id="g498"
         transform="scale(0.0999118,0.100088)"><path
           d="m 4457.46,5925.59 60.97,-81.53"
           style="fill:none;stroke:#000000;stroke-width:7.50000477;stroke-linecap:butt;stroke-linejoin:round;stroke-miterlimit:10;stroke-dasharray:none;stroke-opacity:1"
           id="path500"
           inkscape:connector-curvature="0" /></g><path
         d="m 445.098,599.789 c 1.961,0 3.55,-1.593 3.55,-3.557 0,-1.965 -1.589,-3.557 -3.539,-3.557 -1.961,0 -3.55,1.592 -3.55,3.557 0,1.964 1.589,3.557 3.539,3.557"
         style="fill:#fefefe;fill-opacity:1;fill-rule:evenodd;stroke:none;stroke-width:0.1"
         id="path502"
         inkscape:connector-curvature="0" /><g
         id="g504"
         transform="scale(0.0999118,0.100088)"><path
           d="m 4454.91,5992.6 c 19.62,0 35.54,-15.91 35.54,-35.54 0,-19.63 -15.92,-35.53 -35.43,-35.53 -19.62,0 -35.53,15.9 -35.53,35.53 0,19.63 15.91,35.54 35.42,35.54 z"
           style="fill:none;stroke:#000000;stroke-width:7.50000477;stroke-linecap:butt;stroke-linejoin:round;stroke-miterlimit:10;stroke-dasharray:none;stroke-opacity:1"
           id="path506"
           inkscape:connector-curvature="0" /></g><g
         id="g508"
         transform="scale(0.0999118,0.100088)"><path
           d="m 4486.38,5974.25 60.97,81.53"
           style="fill:none;stroke:#000000;stroke-width:7.50000477;stroke-linecap:butt;stroke-linejoin:round;stroke-miterlimit:10;stroke-dasharray:none;stroke-opacity:1"
           id="path510"
           inkscape:connector-curvature="0" /></g><g
         id="g512"
         transform="scale(0.0999118,0.100088)"><path
           d="m 4362.47,6054.27 60.96,-81.53"
           style="fill:none;stroke:#000000;stroke-width:7.50000477;stroke-linecap:butt;stroke-linejoin:round;stroke-miterlimit:10;stroke-dasharray:none;stroke-opacity:1"
           id="path514"
           inkscape:connector-curvature="0" /></g><path
         d="m 463.535,599.789 c 1.961,0 3.551,-1.593 3.551,-3.557 0,-1.965 -1.59,-3.557 -3.539,-3.557 -1.961,0 -3.551,1.592 -3.551,3.557 0,1.964 1.59,3.557 3.539,3.557"
         style="fill:#4b4b4b;fill-opacity:1;fill-rule:evenodd;stroke:none;stroke-width:0.1"
         id="path516"
         inkscape:connector-curvature="0" /><g
         id="g518"
         transform="scale(0.0999118,0.100088)"><path
           d="m 4639.44,5992.6 c 19.63,0 35.54,-15.91 35.54,-35.54 0,-19.63 -15.91,-35.53 -35.42,-35.53 -19.63,0 -35.54,15.9 -35.54,35.53 0,19.63 15.91,35.54 35.42,35.54 z"
           style="fill:none;stroke:#000000;stroke-width:7.50000477;stroke-linecap:butt;stroke-linejoin:round;stroke-miterlimit:10;stroke-dasharray:none;stroke-opacity:1"
           id="path520"
           inkscape:connector-curvature="0" /></g><path
         d="m 454.601,613.214 c 1.961,0 3.55,-1.593 3.55,-3.557 0,-1.953 -1.589,-3.545 -3.55,-3.545 -1.961,0 -3.551,1.592 -3.551,3.545 0,1.964 1.59,3.557 3.551,3.557"
         style="fill:#fefefe;fill-opacity:1;fill-rule:evenodd;stroke:none;stroke-width:0.1"
         id="path522"
         inkscape:connector-curvature="0" /><g
         id="g524"
         transform="scale(0.0999118,0.100088)"><path
           d="m 4550.02,6126.73 c 19.63,0 35.54,-15.91 35.54,-35.53 0,-19.51 -15.91,-35.42 -35.54,-35.42 -19.63,0 -35.54,15.91 -35.54,35.42 0,19.62 15.91,35.53 35.54,35.53 z"
           style="fill:none;stroke:#000000;stroke-width:7.50000477;stroke-linecap:butt;stroke-linejoin:round;stroke-miterlimit:10;stroke-dasharray:none;stroke-opacity:1"
           id="path526"
           inkscape:connector-curvature="0" /></g><g
         id="g528"
         transform="scale(0.0999118,0.100088)"><path
           d="m 4581.49,6108.39 60.97,81.52"
           style="fill:none;stroke:#000000;stroke-width:7.50000477;stroke-linecap:butt;stroke-linejoin:round;stroke-miterlimit:10;stroke-dasharray:none;stroke-opacity:1"
           id="path530"
           inkscape:connector-curvature="0" /></g><g
         id="g532"
         transform="scale(0.0999118,0.100088)"><path
           d="m 4457.46,6188.4 60.97,-81.52"
           style="fill:none;stroke:#000000;stroke-width:7.50000477;stroke-linecap:butt;stroke-linejoin:round;stroke-miterlimit:10;stroke-dasharray:none;stroke-opacity:1"
           id="path534"
           inkscape:connector-curvature="0" /></g><path
         d="m 464.104,626.651 c 1.96,0 3.55,-1.593 3.55,-3.557 0,-1.965 -1.59,-3.557 -3.55,-3.557 -1.961,0 -3.551,1.592 -3.551,3.557 0,1.964 1.59,3.557 3.551,3.557"
         style="fill:#fefefe;fill-opacity:1;fill-rule:evenodd;stroke:none;stroke-width:0.1"
         id="path536"
         inkscape:connector-curvature="0" /><g
         id="g538"
         transform="scale(0.0999118,0.100088)"><path
           d="m 4645.13,6260.99 c 19.63,0 35.54,-15.92 35.54,-35.54 0,-19.63 -15.91,-35.54 -35.54,-35.54 -19.62,0 -35.53,15.91 -35.53,35.54 0,19.62 15.91,35.54 35.53,35.54 z"
           style="fill:none;stroke:#000000;stroke-width:7.50000477;stroke-linecap:butt;stroke-linejoin:round;stroke-miterlimit:10;stroke-dasharray:none;stroke-opacity:1"
           id="path540"
           inkscape:connector-curvature="0" /></g><path
         d="m 391.166,613.632 c 1.961,0 3.551,-1.592 3.551,-3.557 0,-1.964 -1.59,-3.556 -3.539,-3.556 -1.961,0 -3.551,1.592 -3.551,3.556 0,1.965 1.59,3.557 3.539,3.557"
         style="fill:#989898;fill-opacity:1;fill-rule:evenodd;stroke:none;stroke-width:0.1"
         id="path542"
         inkscape:connector-curvature="0" /><g
         id="g544"
         transform="scale(0.0999118,0.100088)"><path
           d="m 3915.12,6130.91 c 19.62,0 35.53,-15.91 35.53,-35.53 0,-19.63 -15.91,-35.54 -35.42,-35.54 -19.62,0 -35.53,15.91 -35.53,35.54 0,19.62 15.91,35.53 35.42,35.53 z"
           style="fill:none;stroke:#000000;stroke-width:7.50000477;stroke-linecap:butt;stroke-linejoin:round;stroke-miterlimit:10;stroke-dasharray:none;stroke-opacity:1"
           id="path546"
           inkscape:connector-curvature="0" /></g><path
         d="m 444.993,626.5 c 1.961,0 3.551,-1.593 3.551,-3.557 0,-1.964 -1.59,-3.557 -3.551,-3.557 -1.961,0 -3.55,1.593 -3.55,3.557 0,1.964 1.589,3.557 3.55,3.557"
         style="fill:#b2b2b2;fill-opacity:1;fill-rule:evenodd;stroke:none;stroke-width:0.1"
         id="path548"
         inkscape:connector-curvature="0" /><g
         id="g550"
         transform="scale(0.0999118,0.100088)"><path
           d="m 4453.86,6259.48 c 19.63,0 35.54,-15.92 35.54,-35.54 0,-19.63 -15.91,-35.54 -35.54,-35.54 -19.62,0 -35.54,15.91 -35.54,35.54 0,19.62 15.92,35.54 35.54,35.54 z"
           style="fill:none;stroke:#000000;stroke-width:7.50000477;stroke-linecap:butt;stroke-linejoin:round;stroke-miterlimit:10;stroke-dasharray:none;stroke-opacity:1"
           id="path552"
           inkscape:connector-curvature="0" /></g><g
         id="g554"
         transform="scale(0.0999118,0.100088)"><path
           d="m 4675.79,6242.63 60.97,81.53"
           style="fill:none;stroke:#000000;stroke-width:7.50000477;stroke-linecap:butt;stroke-linejoin:round;stroke-miterlimit:10;stroke-dasharray:none;stroke-opacity:1"
           id="path556"
           inkscape:connector-curvature="0" /></g><g
         id="g558"
         transform="scale(0.0999118,0.100088)"><path
           d="m 4551.76,6322.65 60.97,-81.53"
           style="fill:none;stroke:#000000;stroke-width:7.50000477;stroke-linecap:butt;stroke-linejoin:round;stroke-miterlimit:10;stroke-dasharray:none;stroke-opacity:1"
           id="path560"
           inkscape:connector-curvature="0" /></g><path
         d="m 401.412,625.942 c 1.961,0 3.55,-1.593 3.55,-3.557 0,-1.965 -1.589,-3.557 -3.55,-3.557 -1.961,0 -3.551,1.592 -3.551,3.557 0,1.964 1.59,3.557 3.551,3.557"
         style="fill:#fefefe;fill-opacity:1;fill-rule:evenodd;stroke:none;stroke-width:0.1"
         id="path562"
         inkscape:connector-curvature="0" /><g
         id="g564"
         transform="scale(0.0999118,0.100088)"><path
           d="m 4017.66,6253.9 c 19.63,0 35.54,-15.91 35.54,-35.54 0,-19.62 -15.91,-35.53 -35.54,-35.53 -19.63,0 -35.53,15.91 -35.53,35.53 0,19.63 15.9,35.54 35.53,35.54 z"
           style="fill:none;stroke:#000000;stroke-width:7.50000477;stroke-linecap:butt;stroke-linejoin:round;stroke-miterlimit:10;stroke-dasharray:none;stroke-opacity:1"
           id="path566"
           inkscape:connector-curvature="0" /></g><g
         id="g568"
         transform="scale(0.0999118,0.100088)"><path
           d="m 4049.13,6235.55 60.98,81.53"
           style="fill:none;stroke:#000000;stroke-width:7.50000477;stroke-linecap:butt;stroke-linejoin:round;stroke-miterlimit:10;stroke-dasharray:none;stroke-opacity:1"
           id="path570"
           inkscape:connector-curvature="0" /></g><g
         id="g572"
         transform="scale(0.0999118,0.100088)"><path
           d="m 3925.1,6315.57 60.97,-81.53"
           style="fill:none;stroke:#000000;stroke-width:7.50000477;stroke-linecap:butt;stroke-linejoin:round;stroke-miterlimit:10;stroke-dasharray:none;stroke-opacity:1"
           id="path574"
           inkscape:connector-curvature="0" /></g><g
         id="g576"
         transform="scale(0.0999118,0.100088)"><path
           d="m 4108.94,5547.92 296.03,103.13"
           style="fill:none;stroke:#000000;stroke-width:7.50000477;stroke-linecap:butt;stroke-linejoin:round;stroke-miterlimit:10;stroke-dasharray:none;stroke-opacity:1"
           id="path578"
           inkscape:connector-curvature="0" /></g><path
         d="m 319.505,640.25 c 1.961,0 3.551,-1.592 3.551,-3.557 0,-1.964 -1.59,-3.556 -3.539,-3.556 -1.961,0 -3.551,1.592 -3.551,3.556 0,1.965 1.59,3.557 3.539,3.557"
         style="fill:#cbcbcb;fill-opacity:1;fill-rule:evenodd;stroke:none;stroke-width:0.1"
         id="path580"
         inkscape:connector-curvature="0" /><g
         id="g582"
         transform="scale(0.0999118,0.100088)"><path
           d="m 3197.88,6396.86 c 19.62,0 35.53,-15.91 35.53,-35.54 0,-19.62 -15.91,-35.53 -35.42,-35.53 -19.63,0 -35.54,15.91 -35.54,35.53 0,19.63 15.91,35.54 35.43,35.54 z"
           style="fill:none;stroke:#000000;stroke-width:7.50000477;stroke-linecap:butt;stroke-linejoin:round;stroke-miterlimit:10;stroke-dasharray:none;stroke-opacity:1"
           id="path584"
           inkscape:connector-curvature="0" /></g><path
         d="m 338.709,640.099 c 1.961,0 3.55,-1.592 3.55,-3.556 0,-1.965 -1.589,-3.557 -3.55,-3.557 -1.961,0 -3.551,1.592 -3.551,3.557 0,1.964 1.59,3.556 3.551,3.556"
         style="fill:#e5e5e5;fill-opacity:1;fill-rule:evenodd;stroke:none;stroke-width:0.1"
         id="path586"
         inkscape:connector-curvature="0" /><g
         id="g588"
         transform="scale(0.0999118,0.100088)"><path
           d="m 3390.08,6395.35 c 19.62,0 35.53,-15.91 35.53,-35.53 0,-19.63 -15.91,-35.54 -35.53,-35.54 -19.63,0 -35.54,15.91 -35.54,35.54 0,19.62 15.91,35.53 35.54,35.53 z"
           style="fill:none;stroke:#000000;stroke-width:7.50000477;stroke-linecap:butt;stroke-linejoin:round;stroke-miterlimit:10;stroke-dasharray:none;stroke-opacity:1"
           id="path590"
           inkscape:connector-curvature="0" /></g><path
         d="m 391.63,639.216 c 1.961,0 3.551,-1.593 3.551,-3.557 0,-1.953 -1.59,-3.545 -3.551,-3.545 -1.96,0 -3.55,1.592 -3.55,3.545 0,1.964 1.59,3.557 3.55,3.557"
         style="fill:#cbcbcb;fill-opacity:1;fill-rule:evenodd;stroke:none;stroke-width:0.1"
         id="path592"
         inkscape:connector-curvature="0" /><g
         id="g594"
         transform="scale(0.0999118,0.100088)"><path
           d="m 3919.76,6386.53 c 19.63,0 35.54,-15.91 35.54,-35.54 0,-19.51 -15.91,-35.42 -35.54,-35.42 -19.62,0 -35.53,15.91 -35.53,35.42 0,19.63 15.91,35.54 35.53,35.54 z"
           style="fill:none;stroke:#000000;stroke-width:7.50000477;stroke-linecap:butt;stroke-linejoin:round;stroke-miterlimit:10;stroke-dasharray:none;stroke-opacity:1"
           id="path596"
           inkscape:connector-curvature="0" /></g><path
         d="m 411.054,639.367 c 1.961,0 3.551,-1.592 3.551,-3.557 0,-1.953 -1.59,-3.545 -3.539,-3.545 -1.961,0 -3.551,1.592 -3.551,3.545 0,1.965 1.59,3.557 3.539,3.557"
         style="fill:#e5e5e5;fill-opacity:1;fill-rule:evenodd;stroke:none;stroke-width:0.1"
         id="path598"
         inkscape:connector-curvature="0" /><g
         id="g600"
         transform="scale(0.0999118,0.100088)"><path
           d="m 4114.17,6388.03 c 19.63,0 35.54,-15.9 35.54,-35.53 0,-19.51 -15.91,-35.42 -35.42,-35.42 -19.63,0 -35.54,15.91 -35.54,35.42 0,19.63 15.91,35.53 35.42,35.53 z"
           style="fill:none;stroke:#000000;stroke-width:7.50000477;stroke-linecap:butt;stroke-linejoin:round;stroke-miterlimit:10;stroke-dasharray:none;stroke-opacity:1"
           id="path602"
           inkscape:connector-curvature="0" /></g><path
         d="m 420.418,626.093 c 1.961,0 3.55,-1.593 3.55,-3.557 0,-1.965 -1.589,-3.557 -3.539,-3.557 -1.961,0 -3.55,1.592 -3.55,3.557 0,1.964 1.589,3.557 3.539,3.557"
         style="fill:#cbcbcb;fill-opacity:1;fill-rule:evenodd;stroke:none;stroke-width:0.1"
         id="path604"
         inkscape:connector-curvature="0" /><g
         id="g606"
         transform="scale(0.0999118,0.100088)"><path
           d="m 4207.89,6255.41 c 19.63,0 35.54,-15.91 35.54,-35.54 0,-19.62 -15.91,-35.54 -35.43,-35.54 -19.62,0 -35.53,15.92 -35.53,35.54 0,19.63 15.91,35.54 35.42,35.54 z"
           style="fill:none;stroke:#000000;stroke-width:7.50000477;stroke-linecap:butt;stroke-linejoin:round;stroke-miterlimit:10;stroke-dasharray:none;stroke-opacity:1"
           id="path608"
           inkscape:connector-curvature="0" /></g><path
         d="m 381.571,600.346 c 1.961,0 3.55,-1.592 3.55,-3.557 0,-1.952 -1.589,-3.544 -3.539,-3.544 -1.961,0 -3.55,1.592 -3.55,3.544 0,1.965 1.589,3.557 3.539,3.557"
         style="fill:#4b4b4b;fill-opacity:1;fill-rule:evenodd;stroke:none;stroke-width:0.1"
         id="path610"
         inkscape:connector-curvature="0" /><g
         id="g612"
         transform="scale(0.0999118,0.100088)"><path
           d="m 3819.08,5998.17 c 19.62,0 35.53,-15.91 35.53,-35.53 0,-19.51 -15.91,-35.42 -35.42,-35.42 -19.63,0 -35.54,15.91 -35.54,35.42 0,19.62 15.91,35.53 35.43,35.53 z"
           style="fill:none;stroke:#000000;stroke-width:7.50000477;stroke-linecap:butt;stroke-linejoin:round;stroke-miterlimit:10;stroke-dasharray:none;stroke-opacity:1"
           id="path614"
           inkscape:connector-curvature="0" /></g><path
         d="m 426.591,586.921 c 1.961,0 3.55,-1.592 3.55,-3.557 0,-1.964 -1.589,-3.557 -3.55,-3.557 -1.961,0 -3.551,1.593 -3.551,3.557 0,1.965 1.59,3.557 3.551,3.557"
         style="fill:#333333;fill-opacity:1;fill-rule:evenodd;stroke:none;stroke-width:0.1"
         id="path616"
         inkscape:connector-curvature="0" /><g
         id="g618"
         transform="scale(0.0999118,0.100088)"><path
           d="m 4269.67,5864.04 c 19.63,0 35.54,-15.91 35.54,-35.54 0,-19.62 -15.91,-35.54 -35.54,-35.54 -19.62,0 -35.53,15.92 -35.53,35.54 0,19.63 15.91,35.54 35.53,35.54 z"
           style="fill:none;stroke:#000000;stroke-width:7.50000477;stroke-linecap:butt;stroke-linejoin:round;stroke-miterlimit:10;stroke-dasharray:none;stroke-opacity:1"
           id="path620"
           inkscape:connector-curvature="0" /></g><path
         d="m 435.502,613.062 c 1.961,0 3.55,-1.592 3.55,-3.556 0,-1.953 -1.589,-3.545 -3.55,-3.545 -1.961,0 -3.55,1.592 -3.55,3.545 0,1.964 1.589,3.556 3.55,3.556"
         style="fill:#656565;fill-opacity:1;fill-rule:evenodd;stroke:none;stroke-width:0.1"
         id="path622"
         inkscape:connector-curvature="0" /><g
         id="g624"
         transform="scale(0.0999118,0.100088)"><path
           d="m 4358.86,6125.22 c 19.63,0 35.54,-15.91 35.54,-35.53 0,-19.51 -15.91,-35.42 -35.54,-35.42 -19.62,0 -35.53,15.91 -35.53,35.42 0,19.62 15.91,35.53 35.53,35.53 z"
           style="fill:none;stroke:#000000;stroke-width:7.50000477;stroke-linecap:butt;stroke-linejoin:round;stroke-miterlimit:10;stroke-dasharray:none;stroke-opacity:1"
           id="path626"
           inkscape:connector-curvature="0" /></g><path
         d="m 454.786,639.936 c 1.961,0 3.551,-1.592 3.551,-3.556 0,-1.965 -1.59,-3.557 -3.539,-3.557 -1.961,0 -3.551,1.592 -3.551,3.557 0,1.964 1.59,3.556 3.539,3.556"
         style="fill:#e5e5e5;fill-opacity:1;fill-rule:evenodd;stroke:none;stroke-width:0.1"
         id="path628"
         inkscape:connector-curvature="0" /><g
         id="g630"
         transform="scale(0.0999118,0.100088)"><path
           d="m 4551.88,6393.72 c 19.62,0 35.54,-15.9 35.54,-35.53 0,-19.63 -15.92,-35.54 -35.42,-35.54 -19.63,0 -35.54,15.91 -35.54,35.54 0,19.63 15.91,35.53 35.42,35.53 z"
           style="fill:none;stroke:#000000;stroke-width:7.50000477;stroke-linecap:butt;stroke-linejoin:round;stroke-miterlimit:10;stroke-dasharray:none;stroke-opacity:1"
           id="path632"
           inkscape:connector-curvature="0" /></g><path
         d="m 473.305,640.088 c 1.961,0 3.55,-1.593 3.55,-3.557 0,-1.965 -1.589,-3.557 -3.539,-3.557 -1.96,0 -3.55,1.592 -3.55,3.557 0,1.964 1.59,3.557 3.539,3.557"
         style="fill:#cbcbcb;fill-opacity:1;fill-rule:evenodd;stroke:none;stroke-width:0.1"
         id="path634"
         inkscape:connector-curvature="0" /><g
         id="g636"
         transform="scale(0.0999118,0.100088)"><path
           d="m 4737.23,6395.23 c 19.63,0 35.53,-15.9 35.53,-35.53 0,-19.63 -15.9,-35.54 -35.42,-35.54 -19.62,0 -35.53,15.91 -35.53,35.54 0,19.63 15.91,35.53 35.42,35.53 z"
           style="fill:none;stroke:#000000;stroke-width:7.50000477;stroke-linecap:butt;stroke-linejoin:round;stroke-miterlimit:10;stroke-dasharray:none;stroke-opacity:1"
           id="path638"
           inkscape:connector-curvature="0" /></g><g
         id="g640"
         transform="scale(0.0999118,0.100088)"><path
           d="m 2818.23,5438.18 c 811.2,-147.49 1259.71,75.6 1259.71,75.6"
           style="fill:none;stroke:#000000;stroke-width:7.50000477;stroke-linecap:butt;stroke-linejoin:round;stroke-miterlimit:10;stroke-dasharray:6.16572, 6.16572;stroke-dashoffset:0;stroke-opacity:1"
           id="path642"
           inkscape:connector-curvature="0" /></g><g
         id="g644"
         transform="scale(0.0999118,0.100088)"><path
           d="m 2425.12,5666.73 c 73.74,-147.49 393.11,-228.55 393.11,-228.55"
           style="fill:none;stroke:#000000;stroke-width:7.50000477;stroke-linecap:butt;stroke-linejoin:round;stroke-miterlimit:10;stroke-dasharray:6.16572, 6.16572;stroke-dashoffset:0;stroke-opacity:1"
           id="path646"
           inkscape:connector-curvature="0" /></g><g
         id="g648"
         transform="scale(0.0999118,0.100088)"><path
           d="m 2621.73,5666.73 c 0,-160.5 196.5,-228.55 196.5,-228.55"
           style="fill:none;stroke:#000000;stroke-width:7.50000477;stroke-linecap:butt;stroke-linejoin:round;stroke-miterlimit:10;stroke-dasharray:6.16572, 6.16572;stroke-dashoffset:0;stroke-opacity:1"
           id="path650"
           inkscape:connector-curvature="0" /></g><g
         id="g652"
         transform="scale(0.0999118,0.100088)"><path
           d="m 2857.72,5661.04 c 73.63,-221.24 375.81,-273.26 375.81,-273.26"
           style="fill:none;stroke:#000000;stroke-width:7.50000477;stroke-linecap:butt;stroke-linejoin:round;stroke-miterlimit:10;stroke-dasharray:6.16572, 6.16572;stroke-dashoffset:0;stroke-opacity:1"
           id="path654"
           inkscape:connector-curvature="0" /></g><g
         id="g656"
         transform="scale(0.0999118,0.100088)"><path
           d="m 3063.16,5661.04 c 147.49,-221.24 498.56,-273.26 498.56,-273.26"
           style="fill:none;stroke:#000000;stroke-width:7.50000477;stroke-linecap:butt;stroke-linejoin:round;stroke-miterlimit:10;stroke-dasharray:6.16572, 6.16572;stroke-dashoffset:0;stroke-opacity:1"
           id="path658"
           inkscape:connector-curvature="0" /></g><g
         id="g660"
         transform="scale(0.0999118,0.100088)"><path
           d="m 3137.48,5797.84 c 73.75,-294.98 579.17,-385.91 579.17,-385.91"
           style="fill:none;stroke:#000000;stroke-width:7.50000477;stroke-linecap:butt;stroke-linejoin:round;stroke-miterlimit:10;stroke-dasharray:6.16572, 6.16572;stroke-dashoffset:0;stroke-opacity:1"
           id="path662"
           inkscape:connector-curvature="0" /></g><g
         id="g664"
         transform="scale(0.0999118,0.100088)"><path
           d="m 2713.6,5797.84 c 104.63,-359.66 423.88,-394.5 423.88,-394.5"
           style="fill:none;stroke:#000000;stroke-width:7.50000477;stroke-linecap:butt;stroke-linejoin:round;stroke-miterlimit:10;stroke-dasharray:6.16572, 6.16572;stroke-dashoffset:0;stroke-opacity:1"
           id="path666"
           inkscape:connector-curvature="0" /></g><g
         id="g668"
         transform="scale(0.0999118,0.100088)"><path
           d="m 2272.17,5661.04 c 221.24,-221.24 764.74,-257.7 764.74,-257.7"
           style="fill:none;stroke:#000000;stroke-width:7.50000477;stroke-linecap:butt;stroke-linejoin:round;stroke-miterlimit:10;stroke-dasharray:6.16572, 6.16572;stroke-dashoffset:0;stroke-opacity:1"
           id="path670"
           inkscape:connector-curvature="0" /></g><g
         id="g672"
         transform="scale(0.0999118,0.100088)"><path
           d="m 2080.78,5659.41 c 147.49,-221.23 956.13,-256.07 956.13,-256.07"
           style="fill:none;stroke:#000000;stroke-width:7.50000477;stroke-linecap:butt;stroke-linejoin:round;stroke-miterlimit:10;stroke-dasharray:6.16572, 6.16572;stroke-dashoffset:0;stroke-opacity:1"
           id="path674"
           inkscape:connector-curvature="0" /></g><g
         id="g676"
         transform="scale(0.0999118,0.100088)"><path
           d="M 1961.86,5792.27 C 1859.55,5290.69 3176.74,5403.34 3176.74,5403.34"
           style="fill:none;stroke:#000000;stroke-width:7.50000477;stroke-linecap:butt;stroke-linejoin:round;stroke-miterlimit:10;stroke-dasharray:6.16572, 6.16572;stroke-dashoffset:0;stroke-opacity:1"
           id="path678"
           inkscape:connector-curvature="0" /></g><g
         id="g680"
         transform="scale(0.0999118,0.100088)"><path
           d="m 2597,6544.35 c 301.02,223.09 1185.96,149.35 1185.96,149.35"
           style="fill:none;stroke:#000000;stroke-width:7.50000477;stroke-linecap:butt;stroke-linejoin:round;stroke-miterlimit:10;stroke-dasharray:6.16572, 6.16572;stroke-dashoffset:0;stroke-opacity:1"
           id="path682"
           inkscape:connector-curvature="0" /></g><g
         id="g684"
         transform="scale(0.0999118,0.100088)"><path
           d="m 4735.6,6393.38 c -147.49,294.98 -958.68,294.98 -958.68,294.98"
           style="fill:none;stroke:#000000;stroke-width:7.50000477;stroke-linecap:butt;stroke-linejoin:round;stroke-miterlimit:10;stroke-dasharray:6.16572, 6.16572;stroke-dashoffset:0;stroke-opacity:1"
           id="path686"
           inkscape:connector-curvature="0" /></g><g
         id="g688"
         transform="scale(0.0999118,0.100088)"><path
           d="m 4566.39,6393.38 c 21.72,221.23 -760.44,294.98 -789.47,294.98"
           style="fill:none;stroke:#000000;stroke-width:7.50000477;stroke-linecap:butt;stroke-linejoin:round;stroke-miterlimit:10;stroke-dasharray:6.16572, 6.16572;stroke-dashoffset:0;stroke-opacity:1"
           id="path690"
           inkscape:connector-curvature="0" /></g><g
         id="g692"
         transform="scale(0.0999118,0.100088)"><path
           d="m 4472.56,6259.13 c 0,147.48 -642.46,457.45 -714.57,429.23"
           style="fill:none;stroke:#000000;stroke-width:7.50000477;stroke-linecap:butt;stroke-linejoin:round;stroke-miterlimit:10;stroke-dasharray:6.16572, 6.16572;stroke-dashoffset:0;stroke-opacity:1"
           id="path694"
           inkscape:connector-curvature="0" /></g><g
         id="g696"
         transform="scale(0.0999118,0.100088)"><path
           d="m 4120.67,6387.69 c 98.72,153.18 -632.7,306.01 -731.52,317.74"
           style="fill:none;stroke:#000000;stroke-width:7.50000477;stroke-linecap:butt;stroke-linejoin:round;stroke-miterlimit:10;stroke-dasharray:6.16572, 6.16572;stroke-dashoffset:0;stroke-opacity:1"
           id="path698"
           inkscape:connector-curvature="0" /></g><g
         id="g700"
         transform="scale(0.0999118,0.100088)"><path
           d="m 3924.41,6386.18 c 0,147.49 -644.2,338.3 -657.67,307.52"
           style="fill:none;stroke:#000000;stroke-width:7.50000477;stroke-linecap:butt;stroke-linejoin:round;stroke-miterlimit:10;stroke-dasharray:6.16572, 6.16572;stroke-dashoffset:0;stroke-opacity:1"
           id="path702"
           inkscape:connector-curvature="0" /></g><g
         id="g704"
         transform="scale(0.0999118,0.100088)"><path
           d="m 3408.19,6393.38 c 0,147.49 -589.03,257.93 -657.66,226.57"
           style="fill:none;stroke:#000000;stroke-width:7.50000477;stroke-linecap:butt;stroke-linejoin:round;stroke-miterlimit:10;stroke-dasharray:6.16572, 6.16572;stroke-dashoffset:0;stroke-opacity:1"
           id="path706"
           inkscape:connector-curvature="0" /></g><g
         id="g708"
         transform="scale(0.0999118,0.100088)"><path
           d="m 3211.69,6396.51 c -73.74,147.49 -493.8,232.74 -517.95,199.98"
           style="fill:none;stroke:#000000;stroke-width:7.50000477;stroke-linecap:butt;stroke-linejoin:round;stroke-miterlimit:10;stroke-dasharray:6.16572, 6.16572;stroke-dashoffset:0;stroke-opacity:1"
           id="path710"
           inkscape:connector-curvature="0" /></g><g
         id="g712"
         transform="scale(0.0999118,0.100088)"><path
           d="m 4219.39,6255.06 c 147.49,285.81 -680.66,450.37 -680.66,450.37"
           style="fill:none;stroke:#000000;stroke-width:7.50000477;stroke-linecap:butt;stroke-linejoin:round;stroke-miterlimit:10;stroke-dasharray:6.16572, 6.16572;stroke-dashoffset:0;stroke-opacity:1"
           id="path714"
           inkscape:connector-curvature="0" /></g><g
         id="g716"
         transform="scale(0.0999118,0.100088)"><path
           d="m 3508.88,6259.13 c 73.74,294.98 -518.07,385.91 -665.56,385.91"
           style="fill:none;stroke:#000000;stroke-width:7.50000477;stroke-linecap:butt;stroke-linejoin:round;stroke-miterlimit:10;stroke-dasharray:6.16572, 6.16572;stroke-dashoffset:0;stroke-opacity:1"
           id="path718"
           inkscape:connector-curvature="0" /></g><text
         transform="scale(1,-1)"
         id="text2982"
         y="-661.67236"
         x="136.92744"
         style="font-style:normal;font-weight:normal;font-size:30px;line-height:125%;font-family:sans-serif;letter-spacing:0px;word-spacing:0px;fill:#000000;fill-opacity:1;stroke:none;stroke-width:0.75px;stroke-linecap:butt;stroke-linejoin:miter;stroke-opacity:1"
         xml:space="preserve"><tspan
           style="font-style:normal;font-variant:normal;font-weight:normal;font-stretch:normal;font-size:8px;font-family:sans-serif;-inkscape-font-specification:'sans-serif, Normal';font-variant-ligatures:normal;font-variant-caps:normal;font-variant-numeric:normal;font-feature-settings:normal;text-align:start;writing-mode:lr-tb;text-anchor:start;stroke-width:0.75px"
           y="-661.67236"
           x="136.92744"
           id="tspan2980"
           sodipodi:role="line">Pixel Neighbourhood:</tspan></text>
<text
         transform="scale(1,-1)"
         id="text2986"
         y="-634.92664"
         x="136.68591"
         style="font-style:normal;font-weight:normal;font-size:30px;line-height:125%;font-family:sans-serif;letter-spacing:0px;word-spacing:0px;fill:#000000;fill-opacity:1;stroke:none;stroke-width:0.75px;stroke-linecap:butt;stroke-linejoin:miter;stroke-opacity:1"
         xml:space="preserve"><tspan
           style="font-style:normal;font-variant:normal;font-weight:bold;font-stretch:normal;font-size:8px;font-family:sans-serif;-inkscape-font-specification:'sans-serif Bold';stroke-width:0.75px"
           y="-634.92664"
           x="136.68591"
           id="tspan2984"
           sodipodi:role="line">Homogeneous</tspan></text>
<text
         transform="scale(1,-1)"
         id="text2990"
         y="-546.31219"
         x="136.82574"
         style="font-style:normal;font-weight:normal;font-size:30px;line-height:125%;font-family:sans-serif;letter-spacing:0px;word-spacing:0px;fill:#000000;fill-opacity:1;stroke:none;stroke-width:0.75px;stroke-linecap:butt;stroke-linejoin:miter;stroke-opacity:1"
         xml:space="preserve"><tspan
           style="font-style:normal;font-variant:normal;font-weight:bold;font-stretch:normal;font-size:8px;font-family:sans-serif;-inkscape-font-specification:'sans-serif Bold';stroke-width:0.75px"
           y="-546.31219"
           x="136.82574"
           id="tspan2988"
           sodipodi:role="line">Heterogeneous</tspan></text>
<g
         style="stroke-width:7.50001049;stroke-miterlimit:10;stroke-dasharray:none"
         id="g466-4"
         transform="matrix(0.0999118,0,0,0.100088,18.949286,-10.495722)"><path
           sodipodi:nodetypes="cc"
           d="m 4592.2076,6138.3468 -3432.5995,-1.452"
           style="fill:none;stroke:#000000;stroke-width:7.50001049;stroke-linecap:butt;stroke-linejoin:round;stroke-miterlimit:10;stroke-dasharray:45.00006359, 45.00006359;stroke-dashoffset:0;stroke-opacity:1"
           id="path468-0"
           inkscape:connector-curvature="0" /></g></g></g></svg>