<?xml version="1.0" encoding="UTF-8" standalone="no"?>
<!-- Created with Inkscape (http://www.inkscape.org/) -->

<svg
   xmlns:dc="http://purl.org/dc/elements/1.1/"
   xmlns:cc="http://creativecommons.org/ns#"
   xmlns:rdf="http://www.w3.org/1999/02/22-rdf-syntax-ns#"
   xmlns:svg="http://www.w3.org/2000/svg"
   xmlns="http://www.w3.org/2000/svg"
   xmlns:sodipodi="http://sodipodi.sourceforge.net/DTD/sodipodi-0.dtd"
   xmlns:inkscape="http://www.inkscape.org/namespaces/inkscape"
   version="1.1"
   id="svg2"
   xml:space="preserve"
   width="696.85431"
   height="756.69379"
   viewBox="0 0 696.85434 756.69379"
   sodipodi:docname="featuresflow.svg"
   inkscape:version="0.92.3 (unknown)"><metadata
     id="metadata8"><rdf:RDF><cc:Work
         rdf:about=""><dc:format>image/svg+xml</dc:format><dc:type
           rdf:resource="http://purl.org/dc/dcmitype/StillImage" /><dc:title /></cc:Work></rdf:RDF></metadata><defs
     id="defs6"><clipPath
       clipPathUnits="userSpaceOnUse"
       id="clipPath18"><path
         d="M 0,0 H 841 V 595.67834 H 0 Z"
         id="path16"
         inkscape:connector-curvature="0"
         style="clip-rule:evenodd" /></clipPath><clipPath
       clipPathUnits="userSpaceOnUse"
       id="clipPath32"><path
         d="M 0,0 H 841 V 594.95892 H 0 Z"
         id="path30"
         inkscape:connector-curvature="0"
         style="clip-rule:evenodd" /></clipPath></defs><sodipodi:namedview
     pagecolor="#ffffff"
     bordercolor="#666666"
     borderopacity="1"
     objecttolerance="10"
     gridtolerance="10"
     guidetolerance="10"
     inkscape:pageopacity="0"
     inkscape:pageshadow="2"
     inkscape:window-width="1301"
     inkscape:window-height="744"
     id="namedview4"
     showgrid="false"
     inkscape:zoom="0.59395972"
     inkscape:cx="363.30497"
     inkscape:cy="409.36187"
     inkscape:window-x="65"
     inkscape:window-y="24"
     inkscape:window-maximized="1"
     inkscape:current-layer="g10" /><g
     id="g10"
     inkscape:groupmode="layer"
     inkscape:label="Untitled Diagram"
     transform="matrix(1.3333333,0,0,1.3333333,-47.481606,-28.297119)"><g
       id="g1411"><g
         transform="scale(0.71941829)"
         id="g34"><path
           inkscape:connector-curvature="0"
           id="path36"
           style="fill:#ffffff;fill-opacity:1;fill-rule:nonzero;stroke:none"
           d="m 121.73,30 h 46.54 c 20.28,0 36.73,6.720001 36.73,15 0,8.279999 -16.45,15 -36.73,15 H 121.73 C 101.45,60 85,53.279999 85,45 85,36.720001 101.45,30 121.73,30 Z" /><path
           inkscape:connector-curvature="0"
           id="path38"
           style="fill:none;stroke:#000000;stroke-width:1;stroke-linecap:butt;stroke-linejoin:miter;stroke-miterlimit:10;stroke-dasharray:none;stroke-opacity:1"
           d="m 121.73,30 h 46.54 c 20.28,0 36.73,6.720001 36.73,15 0,8.279999 -16.45,15 -36.73,15 H 121.73 C 101.45,60 85,53.279999 85,45 85,36.720001 101.45,30 121.73,30 Z" /><path
           inkscape:connector-curvature="0"
           id="path40"
           style="fill:#ffffff;fill-opacity:1;fill-rule:nonzero;stroke:none"
           d="m 96.68,106.8 c 1.860001,-4.27 4.87,-6.75 8.05,-6.64 h 111.08 c 2.53,-0.05 4.96,0.68 6.54001,1.99 1.57998,1.31 2.14,3.03 1.50999,4.65 l -30.59,66.4 c -1.86,4.27 -4.87001,6.75 -8.05,6.64 H 72.529999 c -2.239998,-0.25 -4.220001,-1.11 -5.449997,-2.37999 C 65.849998,176.2 65.5,174.64999 66.099998,173.2 Z" /><path
           inkscape:connector-curvature="0"
           id="path42"
           style="fill:none;stroke:#000000;stroke-width:1;stroke-linecap:butt;stroke-linejoin:miter;stroke-miterlimit:10;stroke-dasharray:none;stroke-opacity:1"
           d="m 96.68,106.8 c 1.860001,-4.27 4.87,-6.75 8.05,-6.64 h 111.08 c 2.53,-0.05 4.96,0.68 6.54001,1.99 1.57998,1.31 2.14,3.03 1.50999,4.65 l -30.59,66.4 c -1.86,4.27 -4.87001,6.75 -8.05,6.64 H 72.529999 c -2.239998,-0.25 -4.220001,-1.11 -5.449997,-2.37999 C 65.849998,176.2 65.5,174.64999 66.099998,173.2 Z" /></g><g
         transform="matrix(0.71941829,0,0,0.71941829,87.049614,96.402054)"
         id="g44"><text
   id="text48"
   style="font-variant:normal;font-weight:normal;font-size:12px;font-family:Helvetica;-inkscape-font-specification:Helvetica;writing-mode:lr-tb;fill:#001933;fill-opacity:1;fill-rule:nonzero;stroke:none"
   transform="translate(0,11)"><tspan
     id="tspan46"
     sodipodi:role="line"
     y="0"
     x="0 6.6738281 13.347656 16.681641 20.677734 27.351562 34.025391 40.699219">entradas</tspan></text>

</g><g
         transform="scale(0.71941829)"
         id="g50"><path
           inkscape:connector-curvature="0"
           id="path52"
           style="fill:#ffffff;fill-opacity:1;fill-rule:nonzero;stroke:none"
           d="M 145,360 194,388.5 145,417 96,388.5 Z" /><path
           inkscape:connector-curvature="0"
           id="path54"
           style="fill:none;stroke:#000000;stroke-width:1;stroke-linecap:butt;stroke-linejoin:miter;stroke-miterlimit:10;stroke-dasharray:none;stroke-opacity:1"
           d="M 145,360 194,388.5 145,417 96,388.5 Z" /></g><g
         transform="matrix(0.71941829,0,0,0.71941829,80.574844,274.81778)"
         id="g56"><text
   id="text60"
   style="font-variant:normal;font-weight:normal;font-size:12px;font-family:Helvetica;-inkscape-font-specification:Helvetica;writing-mode:lr-tb;fill:#001933;fill-opacity:1;fill-rule:nonzero;stroke:none"
   transform="translate(0,11)"><tspan
     id="tspan58"
     sodipodi:role="line"
     y="0"
     x="0 3.3339844 10.007812 12.673828 16.007812 22.681641 26.015625 32.689453 39.363281 45.363281 52.037109 54.703125 58.699219">falta deﬁnir?</tspan></text>

</g><g
         transform="matrix(0.71941829,0,0,0.71941829,0.35970914,0.35970914)"
         id="g62"><path
           inkscape:connector-curvature="0"
           id="path64"
           style="fill:none;stroke:#003366;stroke-width:1;stroke-linecap:butt;stroke-linejoin:miter;stroke-miterlimit:10;stroke-dasharray:none;stroke-opacity:1"
           d="M 145,60 V 93.629997" /><path
           inkscape:connector-curvature="0"
           id="path66"
           style="fill:#003366;fill-opacity:1;fill-rule:nonzero;stroke:none"
           d="m 145,98.879997 -3.5,-7 3.5,1.75 3.5,-1.75 z" /><path
           inkscape:connector-curvature="0"
           id="path68"
           style="fill:none;stroke:#003366;stroke-width:1;stroke-linecap:butt;stroke-linejoin:miter;stroke-miterlimit:10;stroke-dasharray:none;stroke-opacity:1"
           d="m 145,98.879997 -3.5,-7 3.5,1.75 3.5,-1.75 z" /><path
           inkscape:connector-curvature="0"
           id="path70"
           style="fill:none;stroke:#003366;stroke-width:1;stroke-linecap:butt;stroke-linejoin:miter;stroke-miterlimit:10;stroke-dasharray:none;stroke-opacity:1"
           d="m 145,180 v 33.63" /><path
           inkscape:connector-curvature="0"
           id="path72"
           style="fill:#003366;fill-opacity:1;fill-rule:nonzero;stroke:none"
           d="m 145,218.88 -3.5,-7 3.5,1.75 3.5,-1.75 z" /><path
           inkscape:connector-curvature="0"
           id="path74"
           style="fill:none;stroke:#003366;stroke-width:1;stroke-linecap:butt;stroke-linejoin:miter;stroke-miterlimit:10;stroke-dasharray:none;stroke-opacity:1"
           d="m 145,218.88 -3.5,-7 3.5,1.75 3.5,-1.75 z" /><path
           inkscape:connector-curvature="0"
           id="path76"
           style="fill:none;stroke:#003366;stroke-width:1;stroke-linecap:butt;stroke-linejoin:miter;stroke-miterlimit:10;stroke-dasharray:none;stroke-opacity:1"
           d="m 145,310 v 43.63" /><path
           inkscape:connector-curvature="0"
           id="path78"
           style="fill:#003366;fill-opacity:1;fill-rule:nonzero;stroke:none"
           d="m 145,358.88 -3.5,-7 3.5,1.75 3.5,-1.75 z" /><path
           inkscape:connector-curvature="0"
           id="path80"
           style="fill:none;stroke:#003366;stroke-width:1;stroke-linecap:butt;stroke-linejoin:miter;stroke-miterlimit:10;stroke-dasharray:none;stroke-opacity:1"
           d="m 145,358.88 -3.5,-7 3.5,1.75 3.5,-1.75 z" /><path
           inkscape:connector-curvature="0"
           id="path82"
           style="fill:none;stroke:#003366;stroke-width:1;stroke-linecap:butt;stroke-linejoin:miter;stroke-miterlimit:10;stroke-dasharray:none;stroke-opacity:1"
           d="m 194,389 h 89.63" /><path
           inkscape:connector-curvature="0"
           id="path84"
           style="fill:#003366;fill-opacity:1;fill-rule:nonzero;stroke:none"
           d="m 288.88,389 -7,3.5 1.75,-3.5 -1.75,-3.5 z" /><path
           inkscape:connector-curvature="0"
           id="path86"
           style="fill:none;stroke:#003366;stroke-width:1;stroke-linecap:butt;stroke-linejoin:miter;stroke-miterlimit:10;stroke-dasharray:none;stroke-opacity:1"
           d="m 288.88,389 -7,3.5 1.75,-3.5 -1.75,-3.5 z" /></g><g
         transform="matrix(0.71941829,0,0,0.71941829,141.7254,264.02652)"
         id="g88"><text
   id="text92"
   style="font-variant:normal;font-weight:normal;font-size:12px;font-family:Helvetica;-inkscape-font-specification:Helvetica;writing-mode:lr-tb;fill:#001933;fill-opacity:1;fill-rule:nonzero;stroke:none"
   transform="translate(0,11)"><tspan
     id="tspan90"
     sodipodi:role="line"
     y="0"
     x="0 6 12.673828">yes</tspan></text>

</g><g
         transform="matrix(0.71941829,0,0,0.71941829,0.35970914,0.35970914)"
         id="g94"><path
           inkscape:connector-curvature="0"
           id="path96"
           style="fill:none;stroke:#003366;stroke-width:1;stroke-linecap:butt;stroke-linejoin:miter;stroke-miterlimit:10;stroke-dasharray:none;stroke-opacity:1"
           d="m 145,417 v 53 c 0,6.66666 0.0633,8.94 0.19,6.82001 l 0.17999,-3.19001" /><path
           inkscape:connector-curvature="0"
           id="path98"
           style="fill:#003366;fill-opacity:1;fill-rule:nonzero;stroke:none"
           d="m 145.39999,478.88 -3.53999,-6.97 3.50999,1.72 3.49001,-1.77001 z" /><path
           inkscape:connector-curvature="0"
           id="path100"
           style="fill:none;stroke:#003366;stroke-width:1;stroke-linecap:butt;stroke-linejoin:miter;stroke-miterlimit:10;stroke-dasharray:none;stroke-opacity:1"
           d="m 145.39999,478.88 -3.53999,-6.97 3.50999,1.72 3.49001,-1.77001 z" /></g><g
         transform="matrix(0.71941829,0,0,0.71941829,114.38751,305.03336)"
         id="g102"><text
   id="text106"
   style="font-variant:normal;font-weight:normal;font-size:12px;font-family:Helvetica;-inkscape-font-specification:Helvetica;writing-mode:lr-tb;fill:#001933;fill-opacity:1;fill-rule:nonzero;stroke:none"
   transform="translate(0,11)"><tspan
     id="tspan104"
     sodipodi:role="line"
     y="0"
     x="0 6.6738281">no</tspan></text>

</g><g
         transform="matrix(0.71941829,0,0,0.71941829,0.35970914,0.35970914)"
         id="g108"><path
           inkscape:connector-curvature="0"
           id="path110"
           style="fill:none;stroke:#003366;stroke-width:1;stroke-linecap:butt;stroke-linejoin:miter;stroke-miterlimit:10;stroke-dasharray:none;stroke-opacity:1"
           d="m 145.41,560 h -0.19999 C 145.07001,560 145,563.33331 145,570 v 30 c 0,6.66669 0.06,8.94 0.17999,6.82001 L 145.36,603.63" /><path
           inkscape:connector-curvature="0"
           id="path112"
           style="fill:#003366;fill-opacity:1;fill-rule:nonzero;stroke:none"
           d="m 145.39999,608.88 -3.54998,-6.97003 3.50999,1.72003 3.48,-1.78002 z" /><path
           inkscape:connector-curvature="0"
           id="path114"
           style="fill:none;stroke:#003366;stroke-width:1;stroke-linecap:butt;stroke-linejoin:miter;stroke-miterlimit:10;stroke-dasharray:none;stroke-opacity:1"
           d="m 145.39999,608.88 -3.54998,-6.97003 3.50999,1.72003 3.48,-1.78002 z" /></g><g
         transform="scale(0.71941829)"
         id="g116"><path
           inkscape:connector-curvature="0"
           id="path118"
           style="fill:#ffffff;fill-opacity:1;fill-rule:nonzero;stroke:none"
           d="M 56.049999,220.47 H 233.95 c 1.67065,0 3.09665,0.59067 4.27798,1.77199 1.18134,1.18133 1.772,2.60734 1.77202,4.27801 v 77.90001 c -2e-5,1.67063 -0.59068,3.09662 -1.77202,4.27799 -1.18133,1.1813 -2.60733,1.77197 -4.27798,1.772 H 56.049999 c -1.670666,-3e-5 -3.096664,-0.5907 -4.277996,-1.772 C 50.590664,307.51663 49.999996,306.09064 50,304.42001 V 226.52 c -4e-6,-1.67067 0.590664,-3.09668 1.772003,-4.27803 1.181332,-1.18132 2.60733,-1.77197 4.277996,-1.77197 z" /><path
           inkscape:connector-curvature="0"
           id="path120"
           style="fill:none;stroke:#000000;stroke-width:1;stroke-linecap:butt;stroke-linejoin:miter;stroke-miterlimit:10;stroke-dasharray:none;stroke-opacity:1"
           d="M 56.049999,220.47 H 233.95 c 1.67065,0 3.09665,0.59067 4.27798,1.77199 1.18134,1.18133 1.772,2.60734 1.77202,4.27801 v 77.90001 c -2e-5,1.67063 -0.59068,3.09662 -1.77202,4.27799 -1.18133,1.1813 -2.60733,1.77197 -4.27798,1.772 H 56.049999 c -1.670666,-3e-5 -3.096664,-0.5907 -4.277996,-1.772 C 50.590664,307.51663 49.999996,306.09064 50,304.42001 V 226.52 c -4e-6,-1.67067 0.590664,-3.09668 1.772003,-4.27803 1.181332,-1.18132 2.60733,-1.77197 4.277996,-1.77197 z" /><path
           inkscape:connector-curvature="0"
           id="path122"
           style="fill:none;stroke:#000000;stroke-width:1;stroke-linecap:butt;stroke-linejoin:miter;stroke-miterlimit:10;stroke-dasharray:none;stroke-opacity:1"
           d="m 77.139999,220.47 v 90" /><path
           inkscape:connector-curvature="0"
           id="path124"
           style="fill:none;stroke:#000000;stroke-width:1;stroke-linecap:butt;stroke-linejoin:miter;stroke-miterlimit:10;stroke-dasharray:none;stroke-opacity:1"
           d="m 212.86,220.47 v 90" /></g><g
         transform="matrix(0.71941829,0,0,0.71941829,71.222412,186.32933)"
         id="g126"><text
   id="text130"
   style="font-variant:normal;font-weight:normal;font-size:12px;font-family:Helvetica;-inkscape-font-specification:Helvetica;writing-mode:lr-tb;fill:#001933;fill-opacity:1;fill-rule:nonzero;stroke:none"
   transform="translate(0,11)"><tspan
     id="tspan128"
     sodipodi:role="line"
     y="0"
     x="0 6.6738281 13.347656 17.34375 23.34375 30.017578 36.691406 40.6875 44.021484 50.695312 57.369141 60.703125 64.699219 71.373047 78.046875 84.720703">parsear entradas</tspan></text>

</g><g
         transform="matrix(0.71941829,0,0,0.71941829,0.35970914,0.35970914)"
         id="g132"><path
           inkscape:connector-curvature="0"
           id="path134"
           style="fill:none;stroke:#003366;stroke-width:1;stroke-linecap:butt;stroke-linejoin:miter;stroke-miterlimit:10;stroke-dasharray:none;stroke-opacity:1"
           d="m 146.59,690 h 0.19999 c 0.14,0 0.21001,3.33331 0.21001,10 v 55.76001 c 0,6.66669 -0.0633,8.94 -0.19,6.82001 l -0.19001,-3.18" /><path
           inkscape:connector-curvature="0"
           id="path136"
           style="fill:#003366;fill-opacity:1;fill-rule:nonzero;stroke:none"
           d="m 146.59,764.65002 -3.46,-7.02002 3.48999,1.77002 3.51001,-1.73004 z" /><path
           inkscape:connector-curvature="0"
           id="path138"
           style="fill:none;stroke:#003366;stroke-width:1;stroke-linecap:butt;stroke-linejoin:miter;stroke-miterlimit:10;stroke-dasharray:none;stroke-opacity:1"
           d="m 146.59,764.65002 -3.46,-7.02002 3.48999,1.77002 3.51001,-1.73004 z" /></g><g
         transform="scale(0.71941829)"
         id="g140"><path
           inkscape:connector-curvature="0"
           id="path142"
           style="fill:#ffffff;fill-opacity:1;fill-rule:nonzero;stroke:none"
           d="m 326.73001,373.5 h 46.53998 c 20.28,0 36.73001,6.72 36.73001,15 0,8.28 -16.45001,15 -36.73001,15 h -46.53998 c -20.28,0 -36.73001,-6.72 -36.73001,-15 0,-8.28 16.45001,-15 36.73001,-15 z" /><path
           inkscape:connector-curvature="0"
           id="path144"
           style="fill:none;stroke:#000000;stroke-width:1;stroke-linecap:butt;stroke-linejoin:miter;stroke-miterlimit:10;stroke-dasharray:none;stroke-opacity:1"
           d="m 326.73001,373.5 h 46.53998 c 20.28,0 36.73001,6.72 36.73001,15 0,8.28 -16.45001,15 -36.73001,15 h -46.53998 c -20.28,0 -36.73001,-6.72 -36.73001,-15 0,-8.28 16.45001,-15 36.73001,-15 z" /></g><g
         transform="matrix(0.71941829,0,0,0.71941829,240.28571,274.81778)"
         id="g146"><text
   id="text150"
   style="font-variant:normal;font-weight:normal;font-size:12px;font-family:Helvetica;-inkscape-font-specification:Helvetica;writing-mode:lr-tb;fill:#001933;fill-opacity:1;fill-rule:nonzero;stroke:none"
   transform="translate(0,11)"><tspan
     id="tspan148"
     sodipodi:role="line"
     y="0"
     x="0 6 12.673828 15.339844 18.005859 24.679688">salida</tspan></text>

</g><g
         transform="scale(0.71941829)"
         id="g152"><path
           inkscape:connector-curvature="0"
           id="path154"
           style="fill:#ffffff;fill-opacity:1;fill-rule:nonzero;stroke:none"
           d="M 57.049999,479.97 H 234.95 c 1.67065,0 3.09665,0.59067 4.27798,1.772 1.18132,1.18131 1.772,2.6073 1.77202,4.27799 v 77.89999 c -2e-5,1.6706 -0.5907,3.09662 -1.77202,4.27796 -1.18133,1.18133 -2.60733,1.77203 -4.27798,1.77203 H 57.049999 c -1.670666,0 -3.096664,-0.5907 -4.277996,-1.77203 C 51.590664,567.0166 50.999996,565.59058 51,563.91998 v -77.89999 c -4e-6,-1.67069 0.590664,-3.09668 1.772003,-4.27805 1.181332,-1.1813 2.60733,-1.77194 4.277996,-1.77194 z" /><path
           inkscape:connector-curvature="0"
           id="path156"
           style="fill:none;stroke:#000000;stroke-width:1;stroke-linecap:butt;stroke-linejoin:miter;stroke-miterlimit:10;stroke-dasharray:none;stroke-opacity:1"
           d="M 57.049999,479.97 H 234.95 c 1.67065,0 3.09665,0.59067 4.27798,1.772 1.18132,1.18131 1.772,2.6073 1.77202,4.27799 v 77.89999 c -2e-5,1.6706 -0.5907,3.09662 -1.77202,4.27796 -1.18133,1.18133 -2.60733,1.77203 -4.27798,1.77203 H 57.049999 c -1.670666,0 -3.096664,-0.5907 -4.277996,-1.77203 C 51.590664,567.0166 50.999996,565.59058 51,563.91998 v -77.89999 c -4e-6,-1.67069 0.590664,-3.09668 1.772003,-4.27805 1.181332,-1.1813 2.60733,-1.77194 4.277996,-1.77194 z" /><path
           inkscape:connector-curvature="0"
           id="path158"
           style="fill:none;stroke:#000000;stroke-width:1;stroke-linecap:butt;stroke-linejoin:miter;stroke-miterlimit:10;stroke-dasharray:none;stroke-opacity:1"
           d="m 78.139999,479.97 v 89.99997" /><path
           inkscape:connector-curvature="0"
           id="path160"
           style="fill:none;stroke:#000000;stroke-width:1;stroke-linecap:butt;stroke-linejoin:miter;stroke-miterlimit:10;stroke-dasharray:none;stroke-opacity:1"
           d="m 213.86,479.97 v 89.99997" /></g><g
         transform="matrix(0.71941829,0,0,0.71941829,76.258339,372.65866)"
         id="g162"><text
   id="text166"
   style="font-variant:normal;font-weight:normal;font-size:12px;font-family:Helvetica;-inkscape-font-specification:Helvetica;writing-mode:lr-tb;fill:#001933;fill-opacity:1;fill-rule:nonzero;stroke:none"
   transform="translate(0,11)"><tspan
     id="tspan164"
     sodipodi:role="line"
     y="0"
     x="0 6.6738281 10.669922 17.34375 23.34375 30.017578 36.017578 42.691406 52.6875 55.353516 62.027344 68.701172 72.035156">procesamiento</tspan></text>

</g><g
         transform="scale(0.71941829)"
         id="g168"><path
           inkscape:connector-curvature="0"
           id="path170"
           style="fill:#ffffff;fill-opacity:1;fill-rule:nonzero;stroke:none"
           d="M 56.049999,609.96997 H 233.95 c 1.67065,0 3.09665,0.59064 4.27798,1.77197 1.18134,1.18134 1.772,2.6073 1.77202,4.27802 v 77.90002 c -2e-5,1.67066 -0.59068,3.09662 -1.77202,4.2779 -1.18133,1.18133 -2.60733,1.77203 -4.27798,1.77209 H 56.049999 c -1.670666,-6e-5 -3.096664,-0.59076 -4.277996,-1.77209 C 50.590664,697.0166 49.999996,695.59064 50,693.91998 v -77.90002 c -4e-6,-1.67072 0.590664,-3.09668 1.772003,-4.27802 1.181332,-1.18133 2.60733,-1.77197 4.277996,-1.77197 z" /><path
           inkscape:connector-curvature="0"
           id="path172"
           style="fill:none;stroke:#000000;stroke-width:1;stroke-linecap:butt;stroke-linejoin:miter;stroke-miterlimit:10;stroke-dasharray:none;stroke-opacity:1"
           d="M 56.049999,609.96997 H 233.95 c 1.67065,0 3.09665,0.59064 4.27798,1.77197 1.18134,1.18134 1.772,2.6073 1.77202,4.27802 v 77.90002 c -2e-5,1.67066 -0.59068,3.09662 -1.77202,4.2779 -1.18133,1.18133 -2.60733,1.77203 -4.27798,1.77209 H 56.049999 c -1.670666,-6e-5 -3.096664,-0.59076 -4.277996,-1.77209 C 50.590664,697.0166 49.999996,695.59064 50,693.91998 v -77.90002 c -4e-6,-1.67072 0.590664,-3.09668 1.772003,-4.27802 1.181332,-1.18133 2.60733,-1.77197 4.277996,-1.77197 z" /><path
           inkscape:connector-curvature="0"
           id="path174"
           style="fill:none;stroke:#000000;stroke-width:1;stroke-linecap:butt;stroke-linejoin:miter;stroke-miterlimit:10;stroke-dasharray:none;stroke-opacity:1"
           d="m 77.139999,609.96997 v 90" /><path
           inkscape:connector-curvature="0"
           id="path176"
           style="fill:none;stroke:#000000;stroke-width:1;stroke-linecap:butt;stroke-linejoin:miter;stroke-miterlimit:10;stroke-dasharray:none;stroke-opacity:1"
           d="m 212.86,609.96997 v 90" /></g><g
         transform="matrix(0.71941829,0,0,0.71941829,92.085541,466.18304)"
         id="g178"><text
   id="text182"
   style="font-variant:normal;font-weight:normal;font-size:12px;font-family:Helvetica;-inkscape-font-specification:Helvetica;writing-mode:lr-tb;fill:#001933;fill-opacity:1;fill-rule:nonzero;stroke:none"
   transform="translate(0,11)"><tspan
     id="tspan180"
     sodipodi:role="line"
     y="0"
     x="0 6.6738281 9.3398438 16.013672 19.347656 26.021484">ploteo</tspan></text>

</g><g
         transform="scale(0.71941829)"
         id="g184"><path
           inkscape:connector-curvature="0"
           id="path186"
           style="fill:#ffffff;fill-opacity:1;fill-rule:nonzero;stroke:none"
           d="m 121.73,767 h 46.54 c 20.28,0 36.73,6.71997 36.73,15 0,8.28003 -16.45,15 -36.73,15 H 121.73 C 101.45,797 85,790.28003 85,782 c 0,-8.28003 16.45,-15 36.73,-15 z" /><path
           inkscape:connector-curvature="0"
           id="path188"
           style="fill:none;stroke:#000000;stroke-width:1;stroke-linecap:butt;stroke-linejoin:miter;stroke-miterlimit:10;stroke-dasharray:none;stroke-opacity:1"
           d="m 121.73,767 h 46.54 c 20.28,0 36.73,6.71997 36.73,15 0,8.28003 -16.45,15 -36.73,15 H 121.73 C 101.45,797 85,790.28003 85,782 c 0,-8.28003 16.45,-15 36.73,-15 z" /></g><g
         transform="matrix(0.71941829,0,0,0.71941829,92.804962,558.26862)"
         id="g190"><text
   id="text194"
   style="font-variant:normal;font-weight:normal;font-size:12px;font-family:Helvetica;-inkscape-font-specification:Helvetica;writing-mode:lr-tb;fill:#001933;fill-opacity:1;fill-rule:nonzero;stroke:none"
   transform="translate(0,11)"><tspan
     id="tspan192"
     sodipodi:role="line"
     y="0"
     x="0 6 12.673828 15.339844 18.005859 24.679688">salida</tspan></text>

</g><g
         transform="matrix(0.71941829,0,0,0.71941829,0.35970914,0.35970914)"
         id="g196"><path
           inkscape:connector-curvature="0"
           id="path198"
           style="fill:#000000;fill-opacity:1;fill-rule:nonzero;stroke:none"
           d="m 209,139.5 h 3 v 1 h -3 z m 6,0 h 3 v 1 h -3 z m 6,0 h 3 v 1 h -3 z m 6,0 h 3 v 1 h -3 z m 6,0 h 3 v 1 h -3 z m 6,0 h 3 v 1 h -3 z m 6,0 h 3 v 1 h -3 z m 6,0 h 3 v 1 h -3 z m 6,0 h 3 v 1 h -3 z m 6,0 h 3 v 1 h -3 z m 6,0 h 1 c 0.73309,0 1.42358,-0.0413 2.07147,-0.12399 l 0.12653,0.99197 C 271.50818,140.45599 270.77551,140.5 270,140.5 h -1 z m 5.76761,-0.80293 c 0.9136,-0.37288 1.69293,-0.87625 2.33801,-1.51015 l 0.70087,0.71326 c -0.7388,0.72601 -1.6258,1.30026 -2.66101,1.72276 z m 3.88086,-3.81285 c 0.33725,-0.79232 0.57437,-1.68891 0.7113,-2.68981 l 0.99079,0.13556 c -0.14902,1.0894 -0.4097,2.07137 -0.78199,2.94591 z M 279.5,129.12753 v -3 h 1 v 3 z m 0,-6 v -3 h 1 v 3 z m 0,-6 v -3 h 1 v 3 z m 0,-6 v -3 h 1 v 3 z m 0,-6 v -3 h 1 v 3 z m 0,-5.999997 v -3 h 1 v 3 z m 0,-6 v -3 h 1 v 3 z m 0,-6 v -3 h 1 v 3 z m 0,-6 v -3 h 1 v 3 z m 0,-6 v -3 h 1 v 3 z m 0,-6 v -3 h 1 v 3 z m 0,-6 v -3 h 1 v 3 z m 0,-6 v -3 h 1 v 3 z m 0,-6 V 50 c 0,-0.725674 0.0385,-1.414032 0.11566,-2.065075 l 0.99304,0.117638 C 280.53622,48.664444 280.5,49.313587 280.5,50 v 1.127533 z m 0.82437,-6.141125 c 0.40936,-1.047062 0.97049,-1.946262 1.68341,-2.697609 l 0.7254,0.688309 c -0.6231,0.656712 -1.1156,1.447857 -1.47747,2.373436 z m 4.27084,-4.498962 c 0.87186,-0.38683 1.85315,-0.659981 2.94388,-0.819454 l 0.14466,0.989479 c -1.00034,0.146255 -1.89466,0.394272 -2.68302,0.744053 z M 290.74493,39.5 h 3 v 1 h -3 z m 6,0 h 3 v 1 h -3 z m 6,0 h 3 v 1 h -3 z m 6,0 h 3 v 1 h -3 z m 6,0 h 3 v 1 h -3 z m 6,0 H 323.63 v 1 h -2.88507 z" /><path
           inkscape:connector-curvature="0"
           id="path200"
           style="fill:#000000;fill-opacity:1;fill-rule:nonzero;stroke:none"
           d="m 328.88,40 -7,3.5 1.75,-3.5 -1.75,-3.5 z" /><path
           inkscape:connector-curvature="0"
           id="path202"
           style="fill:none;stroke:#000000;stroke-width:1;stroke-linecap:butt;stroke-linejoin:miter;stroke-miterlimit:10;stroke-dasharray:none;stroke-opacity:1"
           d="m 328.88,40 -7,3.5 1.75,-3.5 -1.75,-3.5 z" /><path
           inkscape:connector-curvature="0"
           id="path204"
           style="fill:#000000;fill-opacity:1;fill-rule:nonzero;stroke:none"
           d="m 205,781.5 h 3 v 1 h -3 z m 6,0 h 3 v 1 h -3 z m 6,0 h 3 v 1 h -3 z m 6,0 h 3 v 1 h -3 z m 6,0 h 3 v 1 h -3 z m 6,0 h 3 v 1 h -3 z m 6,0 h 3 v 1 h -3 z m 6,0 h 3 v 1 h -3 z m 6,0 h 3 v 1 h -3 z m 6,0 h 3 v 1 h -3 z m 6,0 h 3 v 1 h -3 z m 6.06943,-0.0311 c 1.02972,-0.0617 1.96429,-0.21533 2.80368,-0.46087 l 0.2807,0.95984 c -0.91135,0.2666 -1.9195,0.43298 -3.02451,0.4992 l -0.0599,-0.99817 z m 5.34878,-1.6933 c 0.73133,-0.54498 1.3317,-1.2221 1.80115,-2.03125 l 0.86493,0.50184 c -0.53806,0.92749 -1.22754,1.70452 -2.06848,2.33117 z m 2.77994,-4.65533 c 0.19296,-0.89783 0.2934,-1.89124 0.30133,-2.98016 l 1,0.007 c -0.008,1.15741 -0.11633,2.21844 -0.32367,3.18317 l -0.97766,-0.21021 z M 279.5,769.12753 v -3 h 1 v 3 z m 0,-6 v -3 h 1 v 3 z m 0,-6 v -3 h 1 v 3 z m 0,-6 v -3 h 1 v 3 z m 0,-6 v -3 h 1 v 3 z m 0,-6 v -3 h 1 v 3 z m 0,-6 v -3 h 1 v 3 z m 0,-6 v -3 h 1 v 3 z m 0,-6 v -3 h 1 v 3 z m 0,-6 v -3 h 1 v 3 z m 0,-6 v -3 h 1 v 3 z m 0,-6 v -3 h 1 v 3 z m 0,-6 v -3 h 1 v 3 z m 0,-6 v -3 h 1 v 3 z m 0,-6 v -3 h 1 v 3 z m 0,-6 v -3 h 1 v 3 z m 0,-6 v -3 h 1 v 3 z m 0,-6 v -3 h 1 v 3 z m 0,-6 v -3 h 1 v 3 z m 0,-6 v -3 h 1 v 3 z m 0.025,-6.11621 c 0.0578,-1.11261 0.21564,-2.12854 0.47345,-3.04773 l 0.96283,0.27014 c -0.23779,0.84784 -0.38366,1.79096 -0.43762,2.82947 l -0.99866,-0.0519 z m 1.81861,-5.91919 c 0.61392,-0.85382 1.37829,-1.55627 2.29309,-2.10724 l 0.51599,0.85657 c -0.79752,0.48041 -1.46323,1.09192 -1.99719,1.83441 z m 5.20267,-3.24084 c 0.95651,-0.21588 2.00982,-0.33228 3.15988,-0.34918 l 0.0146,0.99987 c -1.08066,0.0158 -2.06547,0.12409 -2.95438,0.32477 l -0.22015,-0.97546 z m 6.19863,-0.35132 h 3 v 1 h -3 z m 6,0 h 3 v 1 h -3 z m 6,0 h 3 v 1 h -3 z m 6,0 h 3 v 1 h -3 z m 6.16056,0 h 2.91861 v 1 h -2.91861 z m 5.96444,0 h 1.49338 v 0.5 0.5 h -0.0433 -0.69001 v -1 h 0.69001 0.0433 c 0.33335,0 0.5,0.16669 0.5,0.5 0,0.33331 -0.16665,0.5 -0.5,0.5 h -1.49338 z" /><path
           inkscape:connector-curvature="0"
           id="path206"
           style="fill:#000000;fill-opacity:1;fill-rule:nonzero;stroke:none"
           d="m 328.88,640 -7,3.5 1.75,-3.5 -1.75,-3.5 z" /><path
           inkscape:connector-curvature="0"
           id="path208"
           style="fill:none;stroke:#000000;stroke-width:1;stroke-linecap:butt;stroke-linejoin:miter;stroke-miterlimit:10;stroke-dasharray:none;stroke-opacity:1"
           d="m 328.88,640 -7,3.5 1.75,-3.5 -1.75,-3.5 z" /><path
           inkscape:connector-curvature="0"
           id="path210"
           style="fill:#000000;fill-opacity:1;fill-rule:nonzero;stroke:none"
           d="m 240,524.5 h 3 v 1 h -3 z m 6,0 h 3 v 1 h -3 z m 6,0 h 3 v 1 h -3 z m 6,0 h 3 v 1 h -3 z m 6,0 h 3 v 1 h -3 z m 6,0 h 3 v 1 h -3 z m 6,0 c 1.09787,0 2.09985,-0.0927 3.00598,-0.27789 l 0.20026,0.97973 C 278.23407,525.40063 277.16531,525.5 276,525.5 Z m 5.63998,-1.22125 c 0.82053,-0.45838 1.50898,-1.04767 2.06528,-1.76789 l 0.79144,0.61121 c -0.63977,0.82831 -1.42944,1.50488 -2.36898,2.02972 z m 3.33655,-4.29987 c 0.25302,-0.83069 0.41434,-1.75665 0.48395,-2.77789 l 0.99768,0.068 c -0.0748,1.09729 -0.24982,2.09772 -0.52502,3.00128 l -0.95661,-0.29138 z M 285.5,513.1275 v -2.99997 h 1 v 2.99997 z m 0,-5.99997 v -3 h 1 v 3 z m 0,-6 v -3 h 1 v 3 z m 0,-6 v -3 h 1 v 3 z m 0,-6 v -3 h 1 v 3 z m 0,-6 v -3 h 1 v 3 z m 0,-6 v -3 h 1 v 3 z m 0,-6 v -3 h 1 v 3 z m 0,-6 v -3 h 1 v 3 z m 0,-6 v -3 h 1 v 3 z m 0,-6 v -3 h 1 v 3 z m 0.27319,-6.20858 c 0.2125,-1.09488 0.54889,-2.07041 1.00919,-2.92655 l 0.88074,0.47357 c -0.4123,0.76679 -0.71503,1.64795 -0.90824,2.64347 z m 2.99994,-5.33332 c 0.80322,-0.64279 1.75025,-1.13708 2.8411,-1.48288 l 0.30218,0.95325 c -0.97262,0.30838 -1.8121,0.74518 -2.51846,1.31039 z m 5.81922,-2.03375 C 295.04471,439.5173 295.51395,439.5 296,439.5 h 1.74493 v 1 H 296 c -0.46078,0 -0.9046,0.0163 -1.33142,0.0489 l -0.0762,-0.99707 z m 6.15258,-0.0519 h 3.00003 v 1 h -3.00003 z m 6,0 h 3 v 1 h -3 z m 6,0 h 3 v 1 h -3 z m 6,0 h 3 v 1 h -3 z" /><path
           inkscape:connector-curvature="0"
           id="path212"
           style="fill:#000000;fill-opacity:1;fill-rule:nonzero;stroke:none"
           d="m 329.88,440 -7,3.5 1.75,-3.5 -1.75,-3.5 z" /><path
           inkscape:connector-curvature="0"
           id="path214"
           style="fill:none;stroke:#000000;stroke-width:1;stroke-linecap:butt;stroke-linejoin:miter;stroke-miterlimit:10;stroke-dasharray:none;stroke-opacity:1"
           d="m 329.88,440 -7,3.5 1.75,-3.5 -1.75,-3.5 z" /></g><g
         transform="matrix(0.71941829,0,0,0.71941829,239.56628,22.301968)"
         id="g216"><text
   id="text220"
   style="font-variant:normal;font-weight:bold;font-size:40px;font-family:Helvetica;-inkscape-font-specification:Helvetica-Bold;writing-mode:lr-tb;fill:#000000;fill-opacity:1;fill-rule:nonzero;stroke:none"
   transform="translate(0.40625,38)"><tspan
     id="tspan218"
     sodipodi:role="line"
     y="0"
     x="0 26.679688 51.113281 64.433594 80 102.24609 126.67969 148.92578">Entradas</tspan></text>

</g><g
         transform="matrix(0.71941829,0,0,0.71941829,241.00513,59.71172)"
         id="g222"><text
   id="text226"
   style="font-variant:normal;font-weight:normal;font-size:20px;font-family:Helvetica;-inkscape-font-specification:Helvetica;writing-mode:lr-tb;fill:#000000;fill-opacity:1;fill-rule:nonzero;stroke:none"
   transform="translate(0.625,18)"><tspan
     id="tspan224"
     sodipodi:role="line"
     y="0"
     x="0 5.5566406 13.339844 18.896484 24.453125 28.896484 45.556641 56.679688 67.802734 78.925781 90.048828 95.605469">[*] imagen 1</tspan></text>

</g><g
         transform="matrix(0.71941829,0,0,0.71941829,241.00513,80.574844)"
         id="g228"><text
   id="text232"
   style="font-variant:normal;font-weight:normal;font-size:20px;font-family:Helvetica;-inkscape-font-specification:Helvetica;writing-mode:lr-tb;fill:#000000;fill-opacity:1;fill-rule:nonzero;stroke:none"
   transform="translate(0.625,18)"><tspan
     id="tspan230"
     sodipodi:role="line"
     y="0"
     x="0 5.5566406 13.339844 18.896484 24.453125 28.896484 45.556641 56.679688 67.802734 78.925781 90.048828 95.605469">[*] imagen 2</tspan></text>

</g><g
         transform="matrix(0.71941829,0,0,0.71941829,241.00513,102.15739)"
         id="g234"><text
   id="text238"
   style="font-variant:normal;font-weight:normal;font-size:20px;font-family:Helvetica;-inkscape-font-specification:Helvetica;writing-mode:lr-tb;fill:#000000;fill-opacity:1;fill-rule:nonzero;stroke:none"
   transform="translate(0.859375,18)"><tspan
     id="tspan236"
     sodipodi:role="line"
     y="0"
     x="0 5.5566406 13.339844 18.896484 24.453125 35.576172 46.699219 52.255859 63.378906 73.378906 78.935547 90.058594 96.71875">[*] detector </tspan></text>

</g><g
         transform="matrix(0.71941829,0,0,0.71941829,241.72455,121.58169)"
         id="g240"><text
   id="text244"
   style="font-variant:normal;font-weight:normal;font-size:20px;font-family:Helvetica;-inkscape-font-specification:Helvetica;writing-mode:lr-tb;fill:#000000;fill-opacity:1;fill-rule:nonzero;stroke:none"
   transform="translate(0.359375,18)"><tspan
     id="tspan242"
     sodipodi:role="line"
     y="0"
     x="0 5.5566406 13.339844 18.896484 24.453125 35.576172 46.699219 56.699219 66.699219 73.359375 77.802734 88.925781 94.482422 105.60547">[*] descriptor</tspan></text>

</g><g
         transform="matrix(0.71941829,0,0,0.71941829,241.72455,141.7254)"
         id="g246"><text
   id="text250"
   style="font-variant:normal;font-weight:normal;font-size:20px;font-family:Helvetica;-inkscape-font-specification:Helvetica;writing-mode:lr-tb;fill:#000000;fill-opacity:1;fill-rule:nonzero;stroke:none"
   transform="translate(0.140625,18)"><tspan
     id="tspan248"
     sodipodi:role="line"
     y="0"
     x="0 5.5566406 13.339844 18.896484 24.453125 41.113281 52.236328 57.792969 67.792969 78.916016 90.039062">[*] matcher</tspan></text>

</g><g
         transform="matrix(0.71941829,0,0,0.71941829,241.72455,161.86911)"
         id="g252"><text
   id="text256"
   style="font-variant:normal;font-weight:normal;font-size:20px;font-family:Helvetica;-inkscape-font-specification:Helvetica;writing-mode:lr-tb;fill:#000000;fill-opacity:1;fill-rule:nonzero;stroke:none"
   transform="translate(0.03125,18)"><tspan
     id="tspan254"
     sodipodi:role="line"
     y="0"
     x="0 5.5566406 11.113281 16.669922 22.226562 32.226562 43.349609 54.472656">[ ] show</tspan></text>

</g><g
         transform="matrix(0.71941829,0,0,0.71941829,239.56628,309.34985)"
         id="g258"><text
   id="text262"
   style="font-variant:normal;font-weight:bold;font-size:40px;font-family:Helvetica;-inkscape-font-specification:Helvetica-Bold;writing-mode:lr-tb;fill:#000000;fill-opacity:1;fill-rule:nonzero;stroke:none"
   transform="translate(0.109375,38)"><tspan
     id="tspan260"
     sodipodi:role="line"
     y="0"
     x="0 26.679688 42.246094 66.679688 88.925781 111.17188 133.41797 155.66406 191.23047 202.34375 224.58984 249.02344 262.34375">Procesamiento</tspan></text>

</g><g
         transform="matrix(0.71941829,0,0,0.71941829,238.84688,346.75961)"
         id="g264"><text
   id="text268"
   style="font-variant:normal;font-weight:normal;font-size:20px;font-family:Helvetica;-inkscape-font-specification:Helvetica;writing-mode:lr-tb;fill:#000000;fill-opacity:1;fill-rule:nonzero;stroke:none"
   transform="translate(0.953125,18)"><tspan
     id="tspan266"
     sodipodi:role="line"
     y="0"
     x="0 5.5566406 13.339844 18.896484 24.453125 35.576172 46.699219 52.255859 63.378906 73.378906 83.378906 87.822266 98.945312">[*] detección</tspan></text>

</g><g
         transform="matrix(0.71941829,0,0,0.71941829,239.56628,367.62274)"
         id="g270"><text
   id="text274"
   style="font-variant:normal;font-weight:normal;font-size:20px;font-family:Helvetica;-inkscape-font-specification:Helvetica;writing-mode:lr-tb;fill:#000000;fill-opacity:1;fill-rule:nonzero;stroke:none"
   transform="translate(0.3125,18)"><tspan
     id="tspan272"
     sodipodi:role="line"
     y="0"
     x="0 5.5566406 13.339844 18.896484">[*] ANMS</tspan></text>

</g><g
         transform="matrix(0.71941829,0,0,0.71941829,239.56628,389.20529)"
         id="g276"><text
   id="text280"
   style="font-variant:normal;font-weight:normal;font-size:20px;font-family:Helvetica;-inkscape-font-specification:Helvetica;writing-mode:lr-tb;fill:#000000;fill-opacity:1;fill-rule:nonzero;stroke:none"
   transform="translate(0.40625,18)"><tspan
     id="tspan278"
     sodipodi:role="line"
     y="0"
     x="0 5.5566406 13.339844 18.896484 24.453125 35.576172 46.699219 56.699219 66.699219 73.359375 77.802734 88.925781 98.925781 103.36914 114.49219 125.61523">[*] descripción </tspan></text>

</g><g
         transform="matrix(0.71941829,0,0,0.71941829,240.28571,408.62958)"
         id="g282"><text
   id="text286"
   style="font-variant:normal;font-weight:normal;font-size:20px;font-family:Helvetica;-inkscape-font-specification:Helvetica;writing-mode:lr-tb;fill:#000000;fill-opacity:1;fill-rule:nonzero;stroke:none"
   transform="translate(0.6875,18)"><tspan
     id="tspan284"
     sodipodi:role="line"
     y="0"
     x="0 5.5566406 13.339844 18.896484 24.453125 41.113281 52.236328 57.792969 67.792969 78.916016 83.359375 94.482422">[*] matching</tspan></text>

</g><g
         transform="matrix(0.71941829,0,0,0.71941829,238.84688,453.23352)"
         id="g288"><text
   id="text292"
   style="font-variant:normal;font-weight:bold;font-size:40px;font-family:Helvetica;-inkscape-font-specification:Helvetica-Bold;writing-mode:lr-tb;fill:#000000;fill-opacity:1;fill-rule:nonzero;stroke:none"
   transform="translate(0.453125,38)"><tspan
     id="tspan290"
     sodipodi:role="line"
     y="0"
     x="0 26.679688 48.925781 60.039062 71.152344 95.585938 117.83203">Salidas</tspan></text>

</g><g
         transform="matrix(0.71941829,0,0,0.71941829,239.56628,490.64328)"
         id="g294"><text
   id="text298"
   style="font-variant:normal;font-weight:normal;font-size:20px;font-family:Helvetica;-inkscape-font-specification:Helvetica;writing-mode:lr-tb;fill:#000000;fill-opacity:1;fill-rule:nonzero;stroke:none"
   transform="translate(0.203125,18)"><tspan
     id="tspan296"
     sodipodi:role="line"
     y="0"
     x="0 5.5566406 11.113281 16.669922 22.226562 26.669922 43.330078 54.453125 65.576172 76.699219 87.822266 93.378906 103.37891 114.50195 125.625 131.18164 136.73828 147.86133 158.98438 164.54102 175.66406 182.32422 193.44727 203.44727 209.00391 220.12695 231.25 236.80664 247.92969 257.92969 263.48633 274.60938 285.73242 296.85547 306.85547 312.41211 322.41211 327.96875 339.0918 355.75195 366.875 377.99805 384.6582 395.78125 400.22461 411.34766 422.4707 433.59375">[ ] imagen con features detectados y emparejados</tspan></text>

</g><g
         transform="matrix(0.71941829,0,0,0.71941829,239.56628,511.50641)"
         id="g300"><text
   id="text304"
   style="font-variant:normal;font-weight:normal;font-size:20px;font-family:Helvetica;-inkscape-font-specification:Helvetica;writing-mode:lr-tb;fill:#000000;fill-opacity:1;fill-rule:nonzero;stroke:none"
   transform="translate(0.4375,18)"><tspan
     id="tspan302"
     sodipodi:role="line"
     y="0"
     x="0 5.5566406 13.339844 18.896484 24.453125 34.453125 45.576172 56.699219 62.255859 66.699219 77.822266 88.945312 100.06836 105.625 116.74805 127.87109 133.42773 144.55078 155.67383 166.79688 172.35352 183.47656 193.47656 199.0332 210.15625 221.2793 231.2793 242.40234 253.52539 259.08203 265.74219 276.86523 287.98828 299.11133">[*] cantidad de puntos encontrados</tspan></text>

</g><g
         transform="matrix(0.71941829,0,0,0.71941829,239.56628,533.08893)"
         id="g306"><text
   id="text310"
   style="font-variant:normal;font-weight:normal;font-size:20px;font-family:Helvetica;-inkscape-font-specification:Helvetica;writing-mode:lr-tb;fill:#000000;fill-opacity:1;fill-rule:nonzero;stroke:none"
   transform="translate(0.265625,18)"><tspan
     id="tspan308"
     sodipodi:role="line"
     y="0"
     x="0 5.5566406 13.339844 18.896484 24.453125 30.009766 34.453125 45.576172 62.236328 73.359375 84.482422 90.039062 101.16211 112.28516 117.8418 128.96484 140.08789 145.64453 156.76758 166.76758 176.76758 181.21094 192.33398">[*] tiempo de detección</tspan></text>

</g><g
         transform="matrix(0.71941829,0,0,0.71941829,239.56628,552.51324)"
         id="g312"><text
   id="text316"
   style="font-variant:normal;font-weight:normal;font-size:20px;font-family:Helvetica;-inkscape-font-specification:Helvetica;writing-mode:lr-tb;fill:#000000;fill-opacity:1;fill-rule:nonzero;stroke:none"
   transform="translate(0.984375,18)"><tspan
     id="tspan314"
     sodipodi:role="line"
     y="0"
     x="0 5.5566406 13.339844 18.896484 24.453125 30.009766 34.453125 45.576172 62.236328 73.359375 84.482422 90.039062 101.16211 112.28516 117.8418 128.96484 140.08789 150.08789 160.08789 166.74805 171.19141 182.31445 192.31445 196.75781 207.88086">[*] tiempo de descripción</tspan></text>

</g><g
         transform="matrix(0.71941829,0,0,0.71941829,239.56628,572.65698)"
         id="g318"><text
   id="text322"
   style="font-variant:normal;font-weight:normal;font-size:20px;font-family:Helvetica;-inkscape-font-specification:Helvetica;writing-mode:lr-tb;fill:#000000;fill-opacity:1;fill-rule:nonzero;stroke:none"
   transform="translate(0.5,18)"><tspan
     id="tspan320"
     sodipodi:role="line"
     y="0"
     x="0 5.5566406 13.339844 18.896484 24.453125 30.009766 34.453125 45.576172 62.236328 73.359375 84.482422 90.039062 101.16211 112.28516 117.8418 134.50195 145.625 151.18164 161.18164 172.30469 176.74805 187.87109">[*] tiempo de matching</tspan></text>

</g><g
         transform="matrix(0.71941829,0,0,0.71941829,94.963211,21.582548)"
         id="g324"><text
   id="text328"
   style="font-variant:normal;font-weight:normal;font-size:12px;font-family:Helvetica;-inkscape-font-specification:Helvetica;writing-mode:lr-tb;fill:#000000;fill-opacity:1;fill-rule:nonzero;stroke:none"
   transform="translate(0.3125,18)"><tspan
     id="tspan326"
     sodipodi:role="line"
     y="0"
     x="0 2.6660156 9.3398438 12.005859 18.005859 20.671875">inicio</tspan></text>

</g></g></g></svg>