<?xml version="1.0" encoding="UTF-8" standalone="no"?>
<!-- Created with matplotlib (http://matplotlib.org/) -->

<svg
   xmlns:dc="http://purl.org/dc/elements/1.1/"
   xmlns:cc="http://creativecommons.org/ns#"
   xmlns:rdf="http://www.w3.org/1999/02/22-rdf-syntax-ns#"
   xmlns:svg="http://www.w3.org/2000/svg"
   xmlns="http://www.w3.org/2000/svg"
   xmlns:xlink="http://www.w3.org/1999/xlink"
   xmlns:sodipodi="http://sodipodi.sourceforge.net/DTD/sodipodi-0.dtd"
   xmlns:inkscape="http://www.inkscape.org/namespaces/inkscape"
   height="639pt"
   version="1.1"
   viewBox="0 0 1170 639"
   width="1170pt"
   id="svg499"
   sodipodi:docname="kitti_07.svg"
   inkscape:version="0.92.3 (unknown)">
  <metadata
     id="metadata503">
    <rdf:RDF>
      <cc:Work
         rdf:about="">
        <dc:format>image/svg+xml</dc:format>
        <dc:type
           rdf:resource="http://purl.org/dc/dcmitype/StillImage" />
      </cc:Work>
    </rdf:RDF>
  </metadata>
  <sodipodi:namedview
     pagecolor="#ffffff"
     bordercolor="#666666"
     borderopacity="1"
     objecttolerance="10"
     gridtolerance="10"
     guidetolerance="10"
     inkscape:pageopacity="0"
     inkscape:pageshadow="2"
     inkscape:window-width="1301"
     inkscape:window-height="744"
     id="namedview501"
     showgrid="false"
     inkscape:zoom="0.37051282"
     inkscape:cx="895.31188"
     inkscape:cy="302.43573"
     inkscape:window-x="65"
     inkscape:window-y="24"
     inkscape:window-maximized="1"
     inkscape:current-layer="svg499" />
  <defs
     id="defs4">
    <style
       type="text/css"
       id="style2">
*{stroke-linecap:butt;stroke-linejoin:round;stroke-miterlimit:100000;}
  </style>
  </defs>
  <g
     style="stroke-linecap:butt;stroke-linejoin:round;stroke-miterlimit:100000"
     id="axes_1">
    <g
       style="stroke-linecap:butt;stroke-linejoin:round;stroke-miterlimit:100000"
       id="patch_2">
      <path
         inkscape:connector-curvature="0"
         id="path9"
         style="fill:#ffffff;stroke-linecap:butt;stroke-linejoin:round;stroke-miterlimit:100000"
         d="m 344.48625,575.1 h 511.2 V 63.9 h -511.2 z" />
    </g>
    <g
       style="stroke-linecap:butt;stroke-linejoin:round;stroke-miterlimit:100000"
       id="line2d_1">
      <path
         inkscape:connector-curvature="0"
         id="path12"
         style="fill:none;stroke:#ff0000;stroke-width:1.5;stroke-linecap:square;stroke-linejoin:round;stroke-miterlimit:100000"
         d="m 753.44625,370.62 -0.16922,-1.56824 -0.30633,-1.34692 -0.59284,-1.52823 -0.91253,-1.58962 -1.21806,-1.54557 -1.2747,-1.04206 -0.97192,-0.66434 -1.12948,-0.58002 -1.27073,-0.47611 -1.426,-0.36095 -2.38633,-0.34332 -2.67405,-0.0456 -2.93535,0.1439 -6.73721,0.67021 -18.47208,1.76661 -21.9668,1.81974 -27.24281,2.27194 -10.01277,0.85926 -27.707,2.72337 -5.12396,0.29869 -3.44625,-0.0642 -2.05586,-0.2501 -1.88453,-0.39793 -1.77225,-0.58172 -1.63203,-0.79782 -1.52457,-0.95714 -1.41751,-1.11056 -1.79497,-1.88915 -1.07984,-1.41183 -0.99864,-1.65064 -0.86677,-1.84982 -1.13341,-3.12613 -0.93466,-3.52202 -1.10838,-5.19499 -0.85381,-5.72035 -0.82248,-7.73157 -0.65908,-7.8712 -2.67355,-37.87292 -2.46188,-31.6014 -1.05743,-13.6891 -0.80863,-8.27253 -0.97427,-8.09947 -1.56413,-9.36711 -1.52086,-7.57911 -1.48771,-5.96654 -1.70717,-5.84502 -1.99574,-5.79261 -1.65936,-4.30247 -2.44564,-5.7201 -7.47317,-15.52208 -4.40076,-8.28266 -4.52514,-7.89947 -5.61408,-9.40608 -4.41176,-7.029 -2.26298,-3.14961 -1.4788,-1.89042 -1.37533,-1.34139 -1.78163,-1.31317 -1.55507,-0.82875 -1.6565,-0.61181 -2.03887,-0.46069 -1.23751,-0.137 -1.39885,-0.0466 -2.21084,0.23024 -1.6207,0.31572 -2.51899,0.83346 -2.67072,1.31685 -1.87712,1.13732 -3.91723,2.84861 -4.29898,3.34979 -9.62897,7.933 -9.49809,8.0649 -88.02701,74.22814 -21.91841,18.09133 -6.11027,5.42868 -3.52463,3.5777 -1.50763,1.84507 -1.30376,1.88279 -1.54873,2.88711 -0.97783,2.92709 -0.54964,2.94738 -0.16522,1.96664 0.34312,3.85901 0.4476,1.83016 0.60056,1.71996 0.77232,1.69042 1.98448,3.31947 1.72909,2.3993 3.24059,4.0857 6.10741,7.32977 26.9247,32.35337 9.47561,11.82385 6.93453,8.72279 2.13845,2.9391 2.93531,4.52452 1.72008,3.11052 1.50845,3.20109 1.27289,3.22757 1.08886,3.30346 0.88396,3.38615 1.1042,5.22511 0.84163,5.38476 0.62285,5.61964 1.07291,9.74106 2.83838,25.23925 2.07936,21.33287 1.15572,14.59873 2.52554,34.08536 1.76486,21.91641 0.24906,7.54562 -0.01,7.27917 -0.26603,7.25486 0.0102,2.27854 0.33515,2.52824 0.0231,0.008 -0.0172,-0.007 v 0 l -0.12882,0.0571 -0.10061,0.27416 0.16992,0.79322 1.07782,2.50065 0.70995,1.15235 0.65004,0.81035 1.33976,1.39883 1.1913,1.0233 1.44526,1.07566 1.77366,1.01549 3.12262,1.35646 2.40816,0.68742 2.63758,0.51368 2.85414,0.33265 4.67727,0.29647 5.1073,0.12085 5.5138,-0.11457 16.70806,-0.72642 16.51483,-1.33942 38.83361,-3.12652 16.51794,-1.22469 13.881,-1.08062 51.45312,-4.54631 36.73201,-2.89535 18.90291,-1.41633 32.0705,-2.34257 5.91758,-0.70792 3.91793,-0.68624 3.5184,-0.85092 3.23352,-1.03171 1.99039,-0.81544 1.87274,-0.9191 1.77094,-1.06604 1.57548,-1.27027 1.41589,-1.37024 1.25511,-1.49779 1.50952,-2.4747 0.84721,-1.7719 0.86029,-2.82001 0.43272,-1.94425 0.39887,-3.04915 0.34778,-4.306 0.11089,-4.74508 -0.07,-3.91315 -0.5466,-11.814 -0.62559,-9.37856 -1.71921,-21.6815 -1.19302,-17.91143 -3.58076,-51.10886 -0.52098,-5.07302 -0.1915,-4.49089 -0.13696,-6.44368 0.0966,-1.65706 0.21503,-3.23143 -0.21429,-3.07971 -0.2401,-1.5007 -0.69294,-2.82735 -0.92861,-3.37842 -0.51357,-2.98812 -0.0176,0.0777"
         clip-path="url(#p905af1c735)" />
    </g>
    <g
       style="stroke-linecap:butt;stroke-linejoin:round;stroke-miterlimit:100000"
       id="line2d_2">
      <path
         inkscape:connector-curvature="0"
         id="path15"
         style="fill:none;stroke:#ff0000;stroke-linecap:square;stroke-linejoin:round;stroke-miterlimit:100000"
         d="M 753.44625,370.62"
         clip-path="url(#p905af1c735)" />
      <defs
         id="defs18">
        <path
           inkscape:connector-curvature="0"
           style="stroke:#000000;stroke-width:0.5;stroke-linecap:butt;stroke-linejoin:miter;stroke-miterlimit:100000"
           id="mf8172fa079"
           d="M 0,4 4,-4 H -4 Z" />
      </defs>
      <g
         style="stroke-linecap:butt;stroke-linejoin:round;stroke-miterlimit:100000"
         id="g22"
         clip-path="url(#p905af1c735)">
        <use
           height="100%"
           width="100%"
           id="use20"
           y="370.62"
           xlink:href="#mf8172fa079"
           x="753.44623"
           style="fill:#ff0000;stroke:#000000;stroke-width:0.5;stroke-linecap:butt;stroke-linejoin:miter;stroke-miterlimit:100000" />
      </g>
    </g>
    <g
       style="stroke-linecap:butt;stroke-linejoin:round;stroke-miterlimit:100000"
       id="line2d_3">
      <path
         inkscape:connector-curvature="0"
         id="path25"
         style="fill:none;stroke:#0072bd;stroke-width:1.5;stroke-linecap:square;stroke-linejoin:round;stroke-miterlimit:100000"
         d="m 753.44625,370.62 -0.3466,-2.19744 -0.53842,-1.42604 -0.70423,-1.53496 -0.97248,-1.49942 -0.60483,-0.72633 -1.21186,-1.0486 -0.95337,-0.69198 -1.11433,-0.61708 -1.25791,-0.50446 -1.39659,-0.36982 -1.57154,-0.27932 -1.59031,-0.0912 -3.75692,0.11785 -7.644,0.77911 -9.35705,0.99661 -4.47932,0.45241 -4.73902,0.45434 -21.9632,1.99108 -30.65698,2.85847 -6.69082,0.62771 -31.76143,3.2774 -3.58726,0.0557 -2.23555,-0.13838 -2.01674,-0.3145 -1.87636,-0.45277 -1.69898,-0.65463 -1.62949,-0.82088 -1.53898,-0.99134 -1.32965,-1.20399 -1.82652,-1.96974 -1.06465,-1.54171 -0.94689,-1.7812 -0.8367,-1.96305 -1.1176,-3.34799 -0.94534,-3.73536 -1.11274,-5.43684 -0.90047,-5.90684 -1.02439,-9.4541 -1.52554,-17.21692 -2.82856,-35.94551 -1.68274,-21.26427 -1.07274,-13.76066 -0.85557,-8.30358 -1.008,-8.13474 -1.48996,-9.44023 -1.15548,-6.1075 -1.47972,-6.00892 -1.22939,-4.31776 -1.4354,-4.39116 -2.13708,-5.74339 -2.367,-5.76419 -2.55554,-5.72547 -2.63543,-5.70431 -2.72984,-5.63078 -3.60948,-6.98132 -4.43195,-8.06185 -6.3682,-11.01271 -5.56373,-8.9425 -2.50822,-3.5751 -1.04679,-1.2907 -1.3061,-1.24464 -2.07937,-1.58982 -1.9894,-0.91804 -1.26977,-0.44091 -1.66325,-0.22173 -1.15679,-0.0964 -2.97859,0.16732 -2.47539,0.51295 -1.75388,0.60884 -1.80076,0.81479 -1.8366,1.06771 -2.86967,1.99812 -9.63663,7.79941 -7.49306,6.369 -32.75063,28.39183 -15.30283,13.53765 -7.57357,6.64249 -6.16441,5.28794 -8.96959,7.87275 -7.43791,6.54368 -44.15526,38.40782 -2.75759,2.71876 -2.45429,2.71339 -1.38723,1.87963 -1.19488,1.93334 -0.94004,1.89542 -0.68083,1.91809 -0.69503,2.79868 -0.26707,1.92365 -0.0237,1.98317 0.28736,2.89226 0.42026,1.81743 0.61838,1.67998 0.7485,1.66026 1.51403,2.46321 1.14371,1.597 3.90781,4.85625 24.51057,28.45523 6.16915,7.25511 2.52993,2.963 6.18635,7.35911 8.6168,10.19878 4.68727,5.76599 2.14983,3.02914 2.03177,2.98779 1.92987,3.32569 1.716,3.24726 1.36668,3.29819 1.70962,5.11791 1.29171,5.24153 0.77987,3.55472 0.64377,3.62706 0.79624,5.63156 0.74274,5.83331 2.02796,14.21453 3.46021,25.585 1.05395,8.4903 1.76582,16.6249 4.03432,41.82314 1.00583,9.10707 0.56366,6.71734 0.29314,8.6826 0.006,5.68005 -0.12352,4.2643 0.29954,5.37932 0.0743,0.99929 0.89163,2.21227 0.75324,1.50981 1.21725,1.81272 1.10751,1.23064 1.02995,0.93063 1.36247,1.02731 1.70931,1.03721 1.95852,0.93937 2.20851,0.79372 2.47057,0.6019 2.6752,0.40987 2.87582,0.18395 4.73933,0.0783 5.12204,-0.0818 5.61831,-0.30856 8.10218,-0.69701 8.82057,-0.66273 90.51567,-9.60934 9.11899,-1.08107 11.1171,-1.45689 24.37216,-2.65511 15.43101,-1.6094 10.85456,-1.13382 39.92385,-4.24348 23.89994,-2.47718 7.30896,-1.15856 2.61575,-0.48565 3.7092,-0.95221 4.30087,-1.53559 1.94879,-0.91474 1.812,-1.03141 1.53915,-1.03046 2.11267,-2.01118 1.2212,-1.45996 1.57913,-2.53933 0.7809,-1.79484 0.74296,-2.76819 0.32133,-1.88869 0.33178,-4.10876 0.18587,-5.68055 -0.0589,-2.55102 -0.36841,-5.19696 -1.30962,-15.09902 -2.41683,-20.37675 -2.4685,-21.54798 -0.98792,-8.98778 -2.33624,-19.08988 -1.64291,-13.65618 -1.11511,-9.28185 -0.74924,-4.24833 -0.67191,-5.69397 -0.75892,-10.53734 -0.0165,-2.41413 -0.28946,-2.29147 -0.39248,-2.23355 -1.07636,-3.45228 -1.16513,-3.87017 -0.59719,-2.47307 5.6e-4,0.007"
         clip-path="url(#p905af1c735)" />
    </g>
    <g
       style="stroke-linecap:butt;stroke-linejoin:round;stroke-miterlimit:100000"
       id="line2d_4">
      <path
         inkscape:connector-curvature="0"
         id="path28"
         style="fill:none;stroke:#0072bd;stroke-linecap:square;stroke-linejoin:round;stroke-miterlimit:100000"
         d="M 753.44625,370.62"
         clip-path="url(#p905af1c735)" />
      <defs
         id="defs31">
        <path
           inkscape:connector-curvature="0"
           style="stroke:#000000;stroke-width:0.5;stroke-linecap:butt;stroke-linejoin:miter;stroke-miterlimit:100000"
           id="m99123ceeea"
           d="M 0,4 4,-4 H -4 Z" />
      </defs>
      <g
         style="stroke-linecap:butt;stroke-linejoin:round;stroke-miterlimit:100000"
         id="g35"
         clip-path="url(#p905af1c735)">
        <use
           height="100%"
           width="100%"
           id="use33"
           y="370.62"
           xlink:href="#m99123ceeea"
           x="753.44623"
           style="fill:#0072bd;stroke:#000000;stroke-width:0.5;stroke-linecap:butt;stroke-linejoin:miter;stroke-miterlimit:100000" />
      </g>
    </g>
    <g
       style="stroke-linecap:butt;stroke-linejoin:round;stroke-miterlimit:100000"
       id="line2d_5">
      <path
         inkscape:connector-curvature="0"
         id="path38"
         style="fill:none;stroke:#d95319;stroke-width:1.5;stroke-linecap:square;stroke-linejoin:round;stroke-miterlimit:100000"
         d="m 753.44625,370.62 -0.16326,-1.2538 -0.40439,-1.62628 -0.81829,-1.88358 -0.64119,-1.11986 -0.82422,-1.19562 -1.09138,-1.02173 -1.37681,-0.99609 -1.10631,-0.61781 -1.97043,-0.724 -2.29145,-0.46151 -2.4342,-0.0566 -2.84735,0.11749 -6.53178,0.64836 -15.05995,1.57929 -11.29065,1.02175 -10.26033,0.91243 -45.64698,4.25959 -24.43821,2.59789 -6.33318,0.35073 -2.28534,-0.0492 -3.09558,-0.36876 -2.7531,-0.78472 -1.65094,-0.73537 -1.6066,-0.91828 -1.43977,-1.10692 -1.92485,-1.90333 -1.12215,-1.42554 -1.05294,-1.70728 -0.85826,-1.86146 -1.59544,-4.41676 -1.51583,-6.31087 -0.97198,-5.636 -0.62822,-4.56084 -1.37968,-14.22107 -2.76441,-34.81282 -4.41822,-52.04994 -0.9551,-8.19541 -0.93755,-6.36035 -1.03233,-6.28378 -0.86113,-4.58241 -0.96375,-4.52652 -1.59517,-5.8851 -1.36401,-4.40248 -1.52588,-4.3126 -2.24191,-5.73997 -3.13661,-7.19706 -4.68422,-9.93367 -5.00575,-9.7732 -4.47506,-8.07555 -7.12582,-12.11993 -4.43177,-7.14155 -3.33116,-4.75339 -1.3667,-1.4972 -1.31116,-1.1008 -1.04631,-0.80175 -2.68828,-1.48817 -1.95641,-0.56108 -2.50438,-1.5e-4 -2.2619,0.17771 -1.56551,0.32489 -2.63478,0.85763 -1.79242,0.83328 -5.6487,3.96965 -9.92947,8.14564 -10.40657,8.92478 -45.25493,39.82523 -9.17492,8.06273 -14.93215,13.17969 -21.70707,19.0621 -12.03216,10.48676 -15.70965,13.8212 -2.67797,2.71961 -1.58173,1.83534 -1.3692,1.89063 -1.66413,2.88386 -0.8161,1.94745 -0.59678,1.89461 -0.39769,1.897 -0.2849,1.97018 0.0577,2.94727 0.20147,1.96344 0.44979,1.82493 0.97729,2.57926 0.8964,1.64848 2.18073,3.21156 5.34606,6.46665 2.28339,2.63417 14.06558,16.16192 11.77637,13.65729 5.05782,5.92205 3.74881,4.43651 12.30479,14.44628 4.49816,5.82113 2.97057,4.52798 1.74341,3.20647 1.52725,3.3214 1.84089,5.04666 0.98347,3.40091 1.63644,6.99038 1.24214,7.3677 3.71117,26.16241 1.23969,8.53582 3.05442,23.46045 1.38016,12.49254 2.37072,24.40541 3.63079,33.7139 0.37436,7.63924 0.053,9.34169 -0.13276,1.78978 0.0606,1.38784 0.18971,1.1069 0.21665,1.53146 -0.10899,0.72968 0.0577,1.50289 0.0593,0.84256 0.10285,0.72827 0.13297,0.74524 -0.0338,-0.009 -0.0263,0.0138 0.0295,0.015 v 0 l 0.0183,-0.0302 -0.0109,0.0133 v 0 l -0.0376,-0.003 0.0189,0.0171 v 0 l 0.0214,-0.0387 -0.0174,0.0375 v 0 l -0.0137,0.0687 0.2018,0.2854 0.51791,1.07525 1.71859,2.93019 0.99433,1.17746 1.43891,1.37266 2.15608,1.53694 1.85687,1.01502 2.0937,0.86313 2.31831,0.68231 2.59451,0.50189 2.75562,0.25768 4.58797,0.13883 6.79908,-0.10841 3.6284,-0.23991 7.81038,-0.68018 4.35795,-0.26863 15.76503,-1.58924 26.90982,-2.99017 19.37323,-2.06096 37.35456,-4.20726 29.02614,-3.7089 6.65092,-0.71312 19.73425,-2.08084 57.13315,-6.25954 13.24623,-1.31972 5.10614,-0.53745 8.91611,-1.40673 2.51916,-0.52188 3.48163,-0.96579 3.28176,-1.12427 2.96352,-1.38427 2.6063,-1.52937 2.18724,-1.86513 1.28146,-1.40383 1.15662,-1.60498 0.97213,-1.69337 0.79792,-1.8085 0.52308,-1.85809 0.52953,-2.79541 0.21986,-3.00416 0.24725,-5.57475 -0.24088,-6.22275 -2.45062,-25.74144 -2.70785,-21.65557 -2.93668,-26.3569 -1.39934,-10.81987 -0.93918,-7.39553 -2.52522,-20.24879 -0.70023,-4.1824 -1.19442,-14.08003 -0.24386,-4.76241 -0.53851,-2.96927 -1.03055,-3.44338 -1.25544,-3.92445 -0.55931,-2.43289 0.0245,0.025"
         clip-path="url(#p905af1c735)" />
    </g>
    <g
       style="stroke-linecap:butt;stroke-linejoin:round;stroke-miterlimit:100000"
       id="line2d_6">
      <path
         inkscape:connector-curvature="0"
         id="path41"
         style="fill:none;stroke:#d95319;stroke-linecap:square;stroke-linejoin:round;stroke-miterlimit:100000"
         d="M 753.44625,370.62"
         clip-path="url(#p905af1c735)" />
      <defs
         id="defs44">
        <path
           inkscape:connector-curvature="0"
           style="stroke:#000000;stroke-width:0.5;stroke-linecap:butt;stroke-linejoin:miter;stroke-miterlimit:100000"
           id="m61df10a0eb"
           d="M 0,4 4,-4 H -4 Z" />
      </defs>
      <g
         style="stroke-linecap:butt;stroke-linejoin:round;stroke-miterlimit:100000"
         id="g48"
         clip-path="url(#p905af1c735)">
        <use
           height="100%"
           width="100%"
           id="use46"
           y="370.62"
           xlink:href="#m61df10a0eb"
           x="753.44623"
           style="fill:#d95319;stroke:#000000;stroke-width:0.5;stroke-linecap:butt;stroke-linejoin:miter;stroke-miterlimit:100000" />
      </g>
    </g>
    <g
       style="stroke-linecap:butt;stroke-linejoin:round;stroke-miterlimit:100000"
       id="patch_3">
      <path
         inkscape:connector-curvature="0"
         id="path51"
         style="fill:none;stroke:#000000;stroke-linecap:square;stroke-linejoin:miter;stroke-miterlimit:100000"
         d="m 344.48625,63.9 h 511.2" />
    </g>
    <g
       style="stroke-linecap:butt;stroke-linejoin:round;stroke-miterlimit:100000"
       id="patch_4">
      <path
         inkscape:connector-curvature="0"
         id="path54"
         style="fill:none;stroke:#000000;stroke-linecap:square;stroke-linejoin:miter;stroke-miterlimit:100000"
         d="M 855.68625,575.1 V 63.9" />
    </g>
    <g
       style="stroke-linecap:butt;stroke-linejoin:round;stroke-miterlimit:100000"
       id="patch_5">
      <path
         inkscape:connector-curvature="0"
         id="path57"
         style="fill:none;stroke:#000000;stroke-linecap:square;stroke-linejoin:miter;stroke-miterlimit:100000"
         d="m 344.48625,575.1 h 511.2" />
    </g>
    <g
       style="stroke-linecap:butt;stroke-linejoin:round;stroke-miterlimit:100000"
       id="patch_6">
      <path
         inkscape:connector-curvature="0"
         id="path60"
         style="fill:none;stroke:#000000;stroke-linecap:square;stroke-linejoin:miter;stroke-miterlimit:100000"
         d="M 344.48625,575.1 V 63.9" />
    </g>
    <g
       style="stroke-linecap:butt;stroke-linejoin:round;stroke-miterlimit:100000"
       id="matplotlib.axis_1">
      <g
         style="stroke-linecap:butt;stroke-linejoin:round;stroke-miterlimit:100000"
         id="xtick_1">
        <g
           style="stroke-linecap:butt;stroke-linejoin:round;stroke-miterlimit:100000"
           id="line2d_7">
          <defs
             id="defs64">
            <path
               inkscape:connector-curvature="0"
               style="stroke:#000000;stroke-width:0.5;stroke-linecap:butt;stroke-linejoin:round;stroke-miterlimit:100000"
               id="ma162898994"
               d="M 0,0 V -4" />
          </defs>
          <g
             style="stroke-linecap:butt;stroke-linejoin:round;stroke-miterlimit:100000"
             id="g68">
            <use
               height="100%"
               width="100%"
               id="use66"
               y="575.09998"
               xlink:href="#ma162898994"
               x="344.48624"
               style="stroke:#000000;stroke-width:0.5;stroke-linecap:butt;stroke-linejoin:round;stroke-miterlimit:100000" />
          </g>
        </g>
        <g
           style="stroke-linecap:butt;stroke-linejoin:round;stroke-miterlimit:100000"
           id="line2d_8">
          <defs
             id="defs72">
            <path
               inkscape:connector-curvature="0"
               style="stroke:#000000;stroke-width:0.5;stroke-linecap:butt;stroke-linejoin:round;stroke-miterlimit:100000"
               id="m444f6e8e4b"
               d="M 0,0 V 4" />
          </defs>
          <g
             style="stroke-linecap:butt;stroke-linejoin:round;stroke-miterlimit:100000"
             id="g76">
            <use
               height="100%"
               width="100%"
               id="use74"
               y="63.900002"
               xlink:href="#m444f6e8e4b"
               x="344.48624"
               style="stroke:#000000;stroke-width:0.5;stroke-linecap:butt;stroke-linejoin:round;stroke-miterlimit:100000" />
          </g>
        </g>
        <g
           style="stroke-linecap:butt;stroke-linejoin:round;stroke-miterlimit:100000"
           id="text_1">
          <!-- −200 -->
          <defs
             id="defs82">
            <path
               style="stroke-linecap:butt;stroke-linejoin:round;stroke-miterlimit:100000"
               inkscape:connector-curvature="0"
               id="BitstreamVeraSans-Roman-2212"
               d="M 10.59375,35.5 H 73.1875 V 27.203125 H 10.59375 Z" />
            <path
               style="stroke-linecap:butt;stroke-linejoin:round;stroke-miterlimit:100000"
               inkscape:connector-curvature="0"
               id="BitstreamVeraSans-Roman-32"
               d="M 19.1875,8.296875 H 53.609375 V 0 H 7.328125 v 8.296875 q 5.609375,5.8125 15.296875,15.59375 9.703125,9.796875 12.1875,12.640625 4.734375,5.3125 6.609375,9 1.890625,3.6875 1.890625,7.25 0,5.8125 -4.078125,9.46875 -4.078125,3.671875 -10.625,3.671875 -4.640625,0 -9.796875,-1.609375 -5.140625,-1.609375 -11,-4.890625 v 9.96875 Q 13.765625,71.78125 18.9375,73 q 5.1875,1.21875 9.484375,1.21875 11.328125,0 18.0625,-5.671875 6.734375,-5.65625 6.734375,-15.125 0,-4.5 -1.6875,-8.53125 Q 49.859375,40.875 45.40625,35.40625 44.1875,33.984375 37.640625,27.21875 31.109375,20.453125 19.1875,8.296875" />
            <path
               style="stroke-linecap:butt;stroke-linejoin:round;stroke-miterlimit:100000"
               inkscape:connector-curvature="0"
               id="BitstreamVeraSans-Roman-30"
               d="m 31.78125,66.40625 q -7.609375,0 -11.453125,-7.5 Q 16.5,51.421875 16.5,36.375 q 0,-14.984375 3.828125,-22.484375 3.84375,-7.5 11.453125,-7.5 7.671875,0 11.5,7.5 3.84375,7.5 3.84375,22.484375 0,15.046875 -3.84375,22.53125 -3.828125,7.5 -11.5,7.5 m 0,7.8125 q 12.265625,0 18.734375,-9.703125 6.46875,-9.6875 6.46875,-28.140625 0,-18.40625 -6.46875,-28.109375 -6.46875,-9.6875 -18.734375,-9.6875 -12.25,0 -18.71875,9.6875 Q 6.59375,17.96875 6.59375,36.375 q 0,18.453125 6.46875,28.140625 6.46875,9.703125 18.71875,9.703125" />
          </defs>
          <g
             style="stroke-linecap:butt;stroke-linejoin:round;stroke-miterlimit:100000"
             id="g92"
             transform="matrix(0.12,0,0,-0.12,328.00594,588.21812)">
            <use
               height="100%"
               width="100%"
               y="0"
               x="0"
               style="stroke-linecap:butt;stroke-linejoin:round;stroke-miterlimit:100000"
               id="use84"
               xlink:href="#BitstreamVeraSans-Roman-2212" />
            <use
               height="100%"
               width="100%"
               y="0"
               style="stroke-linecap:butt;stroke-linejoin:round;stroke-miterlimit:100000"
               id="use86"
               xlink:href="#BitstreamVeraSans-Roman-32"
               x="83.789062" />
            <use
               height="100%"
               width="100%"
               y="0"
               style="stroke-linecap:butt;stroke-linejoin:round;stroke-miterlimit:100000"
               id="use88"
               xlink:href="#BitstreamVeraSans-Roman-30"
               x="147.41211" />
            <use
               height="100%"
               width="100%"
               y="0"
               style="stroke-linecap:butt;stroke-linejoin:round;stroke-miterlimit:100000"
               id="use90"
               xlink:href="#BitstreamVeraSans-Roman-30"
               x="211.03516" />
          </g>
        </g>
      </g>
      <g
         style="stroke-linecap:butt;stroke-linejoin:round;stroke-miterlimit:100000"
         id="xtick_2">
        <g
           style="stroke-linecap:butt;stroke-linejoin:round;stroke-miterlimit:100000"
           id="line2d_9">
          <g
             style="stroke-linecap:butt;stroke-linejoin:round;stroke-miterlimit:100000"
             id="g98">
            <use
               height="100%"
               width="100%"
               id="use96"
               y="575.09998"
               xlink:href="#ma162898994"
               x="446.72626"
               style="stroke:#000000;stroke-width:0.5;stroke-linecap:butt;stroke-linejoin:round;stroke-miterlimit:100000" />
          </g>
        </g>
        <g
           style="stroke-linecap:butt;stroke-linejoin:round;stroke-miterlimit:100000"
           id="line2d_10">
          <g
             style="stroke-linecap:butt;stroke-linejoin:round;stroke-miterlimit:100000"
             id="g103">
            <use
               height="100%"
               width="100%"
               id="use101"
               y="63.900002"
               xlink:href="#m444f6e8e4b"
               x="446.72626"
               style="stroke:#000000;stroke-width:0.5;stroke-linecap:butt;stroke-linejoin:round;stroke-miterlimit:100000" />
          </g>
        </g>
        <g
           style="stroke-linecap:butt;stroke-linejoin:round;stroke-miterlimit:100000"
           id="text_2">
          <!-- −150 -->
          <defs
             id="defs108">
            <path
               style="stroke-linecap:butt;stroke-linejoin:round;stroke-miterlimit:100000"
               inkscape:connector-curvature="0"
               id="BitstreamVeraSans-Roman-31"
               d="m 12.40625,8.296875 h 16.109375 v 55.625 L 10.984375,60.40625 v 8.984375 l 17.4375,3.515625 H 38.28125 V 8.296875 H 54.390625 V 0 H 12.40625 Z" />
            <path
               style="stroke-linecap:butt;stroke-linejoin:round;stroke-miterlimit:100000"
               inkscape:connector-curvature="0"
               id="BitstreamVeraSans-Roman-35"
               d="m 10.796875,72.90625 h 38.71875 v -8.3125 h -29.6875 V 46.734375 q 2.140625,0.734375 4.28125,1.09375 2.15625,0.359375 4.3125,0.359375 Q 40.625,48.1875 47.75,41.5 54.890625,34.8125 54.890625,23.390625 54.890625,11.625 47.5625,5.09375 40.234375,-1.421875 26.90625,-1.421875 q -4.59375,0 -9.359375,0.78125 -4.75,0.78125 -9.828125,2.34375 V 11.625 q 4.390625,-2.390625 9.078125,-3.5625 4.6875,-1.171875 9.90625,-1.171875 8.453125,0 13.375,4.4375 4.9375,4.4375 4.9375,12.0625 0,7.609375 -4.9375,12.046875 -4.921875,4.453125 -13.375,4.453125 -3.953125,0 -7.890625,-0.875 -3.921875,-0.875 -8.015625,-2.734375 z" />
          </defs>
          <g
             style="stroke-linecap:butt;stroke-linejoin:round;stroke-miterlimit:100000"
             id="g118"
             transform="matrix(0.12,0,0,-0.12,430.24594,588.21812)">
            <use
               height="100%"
               width="100%"
               y="0"
               x="0"
               style="stroke-linecap:butt;stroke-linejoin:round;stroke-miterlimit:100000"
               id="use110"
               xlink:href="#BitstreamVeraSans-Roman-2212" />
            <use
               height="100%"
               width="100%"
               y="0"
               style="stroke-linecap:butt;stroke-linejoin:round;stroke-miterlimit:100000"
               id="use112"
               xlink:href="#BitstreamVeraSans-Roman-31"
               x="83.789062" />
            <use
               height="100%"
               width="100%"
               y="0"
               style="stroke-linecap:butt;stroke-linejoin:round;stroke-miterlimit:100000"
               id="use114"
               xlink:href="#BitstreamVeraSans-Roman-35"
               x="147.41211" />
            <use
               height="100%"
               width="100%"
               y="0"
               style="stroke-linecap:butt;stroke-linejoin:round;stroke-miterlimit:100000"
               id="use116"
               xlink:href="#BitstreamVeraSans-Roman-30"
               x="211.03516" />
          </g>
        </g>
      </g>
      <g
         style="stroke-linecap:butt;stroke-linejoin:round;stroke-miterlimit:100000"
         id="xtick_3">
        <g
           style="stroke-linecap:butt;stroke-linejoin:round;stroke-miterlimit:100000"
           id="line2d_11">
          <g
             style="stroke-linecap:butt;stroke-linejoin:round;stroke-miterlimit:100000"
             id="g124">
            <use
               height="100%"
               width="100%"
               id="use122"
               y="575.09998"
               xlink:href="#ma162898994"
               x="548.96625"
               style="stroke:#000000;stroke-width:0.5;stroke-linecap:butt;stroke-linejoin:round;stroke-miterlimit:100000" />
          </g>
        </g>
        <g
           style="stroke-linecap:butt;stroke-linejoin:round;stroke-miterlimit:100000"
           id="line2d_12">
          <g
             style="stroke-linecap:butt;stroke-linejoin:round;stroke-miterlimit:100000"
             id="g129">
            <use
               height="100%"
               width="100%"
               id="use127"
               y="63.900002"
               xlink:href="#m444f6e8e4b"
               x="548.96625"
               style="stroke:#000000;stroke-width:0.5;stroke-linecap:butt;stroke-linejoin:round;stroke-miterlimit:100000" />
          </g>
        </g>
        <g
           style="stroke-linecap:butt;stroke-linejoin:round;stroke-miterlimit:100000"
           id="text_3">
          <!-- −100 -->
          <g
             style="stroke-linecap:butt;stroke-linejoin:round;stroke-miterlimit:100000"
             id="g140"
             transform="matrix(0.12,0,0,-0.12,532.48594,588.21812)">
            <use
               height="100%"
               width="100%"
               y="0"
               x="0"
               style="stroke-linecap:butt;stroke-linejoin:round;stroke-miterlimit:100000"
               id="use132"
               xlink:href="#BitstreamVeraSans-Roman-2212" />
            <use
               height="100%"
               width="100%"
               y="0"
               style="stroke-linecap:butt;stroke-linejoin:round;stroke-miterlimit:100000"
               id="use134"
               xlink:href="#BitstreamVeraSans-Roman-31"
               x="83.789062" />
            <use
               height="100%"
               width="100%"
               y="0"
               style="stroke-linecap:butt;stroke-linejoin:round;stroke-miterlimit:100000"
               id="use136"
               xlink:href="#BitstreamVeraSans-Roman-30"
               x="147.41211" />
            <use
               height="100%"
               width="100%"
               y="0"
               style="stroke-linecap:butt;stroke-linejoin:round;stroke-miterlimit:100000"
               id="use138"
               xlink:href="#BitstreamVeraSans-Roman-30"
               x="211.03516" />
          </g>
        </g>
      </g>
      <g
         style="stroke-linecap:butt;stroke-linejoin:round;stroke-miterlimit:100000"
         id="xtick_4">
        <g
           style="stroke-linecap:butt;stroke-linejoin:round;stroke-miterlimit:100000"
           id="line2d_13">
          <g
             style="stroke-linecap:butt;stroke-linejoin:round;stroke-miterlimit:100000"
             id="g146">
            <use
               height="100%"
               width="100%"
               id="use144"
               y="575.09998"
               xlink:href="#ma162898994"
               x="651.20624"
               style="stroke:#000000;stroke-width:0.5;stroke-linecap:butt;stroke-linejoin:round;stroke-miterlimit:100000" />
          </g>
        </g>
        <g
           style="stroke-linecap:butt;stroke-linejoin:round;stroke-miterlimit:100000"
           id="line2d_14">
          <g
             style="stroke-linecap:butt;stroke-linejoin:round;stroke-miterlimit:100000"
             id="g151">
            <use
               height="100%"
               width="100%"
               id="use149"
               y="63.900002"
               xlink:href="#m444f6e8e4b"
               x="651.20624"
               style="stroke:#000000;stroke-width:0.5;stroke-linecap:butt;stroke-linejoin:round;stroke-miterlimit:100000" />
          </g>
        </g>
        <g
           style="stroke-linecap:butt;stroke-linejoin:round;stroke-miterlimit:100000"
           id="text_4">
          <!-- −50 -->
          <g
             style="stroke-linecap:butt;stroke-linejoin:round;stroke-miterlimit:100000"
             id="g160"
             transform="matrix(0.12,0,0,-0.12,638.54344,588.21812)">
            <use
               height="100%"
               width="100%"
               y="0"
               x="0"
               style="stroke-linecap:butt;stroke-linejoin:round;stroke-miterlimit:100000"
               id="use154"
               xlink:href="#BitstreamVeraSans-Roman-2212" />
            <use
               height="100%"
               width="100%"
               y="0"
               style="stroke-linecap:butt;stroke-linejoin:round;stroke-miterlimit:100000"
               id="use156"
               xlink:href="#BitstreamVeraSans-Roman-35"
               x="83.789062" />
            <use
               height="100%"
               width="100%"
               y="0"
               style="stroke-linecap:butt;stroke-linejoin:round;stroke-miterlimit:100000"
               id="use158"
               xlink:href="#BitstreamVeraSans-Roman-30"
               x="147.41211" />
          </g>
        </g>
      </g>
      <g
         style="stroke-linecap:butt;stroke-linejoin:round;stroke-miterlimit:100000"
         id="xtick_5">
        <g
           style="stroke-linecap:butt;stroke-linejoin:round;stroke-miterlimit:100000"
           id="line2d_15">
          <g
             style="stroke-linecap:butt;stroke-linejoin:round;stroke-miterlimit:100000"
             id="g166">
            <use
               height="100%"
               width="100%"
               id="use164"
               y="575.09998"
               xlink:href="#ma162898994"
               x="753.44623"
               style="stroke:#000000;stroke-width:0.5;stroke-linecap:butt;stroke-linejoin:round;stroke-miterlimit:100000" />
          </g>
        </g>
        <g
           style="stroke-linecap:butt;stroke-linejoin:round;stroke-miterlimit:100000"
           id="line2d_16">
          <g
             style="stroke-linecap:butt;stroke-linejoin:round;stroke-miterlimit:100000"
             id="g171">
            <use
               height="100%"
               width="100%"
               id="use169"
               y="63.900002"
               xlink:href="#m444f6e8e4b"
               x="753.44623"
               style="stroke:#000000;stroke-width:0.5;stroke-linecap:butt;stroke-linejoin:round;stroke-miterlimit:100000" />
          </g>
        </g>
        <g
           style="stroke-linecap:butt;stroke-linejoin:round;stroke-miterlimit:100000"
           id="text_5">
          <!-- 0 -->
          <g
             style="stroke-linecap:butt;stroke-linejoin:round;stroke-miterlimit:100000"
             id="g176"
             transform="matrix(0.12,0,0,-0.12,749.62875,588.21812)">
            <use
               height="100%"
               width="100%"
               y="0"
               x="0"
               style="stroke-linecap:butt;stroke-linejoin:round;stroke-miterlimit:100000"
               id="use174"
               xlink:href="#BitstreamVeraSans-Roman-30" />
          </g>
        </g>
      </g>
      <g
         style="stroke-linecap:butt;stroke-linejoin:round;stroke-miterlimit:100000"
         id="xtick_6">
        <g
           style="stroke-linecap:butt;stroke-linejoin:round;stroke-miterlimit:100000"
           id="line2d_17">
          <g
             style="stroke-linecap:butt;stroke-linejoin:round;stroke-miterlimit:100000"
             id="g182">
            <use
               height="100%"
               width="100%"
               id="use180"
               y="575.09998"
               xlink:href="#ma162898994"
               x="855.68628"
               style="stroke:#000000;stroke-width:0.5;stroke-linecap:butt;stroke-linejoin:round;stroke-miterlimit:100000" />
          </g>
        </g>
        <g
           style="stroke-linecap:butt;stroke-linejoin:round;stroke-miterlimit:100000"
           id="line2d_18">
          <g
             style="stroke-linecap:butt;stroke-linejoin:round;stroke-miterlimit:100000"
             id="g187">
            <use
               height="100%"
               width="100%"
               id="use185"
               y="63.900002"
               xlink:href="#m444f6e8e4b"
               x="855.68628"
               style="stroke:#000000;stroke-width:0.5;stroke-linecap:butt;stroke-linejoin:round;stroke-miterlimit:100000" />
          </g>
        </g>
        <g
           style="stroke-linecap:butt;stroke-linejoin:round;stroke-miterlimit:100000"
           id="text_6">
          <!-- 50 -->
          <g
             style="stroke-linecap:butt;stroke-linejoin:round;stroke-miterlimit:100000"
             id="g194"
             transform="matrix(0.12,0,0,-0.12,848.05125,588.21812)">
            <use
               height="100%"
               width="100%"
               y="0"
               x="0"
               style="stroke-linecap:butt;stroke-linejoin:round;stroke-miterlimit:100000"
               id="use190"
               xlink:href="#BitstreamVeraSans-Roman-35" />
            <use
               height="100%"
               width="100%"
               y="0"
               style="stroke-linecap:butt;stroke-linejoin:round;stroke-miterlimit:100000"
               id="use192"
               xlink:href="#BitstreamVeraSans-Roman-30"
               x="63.623047" />
          </g>
        </g>
      </g>
      <g
         style="stroke-linecap:butt;stroke-linejoin:round;stroke-miterlimit:100000"
         id="text_7">
        <!-- x (m) -->
        <defs
           id="defs203">
          <path
             style="stroke-linecap:butt;stroke-linejoin:round;stroke-miterlimit:100000"
             inkscape:connector-curvature="0"
             id="BitstreamVeraSans-Roman-29"
             d="m 8.015625,75.875 h 7.8125 q 7.3125,-11.515625 10.953125,-22.5625 3.640625,-11.03125 3.640625,-21.921875 0,-10.9375 -3.640625,-22.015625 -3.640625,-11.078125 -10.953125,-22.5625 h -7.8125 Q 14.5,-2 17.703125,9.0625 20.90625,20.125 20.90625,31.390625 q 0,11.28125 -3.203125,22.265625 -3.203125,11 -9.6875,22.21875" />
          <path
             style="stroke-linecap:butt;stroke-linejoin:round;stroke-miterlimit:100000"
             inkscape:connector-curvature="0"
             d=""
             id="BitstreamVeraSans-Roman-20" />
          <path
             style="stroke-linecap:butt;stroke-linejoin:round;stroke-miterlimit:100000"
             inkscape:connector-curvature="0"
             id="BitstreamVeraSans-Roman-6d"
             d="M 52,44.1875 Q 55.375,50.25 60.0625,53.125 64.75,56 71.09375,56 q 8.546875,0 13.1875,-5.984375 4.640625,-5.96875 4.640625,-17 V 0 h -9.03125 v 32.71875 q 0,7.859375 -2.796875,11.65625 -2.78125,3.8125 -8.484375,3.8125 -6.984375,0 -11.046875,-4.640625 -4.046875,-4.625 -4.046875,-12.640625 V 0 h -9.03125 v 32.71875 q 0,7.90625 -2.78125,11.6875 -2.78125,3.78125 -8.59375,3.78125 -6.890625,0 -10.953125,-4.65625 -4.046875,-4.65625 -4.046875,-12.625 V 0 h -9.03125 v 54.6875 h 9.03125 v -8.5 q 3.078125,5.03125 7.375,7.421875 Q 29.78125,56 35.6875,56 41.65625,56 45.828125,52.96875 50,49.953125 52,44.1875" />
          <path
             style="stroke-linecap:butt;stroke-linejoin:round;stroke-miterlimit:100000"
             inkscape:connector-curvature="0"
             id="BitstreamVeraSans-Roman-78"
             d="M 54.890625,54.6875 35.109375,28.078125 55.90625,0 H 45.3125 L 29.390625,21.484375 13.484375,0 H 2.875 L 24.125,28.609375 4.6875,54.6875 h 10.59375 l 14.5,-19.484375 14.5,19.484375 z" />
          <path
             style="stroke-linecap:butt;stroke-linejoin:round;stroke-miterlimit:100000"
             inkscape:connector-curvature="0"
             id="BitstreamVeraSans-Roman-28"
             d="M 31,75.875 Q 24.46875,64.65625 21.28125,53.65625 18.109375,42.671875 18.109375,31.390625 18.109375,20.125 21.3125,9.0625 24.515625,-2 31,-13.1875 H 23.1875 Q 15.875,-1.703125 12.234375,9.375 8.59375,20.453125 8.59375,31.390625 q 0,10.890625 3.609375,21.921875 3.625,11.046875 10.984375,22.5625 z" />
        </defs>
        <g
           style="stroke-linecap:butt;stroke-linejoin:round;stroke-miterlimit:100000"
           id="g215"
           transform="matrix(0.12,0,0,-0.12,584.10187,604.83187)">
          <use
             height="100%"
             width="100%"
             y="0"
             x="0"
             style="stroke-linecap:butt;stroke-linejoin:round;stroke-miterlimit:100000"
             id="use205"
             xlink:href="#BitstreamVeraSans-Roman-78" />
          <use
             height="100%"
             width="100%"
             y="0"
             style="stroke-linecap:butt;stroke-linejoin:round;stroke-miterlimit:100000"
             id="use207"
             xlink:href="#BitstreamVeraSans-Roman-20"
             x="59.179688" />
          <use
             height="100%"
             width="100%"
             y="0"
             style="stroke-linecap:butt;stroke-linejoin:round;stroke-miterlimit:100000"
             id="use209"
             xlink:href="#BitstreamVeraSans-Roman-28"
             x="90.966797" />
          <use
             height="100%"
             width="100%"
             y="0"
             style="stroke-linecap:butt;stroke-linejoin:round;stroke-miterlimit:100000"
             id="use211"
             xlink:href="#BitstreamVeraSans-Roman-6d"
             x="129.98047" />
          <use
             height="100%"
             width="100%"
             y="0"
             style="stroke-linecap:butt;stroke-linejoin:round;stroke-miterlimit:100000"
             id="use213"
             xlink:href="#BitstreamVeraSans-Roman-29"
             x="227.39258" />
        </g>
      </g>
    </g>
    <g
       style="stroke-linecap:butt;stroke-linejoin:round;stroke-miterlimit:100000"
       id="matplotlib.axis_2">
      <g
         style="stroke-linecap:butt;stroke-linejoin:round;stroke-miterlimit:100000"
         id="ytick_1">
        <g
           style="stroke-linecap:butt;stroke-linejoin:round;stroke-miterlimit:100000"
           id="line2d_19">
          <defs
             id="defs220">
            <path
               inkscape:connector-curvature="0"
               style="stroke:#000000;stroke-width:0.5;stroke-linecap:butt;stroke-linejoin:round;stroke-miterlimit:100000"
               id="mac543c6886"
               d="M 0,0 H 4" />
          </defs>
          <g
             style="stroke-linecap:butt;stroke-linejoin:round;stroke-miterlimit:100000"
             id="g224">
            <use
               height="100%"
               width="100%"
               id="use222"
               y="575.09998"
               xlink:href="#mac543c6886"
               x="344.48624"
               style="stroke:#000000;stroke-width:0.5;stroke-linecap:butt;stroke-linejoin:round;stroke-miterlimit:100000" />
          </g>
        </g>
        <g
           style="stroke-linecap:butt;stroke-linejoin:round;stroke-miterlimit:100000"
           id="line2d_20">
          <defs
             id="defs228">
            <path
               inkscape:connector-curvature="0"
               style="stroke:#000000;stroke-width:0.5;stroke-linecap:butt;stroke-linejoin:round;stroke-miterlimit:100000"
               id="me7ad0327db"
               d="M 0,0 H -4" />
          </defs>
          <g
             style="stroke-linecap:butt;stroke-linejoin:round;stroke-miterlimit:100000"
             id="g232">
            <use
               height="100%"
               width="100%"
               id="use230"
               y="575.09998"
               xlink:href="#me7ad0327db"
               x="855.68628"
               style="stroke:#000000;stroke-width:0.5;stroke-linecap:butt;stroke-linejoin:round;stroke-miterlimit:100000" />
          </g>
        </g>
        <g
           style="stroke-linecap:butt;stroke-linejoin:round;stroke-miterlimit:100000"
           id="text_8">
          <!-- −100 -->
          <g
             style="stroke-linecap:butt;stroke-linejoin:round;stroke-miterlimit:100000"
             id="g243"
             transform="matrix(0.12,0,0,-0.12,307.52562,578.41125)">
            <use
               height="100%"
               width="100%"
               y="0"
               x="0"
               style="stroke-linecap:butt;stroke-linejoin:round;stroke-miterlimit:100000"
               id="use235"
               xlink:href="#BitstreamVeraSans-Roman-2212" />
            <use
               height="100%"
               width="100%"
               y="0"
               style="stroke-linecap:butt;stroke-linejoin:round;stroke-miterlimit:100000"
               id="use237"
               xlink:href="#BitstreamVeraSans-Roman-31"
               x="83.789062" />
            <use
               height="100%"
               width="100%"
               y="0"
               style="stroke-linecap:butt;stroke-linejoin:round;stroke-miterlimit:100000"
               id="use239"
               xlink:href="#BitstreamVeraSans-Roman-30"
               x="147.41211" />
            <use
               height="100%"
               width="100%"
               y="0"
               style="stroke-linecap:butt;stroke-linejoin:round;stroke-miterlimit:100000"
               id="use241"
               xlink:href="#BitstreamVeraSans-Roman-30"
               x="211.03516" />
          </g>
        </g>
      </g>
      <g
         style="stroke-linecap:butt;stroke-linejoin:round;stroke-miterlimit:100000"
         id="ytick_2">
        <g
           style="stroke-linecap:butt;stroke-linejoin:round;stroke-miterlimit:100000"
           id="line2d_21">
          <g
             style="stroke-linecap:butt;stroke-linejoin:round;stroke-miterlimit:100000"
             id="g249">
            <use
               height="100%"
               width="100%"
               id="use247"
               y="472.85999"
               xlink:href="#mac543c6886"
               x="344.48624"
               style="stroke:#000000;stroke-width:0.5;stroke-linecap:butt;stroke-linejoin:round;stroke-miterlimit:100000" />
          </g>
        </g>
        <g
           style="stroke-linecap:butt;stroke-linejoin:round;stroke-miterlimit:100000"
           id="line2d_22">
          <g
             style="stroke-linecap:butt;stroke-linejoin:round;stroke-miterlimit:100000"
             id="g254">
            <use
               height="100%"
               width="100%"
               id="use252"
               y="472.85999"
               xlink:href="#me7ad0327db"
               x="855.68628"
               style="stroke:#000000;stroke-width:0.5;stroke-linecap:butt;stroke-linejoin:round;stroke-miterlimit:100000" />
          </g>
        </g>
        <g
           style="stroke-linecap:butt;stroke-linejoin:round;stroke-miterlimit:100000"
           id="text_9">
          <!-- −50 -->
          <g
             style="stroke-linecap:butt;stroke-linejoin:round;stroke-miterlimit:100000"
             id="g263"
             transform="matrix(0.12,0,0,-0.12,315.16062,476.17125)">
            <use
               height="100%"
               width="100%"
               y="0"
               x="0"
               style="stroke-linecap:butt;stroke-linejoin:round;stroke-miterlimit:100000"
               id="use257"
               xlink:href="#BitstreamVeraSans-Roman-2212" />
            <use
               height="100%"
               width="100%"
               y="0"
               style="stroke-linecap:butt;stroke-linejoin:round;stroke-miterlimit:100000"
               id="use259"
               xlink:href="#BitstreamVeraSans-Roman-35"
               x="83.789062" />
            <use
               height="100%"
               width="100%"
               y="0"
               style="stroke-linecap:butt;stroke-linejoin:round;stroke-miterlimit:100000"
               id="use261"
               xlink:href="#BitstreamVeraSans-Roman-30"
               x="147.41211" />
          </g>
        </g>
      </g>
      <g
         style="stroke-linecap:butt;stroke-linejoin:round;stroke-miterlimit:100000"
         id="ytick_3">
        <g
           style="stroke-linecap:butt;stroke-linejoin:round;stroke-miterlimit:100000"
           id="line2d_23">
          <g
             style="stroke-linecap:butt;stroke-linejoin:round;stroke-miterlimit:100000"
             id="g269">
            <use
               height="100%"
               width="100%"
               id="use267"
               y="370.62"
               xlink:href="#mac543c6886"
               x="344.48624"
               style="stroke:#000000;stroke-width:0.5;stroke-linecap:butt;stroke-linejoin:round;stroke-miterlimit:100000" />
          </g>
        </g>
        <g
           style="stroke-linecap:butt;stroke-linejoin:round;stroke-miterlimit:100000"
           id="line2d_24">
          <g
             style="stroke-linecap:butt;stroke-linejoin:round;stroke-miterlimit:100000"
             id="g274">
            <use
               height="100%"
               width="100%"
               id="use272"
               y="370.62"
               xlink:href="#me7ad0327db"
               x="855.68628"
               style="stroke:#000000;stroke-width:0.5;stroke-linecap:butt;stroke-linejoin:round;stroke-miterlimit:100000" />
          </g>
        </g>
        <g
           style="stroke-linecap:butt;stroke-linejoin:round;stroke-miterlimit:100000"
           id="text_10">
          <!-- 0 -->
          <g
             style="stroke-linecap:butt;stroke-linejoin:round;stroke-miterlimit:100000"
             id="g279"
             transform="matrix(0.12,0,0,-0.12,332.85125,373.93125)">
            <use
               height="100%"
               width="100%"
               y="0"
               x="0"
               style="stroke-linecap:butt;stroke-linejoin:round;stroke-miterlimit:100000"
               id="use277"
               xlink:href="#BitstreamVeraSans-Roman-30" />
          </g>
        </g>
      </g>
      <g
         style="stroke-linecap:butt;stroke-linejoin:round;stroke-miterlimit:100000"
         id="ytick_4">
        <g
           style="stroke-linecap:butt;stroke-linejoin:round;stroke-miterlimit:100000"
           id="line2d_25">
          <g
             style="stroke-linecap:butt;stroke-linejoin:round;stroke-miterlimit:100000"
             id="g285">
            <use
               height="100%"
               width="100%"
               id="use283"
               y="268.38"
               xlink:href="#mac543c6886"
               x="344.48624"
               style="stroke:#000000;stroke-width:0.5;stroke-linecap:butt;stroke-linejoin:round;stroke-miterlimit:100000" />
          </g>
        </g>
        <g
           style="stroke-linecap:butt;stroke-linejoin:round;stroke-miterlimit:100000"
           id="line2d_26">
          <g
             style="stroke-linecap:butt;stroke-linejoin:round;stroke-miterlimit:100000"
             id="g290">
            <use
               height="100%"
               width="100%"
               id="use288"
               y="268.38"
               xlink:href="#me7ad0327db"
               x="855.68628"
               style="stroke:#000000;stroke-width:0.5;stroke-linecap:butt;stroke-linejoin:round;stroke-miterlimit:100000" />
          </g>
        </g>
        <g
           style="stroke-linecap:butt;stroke-linejoin:round;stroke-miterlimit:100000"
           id="text_11">
          <!-- 50 -->
          <g
             style="stroke-linecap:butt;stroke-linejoin:round;stroke-miterlimit:100000"
             id="g297"
             transform="matrix(0.12,0,0,-0.12,325.21625,271.69125)">
            <use
               height="100%"
               width="100%"
               y="0"
               x="0"
               style="stroke-linecap:butt;stroke-linejoin:round;stroke-miterlimit:100000"
               id="use293"
               xlink:href="#BitstreamVeraSans-Roman-35" />
            <use
               height="100%"
               width="100%"
               y="0"
               style="stroke-linecap:butt;stroke-linejoin:round;stroke-miterlimit:100000"
               id="use295"
               xlink:href="#BitstreamVeraSans-Roman-30"
               x="63.623047" />
          </g>
        </g>
      </g>
      <g
         style="stroke-linecap:butt;stroke-linejoin:round;stroke-miterlimit:100000"
         id="ytick_5">
        <g
           style="stroke-linecap:butt;stroke-linejoin:round;stroke-miterlimit:100000"
           id="line2d_27">
          <g
             style="stroke-linecap:butt;stroke-linejoin:round;stroke-miterlimit:100000"
             id="g303">
            <use
               height="100%"
               width="100%"
               id="use301"
               y="166.14"
               xlink:href="#mac543c6886"
               x="344.48624"
               style="stroke:#000000;stroke-width:0.5;stroke-linecap:butt;stroke-linejoin:round;stroke-miterlimit:100000" />
          </g>
        </g>
        <g
           style="stroke-linecap:butt;stroke-linejoin:round;stroke-miterlimit:100000"
           id="line2d_28">
          <g
             style="stroke-linecap:butt;stroke-linejoin:round;stroke-miterlimit:100000"
             id="g308">
            <use
               height="100%"
               width="100%"
               id="use306"
               y="166.14"
               xlink:href="#me7ad0327db"
               x="855.68628"
               style="stroke:#000000;stroke-width:0.5;stroke-linecap:butt;stroke-linejoin:round;stroke-miterlimit:100000" />
          </g>
        </g>
        <g
           style="stroke-linecap:butt;stroke-linejoin:round;stroke-miterlimit:100000"
           id="text_12">
          <!-- 100 -->
          <g
             style="stroke-linecap:butt;stroke-linejoin:round;stroke-miterlimit:100000"
             id="g317"
             transform="matrix(0.12,0,0,-0.12,317.58125,169.45125)">
            <use
               height="100%"
               width="100%"
               y="0"
               x="0"
               style="stroke-linecap:butt;stroke-linejoin:round;stroke-miterlimit:100000"
               id="use311"
               xlink:href="#BitstreamVeraSans-Roman-31" />
            <use
               height="100%"
               width="100%"
               y="0"
               style="stroke-linecap:butt;stroke-linejoin:round;stroke-miterlimit:100000"
               id="use313"
               xlink:href="#BitstreamVeraSans-Roman-30"
               x="63.623047" />
            <use
               height="100%"
               width="100%"
               y="0"
               style="stroke-linecap:butt;stroke-linejoin:round;stroke-miterlimit:100000"
               id="use315"
               xlink:href="#BitstreamVeraSans-Roman-30"
               x="127.24609" />
          </g>
        </g>
      </g>
      <g
         style="stroke-linecap:butt;stroke-linejoin:round;stroke-miterlimit:100000"
         id="ytick_6">
        <g
           style="stroke-linecap:butt;stroke-linejoin:round;stroke-miterlimit:100000"
           id="line2d_29">
          <g
             style="stroke-linecap:butt;stroke-linejoin:round;stroke-miterlimit:100000"
             id="g323">
            <use
               height="100%"
               width="100%"
               id="use321"
               y="63.900002"
               xlink:href="#mac543c6886"
               x="344.48624"
               style="stroke:#000000;stroke-width:0.5;stroke-linecap:butt;stroke-linejoin:round;stroke-miterlimit:100000" />
          </g>
        </g>
        <g
           style="stroke-linecap:butt;stroke-linejoin:round;stroke-miterlimit:100000"
           id="line2d_30">
          <g
             style="stroke-linecap:butt;stroke-linejoin:round;stroke-miterlimit:100000"
             id="g328">
            <use
               height="100%"
               width="100%"
               id="use326"
               y="63.900002"
               xlink:href="#me7ad0327db"
               x="855.68628"
               style="stroke:#000000;stroke-width:0.5;stroke-linecap:butt;stroke-linejoin:round;stroke-miterlimit:100000" />
          </g>
        </g>
        <g
           style="stroke-linecap:butt;stroke-linejoin:round;stroke-miterlimit:100000"
           id="text_13">
          <!-- 150 -->
          <g
             style="stroke-linecap:butt;stroke-linejoin:round;stroke-miterlimit:100000"
             id="g337"
             transform="matrix(0.12,0,0,-0.12,317.58125,67.21125)">
            <use
               height="100%"
               width="100%"
               y="0"
               x="0"
               style="stroke-linecap:butt;stroke-linejoin:round;stroke-miterlimit:100000"
               id="use331"
               xlink:href="#BitstreamVeraSans-Roman-31" />
            <use
               height="100%"
               width="100%"
               y="0"
               style="stroke-linecap:butt;stroke-linejoin:round;stroke-miterlimit:100000"
               id="use333"
               xlink:href="#BitstreamVeraSans-Roman-35"
               x="63.623047" />
            <use
               height="100%"
               width="100%"
               y="0"
               style="stroke-linecap:butt;stroke-linejoin:round;stroke-miterlimit:100000"
               id="use335"
               xlink:href="#BitstreamVeraSans-Roman-30"
               x="127.24609" />
          </g>
        </g>
      </g>
      <g
         style="stroke-linecap:butt;stroke-linejoin:round;stroke-miterlimit:100000"
         id="text_14">
        <!-- z (m) -->
        <defs
           id="defs342">
          <path
             style="stroke-linecap:butt;stroke-linejoin:round;stroke-miterlimit:100000"
             inkscape:connector-curvature="0"
             id="BitstreamVeraSans-Roman-7a"
             d="M 5.515625,54.6875 H 48.1875 V 46.484375 L 14.40625,7.171875 H 48.1875 V 0 H 4.296875 v 8.203125 l 33.796875,39.3125 H 5.515625 Z" />
        </defs>
        <g
           style="stroke-linecap:butt;stroke-linejoin:round;stroke-miterlimit:100000"
           id="g354"
           transform="matrix(0,-0.12,-0.12,0,300.03,335.08219)">
          <use
             height="100%"
             width="100%"
             y="0"
             x="0"
             style="stroke-linecap:butt;stroke-linejoin:round;stroke-miterlimit:100000"
             id="use344"
             xlink:href="#BitstreamVeraSans-Roman-7a" />
          <use
             height="100%"
             width="100%"
             y="0"
             style="stroke-linecap:butt;stroke-linejoin:round;stroke-miterlimit:100000"
             id="use346"
             xlink:href="#BitstreamVeraSans-Roman-20"
             x="52.490234" />
          <use
             height="100%"
             width="100%"
             y="0"
             style="stroke-linecap:butt;stroke-linejoin:round;stroke-miterlimit:100000"
             id="use348"
             xlink:href="#BitstreamVeraSans-Roman-28"
             x="84.277344" />
          <use
             height="100%"
             width="100%"
             y="0"
             style="stroke-linecap:butt;stroke-linejoin:round;stroke-miterlimit:100000"
             id="use350"
             xlink:href="#BitstreamVeraSans-Roman-6d"
             x="123.29102" />
          <use
             height="100%"
             width="100%"
             y="0"
             style="stroke-linecap:butt;stroke-linejoin:round;stroke-miterlimit:100000"
             id="use352"
             xlink:href="#BitstreamVeraSans-Roman-29"
             x="220.70312" />
        </g>
      </g>
    </g>
    <g
       style="stroke-linecap:butt;stroke-linejoin:round;stroke-miterlimit:100000"
       id="legend_1">
      <g
         style="stroke-linecap:butt;stroke-linejoin:round;stroke-miterlimit:100000"
         id="patch_7">
        <path
           inkscape:connector-curvature="0"
           id="path358"
           style="fill:#ffffff;stroke:#000000;stroke-linecap:butt;stroke-linejoin:miter;stroke-miterlimit:100000"
           d="M 641.3535,165.1905 H 822.92625 V 96.66 H 641.3535 Z" />
      </g>
      <g
         style="stroke-linecap:butt;stroke-linejoin:round;stroke-miterlimit:100000"
         id="line2d_31">
        <path
           inkscape:connector-curvature="0"
           id="path361"
           style="fill:none;stroke:#ff0000;stroke-width:1.5;stroke-linecap:square;stroke-linejoin:round;stroke-miterlimit:100000"
           d="m 651.4335,108.32175 h 20.16" />
      </g>
      <g
         style="stroke-linecap:butt;stroke-linejoin:round;stroke-miterlimit:100000"
         id="line2d_32" />
      <g
         style="stroke-linecap:butt;stroke-linejoin:round;stroke-miterlimit:100000"
         id="text_15">
        <!-- ground truth -->
        <defs
           id="defs373">
          <path
             style="stroke-linecap:butt;stroke-linejoin:round;stroke-miterlimit:100000"
             inkscape:connector-curvature="0"
             id="BitstreamVeraSans-Roman-6e"
             d="M 54.890625,33.015625 V 0 H 45.90625 v 32.71875 q 0,7.765625 -3.03125,11.609375 -3.03125,3.859375 -9.078125,3.859375 -7.28125,0 -11.484375,-4.640625 -4.203125,-4.625 -4.203125,-12.640625 V 0 h -9.03125 v 54.6875 h 9.03125 v -8.5 q 3.234375,4.9375 7.59375,7.375 4.375,2.4375 10.09375,2.4375 9.421875,0 14.25,-5.828125 4.84375,-5.828125 4.84375,-17.15625" />
          <path
             style="stroke-linecap:butt;stroke-linejoin:round;stroke-miterlimit:100000"
             inkscape:connector-curvature="0"
             id="BitstreamVeraSans-Roman-6f"
             d="m 30.609375,48.390625 q -7.21875,0 -11.421875,-5.640625 -4.203125,-5.640625 -4.203125,-15.453125 0,-9.8125 4.171875,-15.453125 4.1875,-5.640625 11.453125,-5.640625 7.1875,0 11.375,5.65625 4.203125,5.671875 4.203125,15.4375 0,9.71875 -4.203125,15.40625 -4.1875,5.6875 -11.375,5.6875 m 0,7.609375 q 11.71875,0 18.40625,-7.625 6.703125,-7.609375 6.703125,-21.078125 0,-13.421875 -6.703125,-21.078125 -6.6875,-7.640625 -18.40625,-7.640625 -11.765625,0 -18.4375,7.640625 -6.65625,7.65625 -6.65625,21.078125 0,13.46875 6.65625,21.078125 Q 18.84375,56 30.609375,56" />
          <path
             style="stroke-linecap:butt;stroke-linejoin:round;stroke-miterlimit:100000"
             inkscape:connector-curvature="0"
             id="BitstreamVeraSans-Roman-68"
             d="M 54.890625,33.015625 V 0 H 45.90625 v 32.71875 q 0,7.765625 -3.03125,11.609375 -3.03125,3.859375 -9.078125,3.859375 -7.28125,0 -11.484375,-4.640625 -4.203125,-4.625 -4.203125,-12.640625 V 0 h -9.03125 v 75.984375 h 9.03125 V 46.1875 q 3.234375,4.9375 7.59375,7.375 4.375,2.4375 10.09375,2.4375 9.421875,0 14.25,-5.828125 4.84375,-5.828125 4.84375,-17.15625" />
          <path
             style="stroke-linecap:butt;stroke-linejoin:round;stroke-miterlimit:100000"
             inkscape:connector-curvature="0"
             id="BitstreamVeraSans-Roman-64"
             d="m 45.40625,46.390625 v 29.59375 h 8.984375 V 0 H 45.40625 v 8.203125 q -2.828125,-4.875 -7.15625,-7.25 -4.3125,-2.375 -10.375,-2.375 -9.90625,0 -16.140625,7.90625 -6.21875,7.921875 -6.21875,20.8125 0,12.890625 6.21875,20.796875 Q 17.96875,56 27.875,56 q 6.0625,0 10.375,-2.375 4.328125,-2.359375 7.15625,-7.234375 M 14.796875,27.296875 q 0,-9.90625 4.078125,-15.546875 4.078125,-5.640625 11.203125,-5.640625 7.125,0 11.21875,5.640625 4.109375,5.640625 4.109375,15.546875 0,9.90625 -4.109375,15.546875 -4.09375,5.640625 -11.21875,5.640625 -7.125,0 -11.203125,-5.640625 -4.078125,-5.640625 -4.078125,-15.546875" />
          <path
             style="stroke-linecap:butt;stroke-linejoin:round;stroke-miterlimit:100000"
             inkscape:connector-curvature="0"
             id="BitstreamVeraSans-Roman-67"
             d="m 45.40625,27.984375 q 0,9.765625 -4.03125,15.125 -4.015625,5.375 -11.296875,5.375 -7.21875,0 -11.25,-5.375 -4.03125,-5.359375 -4.03125,-15.125 0,-9.71875 4.03125,-15.09375 4.03125,-5.375 11.25,-5.375 7.28125,0 11.296875,5.375 4.03125,5.375 4.03125,15.09375 M 54.390625,6.78125 q 0,-13.953125 -6.203125,-20.765625 -6.1875,-6.8125 -18.984375,-6.8125 -4.734375,0 -8.9375,0.703125 -4.203125,0.703125 -8.15625,2.171875 V -9.1875 q 3.953125,-2.140625 7.8125,-3.15625 3.859375,-1.03125 7.859375,-1.03125 8.84375,0 13.234375,4.609375 4.390625,4.609375 4.390625,13.9375 V 9.625 Q 42.625,4.78125 38.28125,2.390625 33.9375,0 27.875,0 17.828125,0 11.671875,7.65625 q -6.15625,7.671875 -6.15625,20.328125 0,12.6875 6.15625,20.34375 Q 17.828125,56 27.875,56 q 6.0625,0 10.40625,-2.390625 4.34375,-2.390625 7.125,-7.21875 V 54.6875 h 8.984375 z" />
          <path
             style="stroke-linecap:butt;stroke-linejoin:round;stroke-miterlimit:100000"
             inkscape:connector-curvature="0"
             id="BitstreamVeraSans-Roman-75"
             d="M 8.5,21.578125 V 54.6875 h 8.984375 V 21.921875 q 0,-7.765625 3.015625,-11.65625 3.03125,-3.875 9.09375,-3.875 7.265625,0 11.484375,4.640625 4.234375,4.640625 4.234375,12.65625 v 31 h 8.984375 V 0 H 45.3125 V 8.40625 Q 42.046875,3.421875 37.71875,1 33.40625,-1.421875 27.6875,-1.421875 18.265625,-1.421875 13.375,4.4375 8.5,10.296875 8.5,21.578125" />
          <path
             style="stroke-linecap:butt;stroke-linejoin:round;stroke-miterlimit:100000"
             inkscape:connector-curvature="0"
             id="BitstreamVeraSans-Roman-72"
             d="m 41.109375,46.296875 q -1.515625,0.875 -3.296875,1.28125 Q 36.03125,48 33.890625,48 26.265625,48 22.1875,43.046875 18.109375,38.09375 18.109375,28.8125 V 0 h -9.03125 v 54.6875 h 9.03125 v -8.5 q 2.84375,4.984375 7.375,7.390625 Q 30.03125,56 36.53125,56 q 0.921875,0 2.046875,-0.125 1.125,-0.109375 2.484375,-0.359375 z" />
          <path
             style="stroke-linecap:butt;stroke-linejoin:round;stroke-miterlimit:100000"
             inkscape:connector-curvature="0"
             id="BitstreamVeraSans-Roman-74"
             d="M 18.3125,70.21875 V 54.6875 h 18.5 v -6.984375 h -18.5 v -29.6875 q 0,-6.6875 1.828125,-8.59375 1.828125,-1.90625 7.453125,-1.90625 H 36.8125 V 0 H 27.59375 Q 17.1875,0 13.234375,3.875 9.28125,7.765625 9.28125,18.015625 v 29.6875 H 2.6875 V 54.6875 h 6.59375 v 15.53125 z" />
        </defs>
        <g
           style="stroke-linecap:butt;stroke-linejoin:round;stroke-miterlimit:100000"
           id="g399"
           transform="matrix(0.144,0,0,-0.144,687.4335,113.36175)">
          <use
             height="100%"
             width="100%"
             y="0"
             x="0"
             style="stroke-linecap:butt;stroke-linejoin:round;stroke-miterlimit:100000"
             id="use375"
             xlink:href="#BitstreamVeraSans-Roman-67" />
          <use
             height="100%"
             width="100%"
             y="0"
             style="stroke-linecap:butt;stroke-linejoin:round;stroke-miterlimit:100000"
             id="use377"
             xlink:href="#BitstreamVeraSans-Roman-72"
             x="63.476562" />
          <use
             height="100%"
             width="100%"
             y="0"
             style="stroke-linecap:butt;stroke-linejoin:round;stroke-miterlimit:100000"
             id="use379"
             xlink:href="#BitstreamVeraSans-Roman-6f"
             x="104.55859" />
          <use
             height="100%"
             width="100%"
             y="0"
             style="stroke-linecap:butt;stroke-linejoin:round;stroke-miterlimit:100000"
             id="use381"
             xlink:href="#BitstreamVeraSans-Roman-75"
             x="165.74023" />
          <use
             height="100%"
             width="100%"
             y="0"
             style="stroke-linecap:butt;stroke-linejoin:round;stroke-miterlimit:100000"
             id="use383"
             xlink:href="#BitstreamVeraSans-Roman-6e"
             x="229.11914" />
          <use
             height="100%"
             width="100%"
             y="0"
             style="stroke-linecap:butt;stroke-linejoin:round;stroke-miterlimit:100000"
             id="use385"
             xlink:href="#BitstreamVeraSans-Roman-64"
             x="292.49805" />
          <use
             height="100%"
             width="100%"
             y="0"
             style="stroke-linecap:butt;stroke-linejoin:round;stroke-miterlimit:100000"
             id="use387"
             xlink:href="#BitstreamVeraSans-Roman-20"
             x="355.97461" />
          <use
             height="100%"
             width="100%"
             y="0"
             style="stroke-linecap:butt;stroke-linejoin:round;stroke-miterlimit:100000"
             id="use389"
             xlink:href="#BitstreamVeraSans-Roman-74"
             x="387.76172" />
          <use
             height="100%"
             width="100%"
             y="0"
             style="stroke-linecap:butt;stroke-linejoin:round;stroke-miterlimit:100000"
             id="use391"
             xlink:href="#BitstreamVeraSans-Roman-72"
             x="426.9707" />
          <use
             height="100%"
             width="100%"
             y="0"
             style="stroke-linecap:butt;stroke-linejoin:round;stroke-miterlimit:100000"
             id="use393"
             xlink:href="#BitstreamVeraSans-Roman-75"
             x="468.08398" />
          <use
             height="100%"
             width="100%"
             y="0"
             style="stroke-linecap:butt;stroke-linejoin:round;stroke-miterlimit:100000"
             id="use395"
             xlink:href="#BitstreamVeraSans-Roman-74"
             x="531.46289" />
          <use
             height="100%"
             width="100%"
             y="0"
             style="stroke-linecap:butt;stroke-linejoin:round;stroke-miterlimit:100000"
             id="use397"
             xlink:href="#BitstreamVeraSans-Roman-68"
             x="570.67188" />
        </g>
      </g>
      <g
         style="stroke-linecap:butt;stroke-linejoin:round;stroke-miterlimit:100000"
         id="line2d_33">
        <path
           inkscape:connector-curvature="0"
           id="path402"
           style="fill:none;stroke:#0072bd;stroke-width:1.5;stroke-linecap:square;stroke-linejoin:round;stroke-miterlimit:100000"
           d="m 651.4335,129.45825 h 20.16" />
      </g>
      <g
         style="stroke-linecap:butt;stroke-linejoin:round;stroke-miterlimit:100000"
         id="line2d_34" />
      <g
         style="stroke-linecap:butt;stroke-linejoin:round;stroke-miterlimit:100000"
         id="text_16">
        <!-- fast_anms_ldb.log -->
        <defs
           id="defs413">
          <path
             style="stroke-linecap:butt;stroke-linejoin:round;stroke-miterlimit:100000"
             inkscape:connector-curvature="0"
             id="BitstreamVeraSans-Roman-5f"
             d="m 50.984375,-16.609375 v -6.96875 h -51.96875 v 6.96875 z" />
          <path
             style="stroke-linecap:butt;stroke-linejoin:round;stroke-miterlimit:100000"
             inkscape:connector-curvature="0"
             id="BitstreamVeraSans-Roman-6c"
             d="M 9.421875,75.984375 H 18.40625 V 0 H 9.421875 Z" />
          <path
             style="stroke-linecap:butt;stroke-linejoin:round;stroke-miterlimit:100000"
             inkscape:connector-curvature="0"
             id="BitstreamVeraSans-Roman-2e"
             d="M 10.6875,12.40625 H 21 V 0 H 10.6875 Z" />
          <path
             style="stroke-linecap:butt;stroke-linejoin:round;stroke-miterlimit:100000"
             inkscape:connector-curvature="0"
             id="BitstreamVeraSans-Roman-66"
             d="M 37.109375,75.984375 V 68.5 h -8.59375 q -4.828125,0 -6.71875,-1.953125 -1.875,-1.953125 -1.875,-7.03125 V 54.6875 H 34.71875 V 47.703125 H 19.921875 V 0 h -9.03125 V 47.703125 H 2.296875 V 54.6875 h 8.59375 V 58.5 q 0,9.125 4.25,13.296875 4.25,4.1875 13.46875,4.1875 z" />
          <path
             style="stroke-linecap:butt;stroke-linejoin:round;stroke-miterlimit:100000"
             inkscape:connector-curvature="0"
             id="BitstreamVeraSans-Roman-61"
             d="m 34.28125,27.484375 q -10.890625,0 -15.09375,-2.484375 -4.203125,-2.484375 -4.203125,-8.5 0,-4.78125 3.15625,-7.59375 3.15625,-2.796875 8.5625,-2.796875 7.484375,0 12,5.296875 4.515625,5.296875 4.515625,14.078125 v 2 z m 17.921875,3.71875 V 0 H 43.21875 v 8.296875 q -3.078125,-4.96875 -7.671875,-7.34375 -4.59375,-2.375 -11.234375,-2.375 -8.390625,0 -13.359375,4.71875 Q 6,8.015625 6,15.921875 q 0,9.21875 6.171875,13.90625 6.1875,4.6875 18.4375,4.6875 H 43.21875 v 0.890625 q 0,6.203125 -4.078125,9.59375 -4.078125,3.390625 -11.453125,3.390625 -4.6875,0 -9.140625,-1.125 -4.4375,-1.125 -8.53125,-3.375 v 8.3125 q 4.921875,1.90625 9.5625,2.84375 Q 24.21875,56 28.609375,56 q 11.875,0 17.734375,-6.15625 5.859375,-6.140625 5.859375,-18.640625" />
          <path
             style="stroke-linecap:butt;stroke-linejoin:round;stroke-miterlimit:100000"
             inkscape:connector-curvature="0"
             id="BitstreamVeraSans-Roman-73"
             d="m 44.28125,53.078125 v -8.5 Q 40.484375,46.53125 36.375,47.5 q -4.09375,0.984375 -8.5,0.984375 -6.6875,0 -10.03125,-2.046875 Q 14.5,44.390625 14.5,40.28125 q 0,-3.125 2.390625,-4.90625 2.390625,-1.78125 9.625,-3.390625 l 3.078125,-0.6875 Q 39.15625,29.25 43.1875,25.515625 47.21875,21.78125 47.21875,15.09375 q 0,-7.625 -6.03125,-12.078125 -6.03125,-4.4375 -16.578125,-4.4375 -4.390625,0 -9.15625,0.859375 Q 10.6875,0.296875 5.421875,2 v 9.28125 q 4.984375,-2.59375 9.8125,-3.890625 4.828125,-1.28125 9.578125,-1.28125 6.34375,0 9.75,2.171875 3.421875,2.171875 3.421875,6.125 0,3.65625 -2.46875,5.609375 -2.453125,1.953125 -10.8125,3.765625 l -3.125,0.734375 q -8.34375,1.75 -12.0625,5.390625 -3.703125,3.640625 -3.703125,9.984375 0,7.71875 5.46875,11.90625 Q 16.75,56 26.8125,56 q 4.96875,0 9.359375,-0.734375 4.40625,-0.71875 8.109375,-2.1875" />
          <path
             style="stroke-linecap:butt;stroke-linejoin:round;stroke-miterlimit:100000"
             inkscape:connector-curvature="0"
             id="BitstreamVeraSans-Roman-62"
             d="m 48.6875,27.296875 q 0,9.90625 -4.078125,15.546875 -4.078125,5.640625 -11.203125,5.640625 -7.140625,0 -11.21875,-5.640625 -4.078125,-5.640625 -4.078125,-15.546875 0,-9.90625 4.078125,-15.546875 4.078125,-5.640625 11.21875,-5.640625 7.125,0 11.203125,5.640625 4.078125,5.640625 4.078125,15.546875 m -30.578125,19.09375 q 2.84375,4.875 7.15625,7.234375 Q 29.59375,56 35.59375,56 q 9.96875,0 16.1875,-7.90625 6.234375,-7.90625 6.234375,-20.796875 0,-12.890625 -6.234375,-20.8125 -6.21875,-7.90625 -16.1875,-7.90625 -6,0 -10.328125,2.375 -4.3125,2.375 -7.15625,7.25 V 0 h -9.03125 v 75.984375 h 9.03125 z" />
        </defs>
        <g
           style="stroke-linecap:butt;stroke-linejoin:round;stroke-miterlimit:100000"
           id="g449"
           transform="matrix(0.144,0,0,-0.144,687.4335,134.49825)">
          <use
             height="100%"
             width="100%"
             y="0"
             x="0"
             style="stroke-linecap:butt;stroke-linejoin:round;stroke-miterlimit:100000"
             id="use415"
             xlink:href="#BitstreamVeraSans-Roman-66" />
          <use
             height="100%"
             width="100%"
             y="0"
             style="stroke-linecap:butt;stroke-linejoin:round;stroke-miterlimit:100000"
             id="use417"
             xlink:href="#BitstreamVeraSans-Roman-61"
             x="35.205078" />
          <use
             height="100%"
             width="100%"
             y="0"
             style="stroke-linecap:butt;stroke-linejoin:round;stroke-miterlimit:100000"
             id="use419"
             xlink:href="#BitstreamVeraSans-Roman-73"
             x="96.484375" />
          <use
             height="100%"
             width="100%"
             y="0"
             style="stroke-linecap:butt;stroke-linejoin:round;stroke-miterlimit:100000"
             id="use421"
             xlink:href="#BitstreamVeraSans-Roman-74"
             x="148.58398" />
          <use
             height="100%"
             width="100%"
             y="0"
             style="stroke-linecap:butt;stroke-linejoin:round;stroke-miterlimit:100000"
             id="use423"
             xlink:href="#BitstreamVeraSans-Roman-5f"
             x="187.79297" />
          <use
             height="100%"
             width="100%"
             y="0"
             style="stroke-linecap:butt;stroke-linejoin:round;stroke-miterlimit:100000"
             id="use425"
             xlink:href="#BitstreamVeraSans-Roman-61"
             x="237.79297" />
          <use
             height="100%"
             width="100%"
             y="0"
             style="stroke-linecap:butt;stroke-linejoin:round;stroke-miterlimit:100000"
             id="use427"
             xlink:href="#BitstreamVeraSans-Roman-6e"
             x="299.07227" />
          <use
             height="100%"
             width="100%"
             y="0"
             style="stroke-linecap:butt;stroke-linejoin:round;stroke-miterlimit:100000"
             id="use429"
             xlink:href="#BitstreamVeraSans-Roman-6d"
             x="362.45117" />
          <use
             height="100%"
             width="100%"
             y="0"
             style="stroke-linecap:butt;stroke-linejoin:round;stroke-miterlimit:100000"
             id="use431"
             xlink:href="#BitstreamVeraSans-Roman-73"
             x="459.86328" />
          <use
             height="100%"
             width="100%"
             y="0"
             style="stroke-linecap:butt;stroke-linejoin:round;stroke-miterlimit:100000"
             id="use433"
             xlink:href="#BitstreamVeraSans-Roman-5f"
             x="511.96289" />
          <use
             height="100%"
             width="100%"
             y="0"
             style="stroke-linecap:butt;stroke-linejoin:round;stroke-miterlimit:100000"
             id="use435"
             xlink:href="#BitstreamVeraSans-Roman-6c"
             x="561.96289" />
          <use
             height="100%"
             width="100%"
             y="0"
             style="stroke-linecap:butt;stroke-linejoin:round;stroke-miterlimit:100000"
             id="use437"
             xlink:href="#BitstreamVeraSans-Roman-64"
             x="589.74609" />
          <use
             height="100%"
             width="100%"
             y="0"
             style="stroke-linecap:butt;stroke-linejoin:round;stroke-miterlimit:100000"
             id="use439"
             xlink:href="#BitstreamVeraSans-Roman-62"
             x="653.22266" />
        </g>
      </g>
      <g
         style="stroke-linecap:butt;stroke-linejoin:round;stroke-miterlimit:100000"
         id="line2d_35">
        <path
           inkscape:connector-curvature="0"
           id="path452"
           style="fill:none;stroke:#d95319;stroke-width:1.5;stroke-linecap:square;stroke-linejoin:round;stroke-miterlimit:100000"
           d="m 651.4335,150.99525 h 20.16" />
      </g>
      <g
         style="stroke-linecap:butt;stroke-linejoin:round;stroke-miterlimit:100000"
         id="line2d_36" />
      <g
         style="stroke-linecap:butt;stroke-linejoin:round;stroke-miterlimit:100000"
         id="text_17">
        <!-- gftt_brisk.log -->
        <defs
           id="defs458">
          <path
             style="stroke-linecap:butt;stroke-linejoin:round;stroke-miterlimit:100000"
             inkscape:connector-curvature="0"
             id="BitstreamVeraSans-Roman-69"
             d="M 9.421875,54.6875 H 18.40625 V 0 H 9.421875 Z m 0,21.296875 H 18.40625 V 64.59375 H 9.421875 Z" />
          <path
             style="stroke-linecap:butt;stroke-linejoin:round;stroke-miterlimit:100000"
             inkscape:connector-curvature="0"
             id="BitstreamVeraSans-Roman-6b"
             d="m 9.078125,75.984375 h 9.03125 v -44.875 l 26.8125,23.578125 h 11.46875 l -29,-25.578125 L 57.625,0 H 45.90625 L 18.109375,26.703125 V 0 h -9.03125 z" />
        </defs>
        <g
           style="stroke-linecap:butt;stroke-linejoin:round;stroke-miterlimit:100000"
           id="g488"
           transform="matrix(0.144,0,0,-0.144,687.4335,156.03525)">
          <use
             height="100%"
             width="100%"
             y="0"
             x="0"
             style="stroke-linecap:butt;stroke-linejoin:round;stroke-miterlimit:100000"
             id="use460"
             xlink:href="#BitstreamVeraSans-Roman-67" />
          <use
             height="100%"
             width="100%"
             y="0"
             style="stroke-linecap:butt;stroke-linejoin:round;stroke-miterlimit:100000"
             id="use462"
             xlink:href="#BitstreamVeraSans-Roman-66"
             x="63.476562" />
          <use
             height="100%"
             width="100%"
             y="0"
             style="stroke-linecap:butt;stroke-linejoin:round;stroke-miterlimit:100000"
             id="use464"
             xlink:href="#BitstreamVeraSans-Roman-74"
             x="98.666016" />
          <use
             height="100%"
             width="100%"
             y="0"
             style="stroke-linecap:butt;stroke-linejoin:round;stroke-miterlimit:100000"
             id="use466"
             xlink:href="#BitstreamVeraSans-Roman-74"
             x="137.875" />
          <use
             height="100%"
             width="100%"
             y="0"
             style="stroke-linecap:butt;stroke-linejoin:round;stroke-miterlimit:100000"
             id="use468"
             xlink:href="#BitstreamVeraSans-Roman-5f"
             x="177.08398" />
          <use
             height="100%"
             width="100%"
             y="0"
             style="stroke-linecap:butt;stroke-linejoin:round;stroke-miterlimit:100000"
             id="use470"
             xlink:href="#BitstreamVeraSans-Roman-62"
             x="227.08398" />
          <use
             height="100%"
             width="100%"
             y="0"
             style="stroke-linecap:butt;stroke-linejoin:round;stroke-miterlimit:100000"
             id="use472"
             xlink:href="#BitstreamVeraSans-Roman-72"
             x="290.56055" />
          <use
             height="100%"
             width="100%"
             y="0"
             style="stroke-linecap:butt;stroke-linejoin:round;stroke-miterlimit:100000"
             id="use474"
             xlink:href="#BitstreamVeraSans-Roman-69"
             x="331.67383" />
          <use
             height="100%"
             width="100%"
             y="0"
             style="stroke-linecap:butt;stroke-linejoin:round;stroke-miterlimit:100000"
             id="use476"
             xlink:href="#BitstreamVeraSans-Roman-73"
             x="359.45703" />
          <use
             height="100%"
             width="100%"
             y="0"
             style="stroke-linecap:butt;stroke-linejoin:round;stroke-miterlimit:100000"
             id="use478"
             xlink:href="#BitstreamVeraSans-Roman-6b"
             x="411.55664" />
        </g>
      </g>
    </g>
  </g>
  <defs
     id="defs497">
    <clipPath
       id="p905af1c735">
      <rect
         height="511.20000000000005"
         width="511.2"
         x="344.48625"
         y="63.89999999999998"
         id="rect494" />
    </clipPath>
  </defs>
</svg>
