<?xml version="1.0" encoding="UTF-8" standalone="no"?>
<!-- Created with Inkscape (http://www.inkscape.org/) -->

<svg
   xmlns:dc="http://purl.org/dc/elements/1.1/"
   xmlns:cc="http://creativecommons.org/ns#"
   xmlns:rdf="http://www.w3.org/1999/02/22-rdf-syntax-ns#"
   xmlns:svg="http://www.w3.org/2000/svg"
   xmlns="http://www.w3.org/2000/svg"
   xmlns:sodipodi="http://sodipodi.sourceforge.net/DTD/sodipodi-0.dtd"
   xmlns:inkscape="http://www.inkscape.org/namespaces/inkscape"
   version="1.1"
   id="svg2"
   xml:space="preserve"
   width="478.66226"
   height="367.41403"
   viewBox="0 0 478.66226 367.41403"
   sodipodi:docname="cameramodel-backup.svg"
   inkscape:version="0.92.3 (unknown)"><metadata
     id="metadata8"><rdf:RDF><cc:Work
         rdf:about=""><dc:format>image/svg+xml</dc:format><dc:type
           rdf:resource="http://purl.org/dc/dcmitype/StillImage" /><dc:title></dc:title></cc:Work></rdf:RDF></metadata><defs
     id="defs6"><marker
   inkscape:isstock="true"
   style="overflow:visible"
   id="marker6856"
   refX="0"
   refY="0"
   orient="auto"
   inkscape:stockid="Arrow2Mend"><path
     transform="scale(-0.6)"
     d="M 8.7185878,4.0337352 -2.2072895,0.01601326 8.7185884,-4.0017078 c -1.7454984,2.3720609 -1.7354408,5.6174519 -6e-7,8.035443 z"
     style="fill:#000000;fill-opacity:1;fill-rule:evenodd;stroke:#000000;stroke-width:0.625;stroke-linejoin:round;stroke-opacity:1"
     id="path6854"
     inkscape:connector-curvature="0" /></marker><marker
   inkscape:stockid="Arrow2Mend"
   orient="auto"
   refY="0"
   refX="0"
   id="marker6810"
   style="overflow:visible"
   inkscape:isstock="true"><path
     id="path6808"
     style="fill:#000000;fill-opacity:1;fill-rule:evenodd;stroke:#000000;stroke-width:0.625;stroke-linejoin:round;stroke-opacity:1"
     d="M 8.7185878,4.0337352 -2.2072895,0.01601326 8.7185884,-4.0017078 c -1.7454984,2.3720609 -1.7354408,5.6174519 -6e-7,8.035443 z"
     transform="scale(-0.6)"
     inkscape:connector-curvature="0" /></marker><inkscape:path-effect
   effect="powerstroke"
   id="path-effect6800"
   is_visible="true"
   offset_points="1,0.375"
   sort_points="true"
   interpolator_type="CubicBezierJohan"
   interpolator_beta="0.2"
   start_linecap_type="zerowidth"
   linejoin_type="extrp_arc"
   miter_limit="4"
   end_linecap_type="zerowidth" /><marker
   inkscape:isstock="true"
   style="overflow:visible"
   id="marker5632"
   refX="0"
   refY="0"
   orient="auto"
   inkscape:stockid="Arrow2Mend"
   inkscape:collect="always"><path
     transform="scale(-0.6)"
     d="M 8.7185878,4.0337352 -2.2072895,0.01601326 8.7185884,-4.0017078 c -1.7454984,2.3720609 -1.7354408,5.6174519 -6e-7,8.035443 z"
     style="fill:#000000;fill-opacity:1;fill-rule:evenodd;stroke:#000000;stroke-width:0.625;stroke-linejoin:round;stroke-opacity:1"
     id="path5630"
     inkscape:connector-curvature="0" /></marker><inkscape:path-effect
   effect="powerstroke"
   id="path-effect5622"
   is_visible="true"
   offset_points="0.99965627,-0.00015975404"
   sort_points="true"
   interpolator_type="CubicBezierJohan"
   interpolator_beta="0.2"
   start_linecap_type="zerowidth"
   linejoin_type="extrp_arc"
   miter_limit="4"
   end_linecap_type="zerowidth" /><inkscape:path-effect
   effect="powerstroke"
   id="path-effect798"
   is_visible="true"
   offset_points="1,0.375"
   sort_points="true"
   interpolator_type="CubicBezierJohan"
   interpolator_beta="0.2"
   start_linecap_type="zerowidth"
   linejoin_type="extrp_arc"
   miter_limit="4"
   end_linecap_type="zerowidth" /><inkscape:path-effect
   effect="powerstroke"
   id="path-effect788"
   is_visible="true"
   offset_points="1,0.375"
   sort_points="true"
   interpolator_type="CubicBezierJohan"
   interpolator_beta="0.2"
   start_linecap_type="zerowidth"
   linejoin_type="extrp_arc"
   miter_limit="4"
   end_linecap_type="zerowidth" /><clipPath
   clipPathUnits="userSpaceOnUse"
   id="clipPath64"><path
     d="M -4.2227,0 H 465.755 V 556.645 H -4.2227 Z"
     id="path62"
     inkscape:connector-curvature="0" /></clipPath><clipPath
   clipPathUnits="userSpaceOnUse"
   id="clipPath74"><path
     d="M 0,556.642 H 465.447 V 0 H 0 Z"
     id="path72"
     inkscape:connector-curvature="0" /></clipPath><clipPath
   clipPathUnits="userSpaceOnUse"
   id="clipPath110"><path
     d="M 0,556.642 H 465.447 V 0 H 0 Z"
     id="path108"
     inkscape:connector-curvature="0" /></clipPath><clipPath
   clipPathUnits="userSpaceOnUse"
   id="clipPath134"><path
     d="M 0,556.642 H 465.447 V 0 H 0 Z"
     id="path132"
     inkscape:connector-curvature="0" /></clipPath><clipPath
   clipPathUnits="userSpaceOnUse"
   id="clipPath188"><path
     d="M 0,556.642 H 465.447 V 0 H 0 Z"
     id="path186"
     inkscape:connector-curvature="0" /></clipPath><marker
   inkscape:isstock="true"
   style="overflow:visible"
   id="marker5632-3"
   refX="0"
   refY="0"
   orient="auto"
   inkscape:stockid="Arrow2Mend"
   inkscape:collect="always"><path
     inkscape:connector-curvature="0"
     transform="scale(-0.6)"
     d="M 8.7185878,4.0337352 -2.2072895,0.01601326 8.7185884,-4.0017078 c -1.7454984,2.3720609 -1.7354408,5.6174519 -6e-7,8.035443 z"
     style="fill:#000000;fill-opacity:1;fill-rule:evenodd;stroke:#000000;stroke-width:0.625;stroke-linejoin:round;stroke-opacity:1"
     id="path5630-6" /></marker><inkscape:path-effect
   effect="powerstroke"
   id="path-effect5622-7"
   is_visible="true"
   offset_points="0.99024574,0.0071112986"
   sort_points="true"
   interpolator_type="CubicBezierJohan"
   interpolator_beta="0.2"
   start_linecap_type="zerowidth"
   linejoin_type="extrp_arc"
   miter_limit="4"
   end_linecap_type="zerowidth" />














</defs><sodipodi:namedview
     pagecolor="#ffffff"
     bordercolor="#666666"
     borderopacity="1"
     objecttolerance="10"
     gridtolerance="10"
     guidetolerance="10"
     inkscape:pageopacity="0"
     inkscape:pageshadow="2"
     inkscape:window-width="1301"
     inkscape:window-height="744"
     id="namedview4"
     showgrid="false"
     inkscape:zoom="0.7520504"
     inkscape:cx="151.49501"
     inkscape:cy="258.94104"
     inkscape:window-x="65"
     inkscape:window-y="24"
     inkscape:window-maximized="1"
     inkscape:current-layer="g10" /><g
     id="g10"
     inkscape:groupmode="layer"
     inkscape:label="sanet.cd.1482244918"
     transform="matrix(1.3333333,0,0,-1.3333333,-169.28436,838.83998)"><text
   style="font-variant:normal;font-weight:normal;font-stretch:normal;font-size:14.94839859px;font-family:'Times New Roman';-inkscape-font-specification:TimesNewRomanPSMT;writing-mode:lr-tb;fill:#231f20;fill-opacity:1;fill-rule:nonzero;stroke:none;stroke-width:0.62285"
   id="text114-2"
   x="429.81799"
   y="-583.88269"
   transform="scale(1,-1)"><tspan
     x="429.81799"
     y="-583.88269"
     id="tspan112-7"
     style="stroke-width:0.62285" /></text>
















<g
   id="g76"
   transform="matrix(0,-0.62285,0.62285,0,262.83315,524.87993)"><path
     d="m 0,0 c -0.12,0 -0.239,0.06 -0.36,0.12 l -166.86,160.14 c -0.18,0.18 -0.18,0.36 -0.12,0.54 0.06,0.179 0.24,0.301 0.42,0.359 l 262.441,6 c 0.12,0.061 0.239,0 0.359,-0.119 L 274.86,6.24 c 0.18,-0.12 0.241,-0.36 0.12,-0.54 -0.06,-0.18 -0.24,-0.301 -0.419,-0.36 z m 274.5,6.36 -0.3,-0.84 -178.98,160.799 0.36,-0.119 -262.44,-6.06 0.3,0.839 L 0.36,0.84 0,0.96"
     style="fill:#110f0d;fill-opacity:1;fill-rule:nonzero;stroke:none"
     id="path78"
     inkscape:connector-curvature="0" /></g><path
   d="m 183.30803,408.73444 v 63.75091 h -0.44907 v -63.75091 z m -2.0934,0.26136 1.86855,-4.09365 1.86855,4.09365"
   style="fill:#110f0d;fill-opacity:1;fill-rule:nonzero;stroke:none;stroke-width:0.39949068"
   id="path80"
   inkscape:connector-curvature="0"
   sodipodi:nodetypes="cccccccc" /><g
   id="g82"
   transform="matrix(0,-0.62285,0.67211852,0,308.51669,473.12072)"><path
     d="M 0,0 0.6,247.979 H 1.38 L 0.72,0 Z m -1.98,247.02 3,6 3,-6.061"
     style="fill:#110f0d;fill-opacity:1;fill-rule:nonzero;stroke:none"
     id="path84"
     inkscape:connector-curvature="0" /></g><g
   id="g86"
   transform="matrix(0,-0.62285,0.62285,0,182.5603,472.63534)"><path
     d="m 0,0 61.979127,-75.655131 0.481,0.54 L 0.48,0.6 Z m 59.519127,-77.035131 6.54,-1.62 -2.639,6.179"
     style="fill:#110f0d;fill-opacity:1;fill-rule:nonzero;stroke:none"
     id="path88"
     inkscape:connector-curvature="0"
     sodipodi:nodetypes="cccccccc" /></g><path
   d="m 183.08318,472.7102 v -0.44907 h 79.82446 v 0.44907 z"
   style="fill:#110f0d;fill-opacity:1;fill-rule:nonzero;stroke:none;stroke-width:0.62285"
   id="path90"
   inkscape:connector-curvature="0" /><g
   id="g92"
   transform="matrix(0,-0.62285,0.4985677,0,262.90795,472.26125)"><path
     d="m 0,0 v 3 h -0.78 l 0.059,-3 z m -0.78,5.279 h 0.72 v 3 h -0.72 z m 0.719,5.221 -0.059,3 h -0.72 v -3 z m -0.059,5.279 v 3 H -0.9 l 0.06,-3 z m 0,5.221 -0.061,3 H -0.9 v -3 z m -0.84,5.279 h 0.779 v 3 H -0.96 Z m 0.72,5.221 v 3 h -0.781 l 0.061,-3 z m 0,5.279 -0.06,3 h -0.721 v -3 z M -0.3,42 v 3 h -0.78 l 0.059,-3 z m -0.78,5.279 h 0.72 v 3 h -0.72 z m 0.72,5.221 -0.06,3 h -0.721 v -3 z m -0.06,5.279 v 3 H -1.2 l 0.059,-3 z m 0,5.221 -0.06,3 H -1.2 v -3 z m -0.841,5.279 h 0.78 v 3 h -0.78 z m 0,5.221 h 0.721 v 3 h -0.721 z m 0.721,5.279 -0.061,3 H -1.32 v -3 z M -0.601,84 v 3 H -1.38 l 0.06,-3 z m 0,5.279 -0.059,3 h -0.72 v -3"
     style="fill:#110f0d;fill-opacity:1;fill-rule:nonzero;stroke:none"
     id="path94"
     inkscape:connector-curvature="0" /></g><g
   aria-label="Y"
   transform="scale(1,-1)"
   style="font-style:normal;font-variant:normal;font-weight:normal;font-stretch:normal;font-size:14px;font-family:sans-serif;-inkscape-font-specification:'sans-serif, Normal';font-variant-ligatures:normal;font-variant-caps:normal;font-variant-numeric:normal;font-feature-settings:normal;text-align:start;writing-mode:lr-tb;text-anchor:start;fill:#231f20;fill-opacity:1;fill-rule:nonzero;stroke:none;stroke-width:0.62285"
   id="text98"><path
     d="m 177.13202,-406.78832 0.084,-0.434 h -3.486 l -0.084,0.434 c 0.798,0.14 1.26,0.392 0.56,1.218 l -2.604,3.052 -1.33,-3.192 c -0.294,-0.714 -0.042,-0.938 1.106,-1.078 l 0.084,-0.434 h -3.99 l -0.084,0.434 c 0.742,0.182 0.952,0.392 1.372,1.4 l 1.596,3.724 -0.392,1.96 c -0.224,1.134 -0.504,1.484 -1.218,1.54 l -0.588,0.042 -0.084,0.434 h 4.368 l 0.084,-0.434 -0.56,-0.042 c -0.686,-0.056 -0.826,-0.406 -0.602,-1.54 l 0.392,-1.988 3.024,-3.542 c 0.952,-1.12 1.33,-1.358 2.352,-1.554 z"
     style="font-style:italic;font-variant:normal;font-weight:normal;font-stretch:normal;font-size:14px;font-family:'TeX Gyre Bonum Math';-inkscape-font-specification:'TeX Gyre Bonum Math Italic';font-variant-ligatures:normal;font-variant-caps:normal;font-variant-numeric:normal;font-feature-settings:normal;text-align:start;writing-mode:lr-tb;text-anchor:start;stroke-width:0.62285"
     id="path1172" /></g><g
   aria-label="Z"
   transform="scale(1,-1)"
   style="font-style:normal;font-variant:normal;font-weight:normal;font-stretch:normal;font-size:14px;font-family:sans-serif;-inkscape-font-specification:'sans-serif, Normal';font-variant-ligatures:normal;font-variant-caps:normal;font-variant-numeric:normal;font-feature-settings:normal;text-align:start;writing-mode:lr-tb;text-anchor:start;fill:#231f20;fill-opacity:1;fill-rule:nonzero;stroke:none;stroke-width:0.62285"
   id="text102"><path
     d="m 484.16297,-460.87873 -0.392,-0.182 c -1.204,1.764 -2.688,2.45 -5.334,2.45 -0.63,0 -1.008,-0.028 -1.778,-0.112 l 8.218,-8.302 -0.056,-0.518 h -6.93 l -1.526,2.534 0.434,0.168 c 1.442,-1.554 2.618,-2.114 4.452,-2.114 0.616,0 1.036,0.042 1.638,0.168 l -8.26,8.344 0.182,0.434 h 7.77 z"
     style="font-style:italic;font-variant:normal;font-weight:normal;font-stretch:normal;font-size:14px;font-family:'TeX Gyre Bonum Math';-inkscape-font-specification:'TeX Gyre Bonum Math Italic';font-variant-ligatures:normal;font-variant-caps:normal;font-variant-numeric:normal;font-feature-settings:normal;text-align:start;writing-mode:lr-tb;text-anchor:start;stroke-width:0.62285"
     id="path1088" /></g><g
   aria-label="X"
   transform="scale(1,-1)"
   style="font-style:italic;font-variant:normal;font-weight:normal;font-stretch:normal;font-size:14px;font-family:'TeX Gyre Bonum Math';-inkscape-font-specification:'TeX Gyre Bonum Math Italic';font-variant-ligatures:normal;font-variant-caps:normal;font-variant-numeric:normal;font-feature-settings:normal;text-align:start;writing-mode:lr-tb;text-anchor:start;fill:#231f20;fill-opacity:1;fill-rule:nonzero;stroke:none;stroke-width:0.62285"
   id="text114"><path
     d="m 139.93699,-418.24442 0.084,-0.434 c -0.924,-0.112 -1.274,-0.364 -1.764,-1.26 l -1.988,-3.5 2.282,-2.254 c 1.302,-1.246 1.68,-1.47 2.814,-1.652 l 0.084,-0.434 h -3.766 l -0.084,0.434 c 1.12,0.028 1.036,0.63 0.448,1.26 l -2.058,2.1 -1.288,-2.268 c -0.392,-0.602 -0.07,-1.05 1.05,-1.092 l 0.084,-0.434 h -4.34 l -0.084,0.434 c 0.784,0.084 1.12,0.322 1.54,1.092 l 1.806,3.066 -2.744,2.618 c -1.204,1.176 -1.736,1.512 -2.982,1.89 l -0.084,0.434 h 3.948 l 0.084,-0.434 c -0.924,-0.042 -1.176,-0.658 -0.602,-1.274 l 2.674,-2.66 1.442,2.618 c 0.518,0.952 0.042,1.162 -1.064,1.316 l -0.084,0.434 z"
     style="font-style:italic;font-variant:normal;font-weight:normal;font-stretch:normal;font-size:14px;font-family:'TeX Gyre Bonum Math';-inkscape-font-specification:'TeX Gyre Bonum Math Italic';font-variant-ligatures:normal;font-variant-caps:normal;font-variant-numeric:normal;font-feature-settings:normal;text-align:start;writing-mode:lr-tb;text-anchor:start;stroke-width:0.62285"
     id="path1175" /></g><g
   aria-label="O"
   transform="scale(1,-1)"
   style="font-style:normal;font-variant:normal;font-weight:normal;font-stretch:normal;font-size:14px;font-family:'TeX Gyre Bonum Math';-inkscape-font-specification:'TeX Gyre Bonum Math, Normal';font-variant-ligatures:normal;font-variant-caps:normal;font-variant-numeric:normal;font-feature-settings:normal;text-align:start;writing-mode:lr-tb;text-anchor:start;fill:#231f20;fill-opacity:1;fill-rule:nonzero;stroke:none;stroke-width:0.62285"
   id="text118"><path
     d="m 179.13816,-479.45975 c 0.574,-2.884 -1.092,-4.984 -3.962,-4.984 -2.814,0 -5.474,2.17 -6.02,4.914 -0.574,2.828 1.148,4.984 3.976,4.984 2.408,0 5.362,-1.708 6.006,-4.914 z m -1.68,0.084 c -0.504,2.52 -2.142,4.158 -4.172,4.158 -2.044,0 -3.01,-1.68 -2.492,-4.298 0.518,-2.576 2.184,-4.256 4.214,-4.256 2.044,0 2.996,1.694 2.45,4.396 z"
     style="font-style:italic;font-variant:normal;font-weight:normal;font-stretch:normal;font-size:14px;font-family:'TeX Gyre Bonum Math';-inkscape-font-specification:'TeX Gyre Bonum Math Italic';font-variant-ligatures:normal;font-variant-caps:normal;font-variant-numeric:normal;font-feature-settings:normal;text-align:start;writing-mode:lr-tb;text-anchor:start;stroke-width:0.62285"
     id="path1178" /></g><g
   id="g136"
   transform="matrix(0,-0.62285,0.62285,0,308.91128,538.07171)"><path
     d="M 0,0 -92.88,176.34 -93.54,175.98 -0.72,-0.3"
     style="fill:#110f0d;fill-opacity:1;fill-rule:nonzero;stroke:none"
     id="path138"
     inkscape:connector-curvature="0" /></g><g
   id="g140"
   transform="matrix(0,-0.62285,0.62285,0,183.1953,472.299)"><path
     d="m 0,0 -67.26,128.16 -0.66,-0.3 67.26,-128.219"
     style="fill:#110f0d;fill-opacity:1;fill-rule:nonzero;stroke:none"
     id="path142"
     inkscape:connector-curvature="0" /></g><g
   id="g144"
   transform="matrix(0,-0.62285,0.62285,0,263.01988,514.1917)"><path
     d="M 0,0 -1.38,2.7 -2.04,2.34 -0.66,-0.3 Z M -2.46,4.68 -3.84,7.32 -4.5,7.021 -3.12,4.32 Z M -4.86,9.36 -6.24,12 -6.899,11.64 -5.521,9 Z m -2.4,4.62 -1.38,2.7 -0.72,-0.36 1.44,-2.7 z m -2.46,4.68 -1.381,2.64 -0.659,-0.36 1.38,-2.64 z m -2.4,4.62 -1.38,2.7 -0.66,-0.36 1.38,-2.64 z m -2.46,4.68 -1.38,2.64 -0.66,-0.3 1.38,-2.7 z m -2.399,4.68 -1.381,2.64 -0.661,-0.36 1.381,-2.64 z m -2.401,4.62 -1.38,2.7 -0.719,-0.36 1.439,-2.7 z m -2.46,4.68 -1.38,2.64 -0.66,-0.36 1.38,-2.64 z m -2.399,4.621 -1.381,2.699 -0.66,-0.36 1.381,-2.64 z m -2.461,4.679 -1.38,2.64 -0.659,-0.3 1.379,-2.7 z m -2.401,4.68 -1.378,2.641 -0.661,-0.361 1.38,-2.639 z m -2.399,4.62 -1.38,2.7 -0.72,-0.36 1.44,-2.64 z m -2.46,4.68 -1.38,2.64 -0.66,-0.36 1.38,-2.64 z m -2.4,4.68 -1.38,2.64 -0.66,-0.36 1.38,-2.64"
     style="fill:#110f0d;fill-opacity:1;fill-rule:nonzero;stroke:none"
     id="path146"
     inkscape:connector-curvature="0" /></g><g
   id="g148"
   transform="matrix(0,-0.62285,0.62285,0,305.87525,537.52736)"><path
     d="M 3.9428001e-4,1.632068 C -1.1587132,1.632068 -2.1179745,2.5177379 -2.1179745,3.6007701 c 0,1.0819388 0.9592613,1.9676087 2.11836878001,1.9676087 C 1.1595017,5.5683788 2.1187631,4.6827089 2.1187631,3.6007701 2.1187631,2.5177379 1.1595017,1.632068 3.9428001e-4,1.632068"
     style="fill:#110f0d;fill-opacity:1;fill-rule:evenodd;stroke:none;stroke-width:0.60348386"
     id="path150"
     inkscape:connector-curvature="0" /></g><g
   id="g152"
   transform="matrix(0,-0.41491384,0.34051822,0,306.54462,537.50217)"
   style="paint-order:stroke fill markers"><path
     d="m 0,0 -0.84,0.12 c -4.433,0.998 -4.483,7.857 -0.12,9 l 0.84,0.12 C 4.771,9.081 5.6,2.07 1.26,0.24 L 0.84,0.12 0.42,0.06 Z M 0.06,2.04 H 0.3 L 0.48,2.1 C 2.766,2.85 2.585,6.837 0.18,7.2 L 0,7.26 H -0.18 C -2.731,6.831 -2.919,2.869 -0.54,2.1 L -0.3,2.04 h 0.18"
     style="fill:#110f0d;fill-opacity:1;fill-rule:nonzero;stroke:none;paint-order:stroke fill markers"
     id="path154"
     inkscape:connector-curvature="0" /></g><g
   aria-label="c"
   transform="scale(1,-1)"
   style="font-style:normal;font-variant:normal;font-weight:normal;font-stretch:normal;font-size:8px;font-family:sans-serif;-inkscape-font-specification:'sans-serif, Normal';font-variant-ligatures:normal;font-variant-caps:normal;font-variant-numeric:normal;font-feature-settings:normal;text-align:start;writing-mode:lr-tb;text-anchor:start;fill:#231f20;fill-opacity:1;fill-rule:nonzero;stroke:none;stroke-width:0.62285"
   id="text176"><path
     d="m 325.48624,-529.35653 -0.648,-0.336 c -0.288,0.52 -0.664,0.784 -1.128,0.784 -0.576,0 -0.952,-0.544 -0.952,-1.376 0,-0.808 0.28,-1.272 0.768,-1.272 0.24,0 0.448,0.152 0.448,0.32 v 0.232 c 0,0.28 0.32,0.544 0.664,0.544 0.376,0 0.664,-0.28 0.664,-0.656 0,-0.656 -0.784,-1.176 -1.776,-1.176 -1.328,0 -2.192,0.824 -2.192,2.08 0,1.232 0.872,2.08 2.136,2.08 0.952,0 1.696,-0.456 2.016,-1.224 z"
     style="font-style:normal;font-variant:normal;font-weight:bold;font-stretch:normal;font-size:8px;font-family:'TeX Gyre Bonum';-inkscape-font-specification:'TeX Gyre Bonum Bold';font-variant-ligatures:normal;font-variant-caps:normal;font-variant-numeric:normal;font-feature-settings:normal;text-align:start;writing-mode:lr-tb;text-anchor:start;stroke-width:0.62285"
     id="path1125" /></g><g
   aria-label="(u,v)"
   transform="scale(1,-1)"
   style="font-style:normal;font-variant:normal;font-weight:normal;font-stretch:normal;font-size:12px;font-family:sans-serif;-inkscape-font-specification:'sans-serif, Normal';font-variant-ligatures:normal;font-variant-caps:normal;font-variant-numeric:normal;font-feature-settings:normal;text-align:start;writing-mode:lr-tb;text-anchor:start;fill:#231f20;fill-opacity:1;fill-rule:nonzero;stroke:none;stroke-width:0.62285"
   id="text180"><path
     d="m 329.73345,-530.15187 c -1.344,-0.744 -1.488,-2.4 -1.08,-4.452 l 0.168,-0.84 c 0.408,-2.052 1.224,-3.708 2.856,-4.452 l -0.108,-0.336 c -1.872,0.852 -3.408,2.412 -3.888,4.788 l -0.168,0.84 c -0.48,2.376 0.432,3.936 1.968,4.788 z"
     style="font-style:italic;font-variant:normal;font-weight:normal;font-stretch:normal;font-size:12px;font-family:'TeX Gyre Bonum Math';-inkscape-font-specification:'TeX Gyre Bonum Math Italic';font-variant-ligatures:normal;font-variant-caps:normal;font-variant-numeric:normal;font-feature-settings:normal;text-align:start;writing-mode:lr-tb;text-anchor:start;stroke-width:0.62285"
     id="path1114" /><path
     d="m 338.34729,-531.90387 0.072,-0.36 -0.3,-0.024 c -0.516,-0.06 -0.672,-0.336 -0.54,-0.996 l 0.888,-4.44 h -0.408 c -0.648,0.144 -0.9,0.168 -1.86,0.24 l -0.072,0.36 0.288,0.024 c 0.6,0.048 0.732,0.276 0.588,0.996 l -0.54,2.676 c -0.936,0.708 -1.716,1.056 -2.304,1.056 -0.756,0 -1.008,-0.408 -0.828,-1.32 l 0.804,-4.032 h -0.408 c -0.648,0.144 -0.924,0.18 -1.86,0.24 l -0.072,0.36 0.288,0.024 c 0.6,0.048 0.732,0.276 0.588,0.996 l -0.504,2.508 c -0.288,1.44 0.564,1.8 1.428,1.8 0.864,0 1.584,-0.288 2.772,-1.116 l -0.204,1.008 z"
     style="font-style:italic;font-variant:normal;font-weight:normal;font-stretch:normal;font-size:12px;font-family:'TeX Gyre Bonum Math';-inkscape-font-specification:'TeX Gyre Bonum Math Italic';font-variant-ligatures:normal;font-variant-caps:normal;font-variant-numeric:normal;font-feature-settings:normal;text-align:start;writing-mode:lr-tb;text-anchor:start;stroke-width:0.62285"
     id="path1116" /><path
     d="m 340.73347,-532.27587 c 0.12,-0.588 -0.156,-1.032 -0.636,-1.032 -0.432,0 -0.816,0.336 -0.912,0.792 -0.072,0.384 0.132,0.684 0.48,0.684 0.156,0 0.252,-0.036 0.48,-0.18 -0.228,0.564 -0.576,0.924 -1.128,1.212 l 0.084,0.24 c 0.912,-0.372 1.488,-0.972 1.632,-1.716 z"
     style="font-style:italic;font-variant:normal;font-weight:normal;font-stretch:normal;font-size:12px;font-family:'TeX Gyre Bonum Math';-inkscape-font-specification:'TeX Gyre Bonum Math Italic';font-variant-ligatures:normal;font-variant-caps:normal;font-variant-numeric:normal;font-feature-settings:normal;text-align:start;writing-mode:lr-tb;text-anchor:start;stroke-width:0.62285"
     id="path1118" /><path
     d="m 349.22256,-537.33987 0.072,-0.384 h -2.472 l -0.072,0.36 c 0.78,0.12 0.804,0.492 0.42,1.116 l -1.896,3.288 -0.648,-3.564 c -0.084,-0.696 0.108,-0.756 0.84,-0.84 l 0.072,-0.36 h -2.928 l -0.072,0.372 c 0.516,0.084 0.66,0.216 0.816,0.828 l 0.984,4.62 h 0.708 l 2.688,-4.248 c 0.468,-0.708 0.888,-1.056 1.488,-1.188 z"
     style="font-style:italic;font-variant:normal;font-weight:normal;font-stretch:normal;font-size:12px;font-family:'TeX Gyre Bonum Math';-inkscape-font-specification:'TeX Gyre Bonum Math Italic';font-variant-ligatures:normal;font-variant-caps:normal;font-variant-numeric:normal;font-feature-settings:normal;text-align:start;writing-mode:lr-tb;text-anchor:start;stroke-width:0.62285"
     id="path1120" /><path
     d="m 353.80478,-534.60387 0.168,-0.84 c 0.48,-2.376 -0.432,-3.936 -1.98,-4.788 l -0.24,0.336 c 1.332,0.744 1.488,2.4 1.08,4.452 l -0.168,0.84 c -0.408,2.052 -1.236,3.708 -2.856,4.452 l 0.096,0.336 c 1.884,-0.852 3.42,-2.412 3.9,-4.788 z"
     style="font-style:italic;font-variant:normal;font-weight:normal;font-stretch:normal;font-size:12px;font-family:'TeX Gyre Bonum Math';-inkscape-font-specification:'TeX Gyre Bonum Math Italic';font-variant-ligatures:normal;font-variant-caps:normal;font-variant-numeric:normal;font-feature-settings:normal;text-align:start;writing-mode:lr-tb;text-anchor:start;stroke-width:0.62285"
     id="path1122" /></g><g
   id="g190"
   transform="matrix(0,-0.62285,0.62285,0,308.42036,535.82939)"><path
     d="M 0,0 101.7,1.08 V 0.3 L 0,-0.779"
     style="fill:#ed1f24;fill-opacity:1;fill-rule:nonzero;stroke:none;paint-order:stroke fill markers"
     id="path192"
     inkscape:connector-curvature="0" /></g><g
   id="g194"
   transform="matrix(0,-0.62195664,0.62285,0,419.05366,595.45744)"><path
     d="M 0,0 197.34,1.02 V 0.3 L 0,-0.78"
     style="fill:#ed1f24;fill-opacity:1;fill-rule:nonzero;stroke:none"
     id="path196"
     inkscape:connector-curvature="0" /></g><g
   id="g218"
   transform="matrix(-0.00642554,-0.62278929,0.46016553,-0.00869634,191.74143,408.76566)"><path
     d="M 0,0 -3.24,250.619 H -4.02 L -0.78,0 Z m -3.42,0.96 3.12,-5.94 2.88,6 z m 2.82,248.699 -3.06,5.941 -2.94,-6"
     style="fill:#110f0d;fill-opacity:1;fill-rule:nonzero;stroke:none"
     id="path220"
     inkscape:connector-curvature="0" /></g><g
   aria-label="f"
   transform="scale(1,-1)"
   style="font-style:normal;font-variant:normal;font-weight:normal;font-stretch:normal;font-size:14px;font-family:sans-serif;-inkscape-font-specification:'sans-serif, Normal';font-variant-ligatures:normal;font-variant-caps:normal;font-variant-numeric:normal;font-feature-settings:normal;text-align:start;writing-mode:lr-tb;text-anchor:start;fill:#231f20;fill-opacity:1;fill-rule:nonzero;stroke:none;stroke-width:0.62285"
   id="text224"><path
     d="m 250.89611,-421.83902 c 0.098,-0.462 -0.35,-0.798 -1.036,-0.798 -0.588,0 -3.136,0.21 -3.668,2.828 l -0.126,0.658 h -1.176 l -0.098,0.462 h 1.176 l -0.938,4.718 c -0.154,0.77 -0.476,1.092 -1.106,1.162 l -0.35,0.028 -0.084,0.42 h 3.766 l 0.084,-0.42 -0.35,-0.028 c -0.602,-0.07 -0.784,-0.392 -0.63,-1.162 l 0.938,-4.718 h 1.386 l 0.098,-0.462 h -1.386 l 0.294,-1.484 c 0.238,-1.148 0.91,-1.4 1.302,-1.4 0.238,0 0.42,0.14 0.574,0.406 0.154,0.266 0.322,0.392 0.574,0.392 0.336,0 0.7,-0.28 0.756,-0.602 z"
     style="font-style:italic;font-variant:normal;font-weight:normal;font-stretch:normal;font-size:14px;font-family:'TeX Gyre Bonum Math';-inkscape-font-specification:'TeX Gyre Bonum Math Italic';font-variant-ligatures:normal;font-variant-caps:normal;font-variant-numeric:normal;font-feature-settings:normal;text-align:start;writing-mode:lr-tb;text-anchor:start;stroke-width:0.62285"
     id="path1169" /></g><path
   style="opacity:1;fill:#000000;fill-rule:nonzero;stroke:#000000;stroke-width:0.70708299;stroke-linecap:butt;stroke-linejoin:miter;stroke-miterlimit:4;stroke-dasharray:none;stroke-dashoffset:0;stroke-opacity:1;marker-end:url(#marker5632)"
   d="m 363.56895,602.30714 c -0.10793,5.29682 -0.43158,21.18729 -0.53951,26.48411 -4e-5,0.002 -3.1e-4,0.007 -3.5e-4,0.009 4e-5,-0.002 -10e-6,-0.007 3e-5,-0.009 0.10793,-5.29682 0.4319,-21.18728 0.53983,-26.4841 z"
   id="path5620"
   inkscape:connector-curvature="0"
   inkscape:path-effect="#path-effect5622"
   inkscape:original-d="m 363.56895,602.30714 -0.53986,26.49321"
   sodipodi:nodetypes="cc" /><path
   style="opacity:1;fill:#000000;fill-rule:nonzero;stroke:#000000;stroke-width:0.67356908;stroke-linecap:butt;stroke-linejoin:miter;stroke-miterlimit:4;stroke-dasharray:none;stroke-dashoffset:0;stroke-opacity:1;marker-end:url(#marker5632-3)"
   d="m 343.65534,608.75163 c 3.87299,3.97968 15.48685,15.92369 19.35984,19.90337 0.0382,0.0392 0.1577,0.15185 0.19585,0.19105 -0.0381,-0.0392 -0.1475,-0.16176 -0.18565,-0.20097 -3.87299,-3.97968 -15.49705,-15.91377 -19.37004,-19.89345 z"
   id="path5620-5"
   inkscape:connector-curvature="0"
   inkscape:path-effect="#path-effect5622-7"
   inkscape:original-d="m 343.65534,608.75163 19.55569,20.09442"
   sodipodi:nodetypes="cc" /><g
   aria-label="v"
   transform="scale(1,-1)"
   style="font-style:normal;font-variant:normal;font-weight:normal;font-stretch:normal;font-size:12px;font-family:sans-serif;-inkscape-font-specification:'sans-serif, Normal';font-variant-ligatures:normal;font-variant-caps:normal;font-variant-numeric:normal;font-feature-settings:normal;text-align:start;writing-mode:lr-tb;text-anchor:start;fill:#231f20;fill-opacity:1;fill-rule:nonzero;stroke:none;stroke-width:0.62285"
   id="text180-3"><path
     d="m 375.4736,-602.70242 0.072,-0.384 h -2.472 l -0.072,0.36 c 0.78,0.12 0.804,0.492 0.42,1.116 l -1.896,3.288 -0.648,-3.564 c -0.084,-0.696 0.108,-0.756 0.84,-0.84 l 0.072,-0.36 h -2.928 l -0.072,0.372 c 0.516,0.084 0.66,0.216 0.816,0.828 l 0.984,4.62 h 0.708 l 2.688,-4.248 c 0.468,-0.708 0.888,-1.056 1.488,-1.188 z"
     style="font-style:italic;font-variant:normal;font-weight:normal;font-stretch:normal;font-size:12px;font-family:'TeX Gyre Bonum Math';-inkscape-font-specification:'TeX Gyre Bonum Math Italic';font-variant-ligatures:normal;font-variant-caps:normal;font-variant-numeric:normal;font-feature-settings:normal;text-align:start;writing-mode:lr-tb;text-anchor:start;stroke-width:0.62285"
     id="path1108" /></g><g
   aria-label="u"
   transform="scale(1,-1)"
   style="font-style:normal;font-variant:normal;font-weight:normal;font-stretch:normal;font-size:12px;font-family:sans-serif;-inkscape-font-specification:'sans-serif, Normal';font-variant-ligatures:normal;font-variant-caps:normal;font-variant-numeric:normal;font-feature-settings:normal;text-align:start;writing-mode:lr-tb;text-anchor:start;fill:#231f20;fill-opacity:1;fill-rule:nonzero;stroke:none;stroke-width:0.62285"
   id="text180-3-6"><path
     d="m 342.27109,-610.0827 0.072,-0.36 -0.3,-0.024 c -0.516,-0.06 -0.672,-0.336 -0.54,-0.996 l 0.888,-4.44 h -0.408 c -0.648,0.144 -0.9,0.168 -1.86,0.24 l -0.072,0.36 0.288,0.024 c 0.6,0.048 0.732,0.276 0.588,0.996 l -0.54,2.676 c -0.936,0.708 -1.716,1.056 -2.304,1.056 -0.756,0 -1.008,-0.408 -0.828,-1.32 l 0.804,-4.032 h -0.408 c -0.648,0.144 -0.924,0.18 -1.86,0.24 l -0.072,0.36 0.288,0.024 c 0.6,0.048 0.732,0.276 0.588,0.996 l -0.504,2.508 c -0.288,1.44 0.564,1.8 1.428,1.8 0.864,0 1.584,-0.288 2.772,-1.116 l -0.204,1.008 z"
     style="font-style:italic;font-variant:normal;font-weight:normal;font-stretch:normal;font-size:12px;font-family:'TeX Gyre Bonum Math';-inkscape-font-specification:'TeX Gyre Bonum Math Italic';font-variant-ligatures:normal;font-variant-caps:normal;font-variant-numeric:normal;font-feature-settings:normal;text-align:start;writing-mode:lr-tb;text-anchor:start;stroke-width:0.62285"
     id="path1111" /></g><g
   aria-label="x(x,y,z)"
   transform="scale(1,-1)"
   style="font-variant:normal;font-weight:normal;font-stretch:normal;font-size:14.94839859px;font-family:'Times New Roman';-inkscape-font-specification:TimesNewRomanPSMT;writing-mode:lr-tb;fill:#231f20;fill-opacity:1;fill-rule:nonzero;stroke:none;stroke-width:0.62285"
   id="text114-0"><path
     d="m 439.71,-593.40259 v -1.21079 c -1.04636,-0.22422 -1.37522,-0.40359 -1.92829,-1.10615 l -1.39017,-1.79376 0.89688,-0.79224 c 1.1809,-1.18089 1.8685,-1.30048 2.31694,-1.39017 v -1.21078 h -3.58752 v 1.21078 c 0.16443,0.0149 0.50824,0.0448 0.50824,0.23917 0,0.0747 -0.0747,0.19433 -0.23917,0.34381 l -0.64277,0.61286 -0.47833,-0.62781 c -0.0897,-0.11959 -0.14948,-0.20927 -0.14948,-0.29896 0,-0.14948 0.17937,-0.23917 0.59792,-0.26907 v -1.21078 h -4.30503 v 1.21078 c 0.92678,0.11959 1.16595,0.31391 1.76387,1.151 l 0.92677,1.25563 -1.07625,1.16595 c -1.13605,1.22573 -1.28553,1.31542 -1.92829,1.50974 v 1.21079 h 3.66226 v -1.21079 c -0.50824,-0.0448 -0.76235,-0.14948 -0.76235,-0.3438 0,-0.10464 0.0897,-0.22422 0.23917,-0.4036 l 0.7175,-0.80719 0.59792,0.80719 c 0.14948,0.19433 0.22422,0.32886 0.22422,0.4335 0,0.14948 -0.19432,0.23916 -0.59792,0.3139 v 1.21079 z"
     style="font-style:normal;font-variant:normal;font-weight:bold;font-stretch:normal;font-size:14.94799995px;line-height:1.25;font-family:'TeX Gyre Bonum';-inkscape-font-specification:'TeX Gyre Bonum Bold';font-variant-ligatures:normal;font-variant-caps:normal;font-variant-numeric:normal;font-feature-settings:normal;text-align:start;writing-mode:lr-tb;text-anchor:start"
     id="path1091" /><path
     d="m 445.07049,-591.22018 c -1.67417,-0.92678 -1.85355,-2.9896 -1.34532,-5.54571 l 0.20928,-1.04636 c 0.50823,-2.55611 1.52469,-4.61893 3.55762,-5.54571 l -0.13453,-0.41854 c -2.33189,1.06131 -4.24523,3.00455 -4.84315,5.96425 l -0.20928,1.04636 c -0.59792,2.95971 0.53813,4.90295 2.45148,5.96425 z"
     style="font-style:italic;font-variant:normal;font-weight:normal;font-stretch:normal;font-size:14.94799995px;font-family:'TeX Gyre Bonum Math';-inkscape-font-specification:'TeX Gyre Bonum Math Italic';font-variant-ligatures:normal;font-variant-caps:normal;font-variant-numeric:normal;font-feature-settings:normal;text-align:start;writing-mode:lr-tb;text-anchor:start"
     id="path1093" /><path
     d="m 455.30964,-593.40259 0.0897,-0.44844 c -0.7773,-0.13453 -1.01647,-0.31391 -1.50975,-1.10615 l -1.5247,-2.6159 1.56954,-1.39016 c 0.97162,-0.79225 1.46491,-1.04636 2.49632,-1.24069 l 0.0897,-0.44844 h -3.15403 l -0.0897,0.44844 c 0.43349,0.0598 0.91183,0.17938 0.3737,0.7474 l -1.55459,1.43501 -0.89688,-1.43501 c -0.28401,-0.55307 0.0299,-0.67266 0.73245,-0.7474 l 0.0897,-0.44844 h -3.7071 l -0.0897,0.44844 c 0.70255,0.10464 0.92677,0.28401 1.34532,0.91183 l 1.30047,2.19736 -2.31694,2.13756 c -0.82214,0.76235 -1.27058,1.00152 -2.00303,1.10615 l -0.0897,0.44844 h 3.34836 l 0.0897,-0.44844 c -0.94172,-0.13453 -1.16594,-0.50823 -0.50823,-1.10615 l 1.82366,-1.67418 0.97162,1.88345 c 0.23917,0.44844 0.0598,0.76235 -0.92678,0.89688 l -0.0897,0.44844 z"
     style="font-style:italic;font-variant:normal;font-weight:normal;font-stretch:normal;font-size:14.94799995px;font-family:'TeX Gyre Bonum Math';-inkscape-font-specification:'TeX Gyre Bonum Math Italic';font-variant-ligatures:normal;font-variant-caps:normal;font-variant-numeric:normal;font-feature-settings:normal;text-align:start;writing-mode:lr-tb;text-anchor:start"
     id="path1095" /><path
     d="m 458.50174,-593.86598 c 0.14948,-0.73245 -0.19432,-1.28552 -0.79224,-1.28552 -0.53813,0 -1.01647,0.41854 -1.13605,0.98656 -0.0897,0.47834 0.16443,0.85204 0.59792,0.85204 0.19432,0 0.31391,-0.0448 0.59792,-0.22422 -0.28401,0.70256 -0.71751,1.151 -1.40511,1.50975 l 0.10463,0.29896 c 1.13605,-0.46339 1.85355,-1.21079 2.03293,-2.13757 z"
     style="font-style:italic;font-variant:normal;font-weight:normal;font-stretch:normal;font-size:14.94799995px;font-family:'TeX Gyre Bonum Math';-inkscape-font-specification:'TeX Gyre Bonum Math Italic';font-variant-ligatures:normal;font-variant-caps:normal;font-variant-numeric:normal;font-feature-settings:normal;text-align:start;writing-mode:lr-tb;text-anchor:start"
     id="path1097" /><path
     d="m 469.4334,-600.18898 0.0897,-0.46339 h -3.28856 l -0.0897,0.44844 c 0.91183,0.17938 1.27058,0.34381 0.35875,1.8685 l -2.09272,3.52773 -0.95667,-4.54419 c -0.10464,-0.43349 0.14948,-0.76235 0.91183,-0.85204 l 0.0897,-0.44844 h -3.48288 l -0.0897,0.46339 c 0.70256,0.10464 0.85204,0.25412 1.00152,0.94172 l 1.43501,6.24827 -0.55308,0.86698 c -0.49328,0.80719 -1.1211,1.36027 -1.5247,1.36027 -0.14948,0 -0.28401,-0.0897 -0.43349,-0.28401 -0.29896,-0.4036 -0.43349,-0.49329 -0.73245,-0.49329 -0.43349,0 -0.85204,0.34381 -0.94172,0.73246 -0.10464,0.58297 0.40359,1.01646 1.21078,1.01646 1.73397,0 3.00455,-2.15251 3.48289,-2.9597 l 3.81174,-6.06889 c 0.52318,-0.83709 0.94172,-1.16595 1.79376,-1.36027 z"
     style="font-style:italic;font-variant:normal;font-weight:normal;font-stretch:normal;font-size:14.94799995px;font-family:'TeX Gyre Bonum Math';-inkscape-font-specification:'TeX Gyre Bonum Math Italic';font-variant-ligatures:normal;font-variant-caps:normal;font-variant-numeric:normal;font-feature-settings:normal;text-align:start;writing-mode:lr-tb;text-anchor:start"
     id="path1099" /><path
     d="m 471.34768,-593.86598 c 0.14948,-0.73245 -0.19433,-1.28552 -0.79225,-1.28552 -0.53813,0 -1.01646,0.41854 -1.13605,0.98656 -0.0897,0.47834 0.16443,0.85204 0.59792,0.85204 0.19433,0 0.31391,-0.0448 0.59792,-0.22422 -0.28401,0.70256 -0.7175,1.151 -1.40511,1.50975 l 0.10464,0.29896 c 1.13605,-0.46339 1.85355,-1.21079 2.03293,-2.13757 z"
     style="font-style:italic;font-variant:normal;font-weight:normal;font-stretch:normal;font-size:14.94799995px;font-family:'TeX Gyre Bonum Math';-inkscape-font-specification:'TeX Gyre Bonum Math Italic';font-variant-ligatures:normal;font-variant-caps:normal;font-variant-numeric:normal;font-feature-settings:normal;text-align:start;writing-mode:lr-tb;text-anchor:start"
     id="path1101" /><path
     d="m 480.3062,-595.76437 -0.38865,-0.14948 c -1.27058,1.50975 -2.25715,2.06282 -3.76689,2.06282 -0.56803,0 -0.85204,-0.0448 -1.37522,-0.20927 l 6.24826,-6.21837 -0.0897,-0.3737 h -5.59056 l -1.27058,2.19736 0.41855,0.16443 c 0.50823,-0.73246 0.82214,-1.04636 1.30047,-1.33038 0.59792,-0.35875 1.47986,-0.58297 2.28705,-0.58297 0.32885,0 0.55307,0.0299 0.97162,0.11959 l -6.14363,6.24826 0.14948,0.43349 h 5.96425 z"
     style="font-style:italic;font-variant:normal;font-weight:normal;font-stretch:normal;font-size:14.94799995px;font-family:'TeX Gyre Bonum Math';-inkscape-font-specification:'TeX Gyre Bonum Math Italic';font-variant-ligatures:normal;font-variant-caps:normal;font-variant-numeric:normal;font-feature-settings:normal;text-align:start;writing-mode:lr-tb;text-anchor:start"
     id="path1103" /><path
     d="m 485.63469,-596.76589 0.20927,-1.04636 c 0.59792,-2.9597 -0.53812,-4.90294 -2.46642,-5.96425 l -0.29896,0.41854 c 1.65923,0.92678 1.85356,2.9896 1.34532,5.54571 l -0.20927,1.04636 c -0.50823,2.55611 -1.53964,4.61893 -3.55762,5.54571 l 0.11958,0.41854 c 2.34684,-1.0613 4.26018,-3.00454 4.8581,-5.96425 z"
     style="font-style:italic;font-variant:normal;font-weight:normal;font-stretch:normal;font-size:14.94799995px;font-family:'TeX Gyre Bonum Math';-inkscape-font-specification:'TeX Gyre Bonum Math Italic';font-variant-ligatures:normal;font-variant-caps:normal;font-variant-numeric:normal;font-feature-settings:normal;text-align:start;writing-mode:lr-tb;text-anchor:start"
     id="path1105" /></g><g
   aria-label="Image Plane"
   transform="matrix(0.6691306,0.74314483,0.74314483,-0.6691306,0,0)"
   style="font-style:normal;font-variant:normal;font-weight:normal;font-stretch:normal;font-size:12px;font-family:sans-serif;-inkscape-font-specification:'sans-serif, Normal';font-variant-ligatures:normal;font-variant-caps:normal;font-variant-numeric:normal;font-feature-settings:normal;text-align:start;writing-mode:lr-tb;text-anchor:start;fill:#231f20;fill-opacity:1;fill-rule:nonzero;stroke:none;stroke-width:0.62285"
   id="text114-3"><path
     d="m 529.98662,-42.778824 0.06,-0.31 -0.19,-0.03 c -0.52,-0.09 -0.6,-0.27 -0.43,-1.1 l 0.78,-3.93 c 0.17,-0.83 0.32,-1.01 0.87,-1.1 l 0.21,-0.03 0.06,-0.31 h -2.7 l -0.06,0.31 0.19,0.03 c 0.53,0.09 0.6,0.27 0.43,1.1 l -0.78,3.93 c -0.17,0.83 -0.31,1.01 -0.87,1.1 l -0.21,0.03 -0.06,0.31 z"
     style="font-style:italic;font-variant:normal;font-weight:normal;font-stretch:normal;font-size:10px;font-family:'TeX Gyre Bonum Math';-inkscape-font-specification:'TeX Gyre Bonum Math Italic';font-variant-ligatures:normal;font-variant-caps:normal;font-variant-numeric:normal;font-feature-settings:normal;text-align:start;writing-mode:lr-tb;text-anchor:start;stroke-width:0.62285"
     id="path1148" /><path
     d="m 539.65506,-42.778824 0.06,-0.3 -0.25,-0.02 c -0.43,-0.05 -0.56,-0.28 -0.45,-0.83 l 0.49,-2.45 c 0.17,-0.84 -0.23,-1.34 -1.06,-1.34 -0.67,0 -1.23,0.22 -2.07,0.83 -0.15,-0.6 -0.48,-0.83 -1.2,-0.83 -0.7,0 -1.22,0.2 -1.97,0.76 l 0.13,-0.67 h -0.34 c -0.6,0.11 -0.92,0.15 -1.52,0.2 l -0.06,0.3 0.21,0.02 c 0.51,0.05 0.61,0.23 0.49,0.83 l -0.47,2.35 c -0.11,0.55 -0.34,0.78 -0.79,0.83 l -0.25,0.02 -0.06,0.3 h 2.62 l 0.06,-0.3 -0.18,-0.02 c -0.26,-0.04 -0.6,-0.09 -0.45,-0.83 l 0.52,-2.58 c 0.68,-0.5 1.11,-0.69 1.57,-0.69 0.57,0 0.76,0.33 0.61,1.06 l -0.44,2.21 c -0.11,0.55 -0.32,0.77 -0.79,0.83 l -0.21,0.02 -0.06,0.3 h 2.61 l 0.06,-0.3 -0.21,-0.02 c -0.43,-0.06 -0.56,-0.28 -0.45,-0.83 l 0.52,-2.58 c 0.71,-0.51 1.14,-0.69 1.6,-0.69 0.52,0 0.72,0.37 0.58,1.09 l -0.44,2.18 c -0.13,0.66 -0.41,0.77 -0.79,0.83 l -0.18,0.02 -0.06,0.3 z"
     style="font-style:italic;font-variant:normal;font-weight:normal;font-stretch:normal;font-size:10px;font-family:'TeX Gyre Bonum Math';-inkscape-font-specification:'TeX Gyre Bonum Math Italic';font-variant-ligatures:normal;font-variant-caps:normal;font-variant-numeric:normal;font-feature-settings:normal;text-align:start;writing-mode:lr-tb;text-anchor:start;stroke-width:0.62285"
     id="path1150" /><path
     d="m 545.69959,-43.078824 -0.14,-0.26 c -0.2,0.15 -0.32,0.2 -0.49,0.2 -0.55,0 -0.46,-0.5 -0.36,-0.98 l 0.42,-2.12 c 0.24,-1.2 -0.81,-1.48 -1.62,-1.48 -0.98,0 -2.28,0.5 -2.44,1.27 -0.04,0.24 0.14,0.44 0.4,0.44 0.28,0 0.55,-0.23 0.61,-0.51 l 0.04,-0.28 c 0.06,-0.29 0.56,-0.52 1.12,-0.52 0.71,0 1.09,0.35 0.98,0.9 l -0.16,0.8 c -1.06,0.11 -3.43,0.28 -3.71,1.69 -0.14,0.72 0.4,1.24 1.29,1.24 0.67,0 1.2,-0.21 1.99,-0.77 0.08,0.54 0.37,0.77 0.96,0.77 0.42,0 0.78,-0.12 1.11,-0.39 z m -1.98,-0.83 c -0.67,0.53 -1.13,0.74 -1.63,0.74 -0.48,0 -0.8,-0.38 -0.7,-0.86 0.13,-0.67 1.06,-1.11 2.6,-1.24 z"
     style="font-style:italic;font-variant:normal;font-weight:normal;font-stretch:normal;font-size:10px;font-family:'TeX Gyre Bonum Math';-inkscape-font-specification:'TeX Gyre Bonum Math Italic';font-variant-ligatures:normal;font-variant-caps:normal;font-variant-numeric:normal;font-feature-settings:normal;text-align:start;writing-mode:lr-tb;text-anchor:start;stroke-width:0.62285"
     id="path1152" /><path
     d="m 552.03037,-47.978824 c 0.05,-0.25 -0.13,-0.43 -0.45,-0.43 -0.73,0 -1.17,0.57 -1.4,0.89 -0.37,-0.15 -0.59,-0.2 -0.9,-0.2 -1.14,0 -2.22,0.79 -2.42,1.78 -0.11,0.58 0.06,1.05 0.53,1.42 -0.72,0.22 -1.09,0.53 -1.18,1 -0.08,0.4 0.09,0.66 0.56,0.84 -0.8,0.28 -1.17,0.6 -1.27,1.09 -0.14,0.73 0.82,1.22 2.3,1.22 1.62,0 2.8,-0.64 2.99,-1.62 0.2,-0.99 -0.64,-1.14 -1.26,-1.23 l -1.86,-0.26 c -0.44,-0.06 -0.61,-0.18 -0.57,-0.41 0.04,-0.18 0.25,-0.38 0.57,-0.53 0.37,0.13 0.57,0.16 0.91,0.16 1.65,0 2.3,-1.03 2.43,-1.68 0.11,-0.55 -0.09,-1.07 -0.54,-1.42 0.26,-0.3 0.44,-0.43 0.61,-0.43 0.19,0 0.23,0.19 0.49,0.19 0.22,0 0.42,-0.16 0.46,-0.38 z m -2.03,1.99 c -0.15,0.77 -0.49,1.41 -1.33,1.41 -0.71,0 -0.97,-0.46 -0.78,-1.42 0.18,-0.88 0.68,-1.4 1.37,-1.4 0.69,0 0.93,0.46 0.74,1.41 z m 0.03,4.32 c -0.08,0.37 -0.6,0.93 -2.16,0.93 -1.15,0 -1.86,-0.39 -1.75,-0.95 0.08,-0.38 0.43,-0.7 1.01,-0.9 l 2,0.25 c 0.72,0.09 0.98,0.28 0.9,0.67 z"
     style="font-style:italic;font-variant:normal;font-weight:normal;font-stretch:normal;font-size:10px;font-family:'TeX Gyre Bonum Math';-inkscape-font-specification:'TeX Gyre Bonum Math Italic';font-variant-ligatures:normal;font-variant-caps:normal;font-variant-numeric:normal;font-feature-settings:normal;text-align:start;writing-mode:lr-tb;text-anchor:start;stroke-width:0.62285"
     id="path1154" /><path
     d="m 556.101,-43.938824 -0.3,-0.16 c -0.49,0.66 -1.01,0.96 -1.63,0.96 -1.36,0 -1.48,-1.07 -1.19,-2.53 h 3.47 c 0.33,-1.63 -1.03,-2.05 -1.77,-2.05 -1.37,0 -2.57,1.03 -2.86,2.47 -0.22,1.12 0.2,2.56 1.96,2.56 0.92,0 1.64,-0.38 2.32,-1.25 z m -0.61,-2.13 h -2.4 c 0.24,-0.66 0.63,-1.25 1.47,-1.25 1.03,0 1,0.97 0.93,1.22 z"
     style="font-style:italic;font-variant:normal;font-weight:normal;font-stretch:normal;font-size:10px;font-family:'TeX Gyre Bonum Math';-inkscape-font-specification:'TeX Gyre Bonum Math Italic';font-variant-ligatures:normal;font-variant-caps:normal;font-variant-numeric:normal;font-feature-settings:normal;text-align:start;writing-mode:lr-tb;text-anchor:start;stroke-width:0.62285"
     id="path1156" /><path
     d="m 566.46944,-47.678824 c 0.24,-1.18 -0.58,-1.91 -2.12,-1.91 h -3.32 l -0.06,0.31 0.24,0.03 c 0.51,0.07 0.6,0.28 0.43,1.1 l -0.78,3.93 c -0.17,0.82 -0.34,1.03 -0.87,1.1 l -0.26,0.03 -0.06,0.31 h 2.92 l 0.06,-0.31 -0.36,-0.03 c -0.49,-0.04 -0.59,-0.29 -0.43,-1.1 l 0.29,-1.47 h 1.41 c 2.07,0 2.76,-1.23 2.91,-1.99 z m -1.03,0.03 c -0.13,0.65 -0.62,1.53 -1.95,1.53 h -1.25 l 0.48,-2.41 c 0.11,-0.54 0.31,-0.64 1.27,-0.64 0.92,0 1.7,0.3 1.45,1.52 z"
     style="font-style:italic;font-variant:normal;font-weight:normal;font-stretch:normal;font-size:10px;font-family:'TeX Gyre Bonum Math';-inkscape-font-specification:'TeX Gyre Bonum Math Italic';font-variant-ligatures:normal;font-variant-caps:normal;font-variant-numeric:normal;font-feature-settings:normal;text-align:start;writing-mode:lr-tb;text-anchor:start;stroke-width:0.62285"
     id="path1158" /><path
     d="m 568.41084,-42.778824 0.06,-0.3 -0.23,-0.02 c -0.44,-0.05 -0.56,-0.28 -0.45,-0.83 l 1.2,-6.02 h -0.4 c -0.54,0.2 -0.78,0.26 -1.47,0.34 l -0.07,0.31 0.21,0.02 c 0.53,0.05 0.6,0.23 0.43,1.12 l -0.85,4.23 c -0.11,0.55 -0.33,0.78 -0.79,0.83 l -0.24,0.02 -0.06,0.3 z"
     style="font-style:italic;font-variant:normal;font-weight:normal;font-stretch:normal;font-size:10px;font-family:'TeX Gyre Bonum Math';-inkscape-font-specification:'TeX Gyre Bonum Math Italic';font-variant-ligatures:normal;font-variant-caps:normal;font-variant-numeric:normal;font-feature-settings:normal;text-align:start;writing-mode:lr-tb;text-anchor:start;stroke-width:0.62285"
     id="path1160" /><path
     d="m 574.48865,-43.078824 -0.14,-0.26 c -0.2,0.15 -0.32,0.2 -0.49,0.2 -0.55,0 -0.46,-0.5 -0.36,-0.98 l 0.42,-2.12 c 0.24,-1.2 -0.81,-1.48 -1.62,-1.48 -0.98,0 -2.28,0.5 -2.44,1.27 -0.04,0.24 0.14,0.44 0.4,0.44 0.28,0 0.55,-0.23 0.61,-0.51 l 0.04,-0.28 c 0.06,-0.29 0.56,-0.52 1.12,-0.52 0.71,0 1.09,0.35 0.98,0.9 l -0.16,0.8 c -1.06,0.11 -3.43,0.28 -3.71,1.69 -0.14,0.72 0.4,1.24 1.29,1.24 0.67,0 1.2,-0.21 1.99,-0.77 0.08,0.54 0.37,0.77 0.96,0.77 0.42,0 0.78,-0.12 1.11,-0.39 z m -1.98,-0.83 c -0.67,0.53 -1.13,0.74 -1.63,0.74 -0.48,0 -0.8,-0.38 -0.7,-0.86 0.13,-0.67 1.06,-1.11 2.6,-1.24 z"
     style="font-style:italic;font-variant:normal;font-weight:normal;font-stretch:normal;font-size:10px;font-family:'TeX Gyre Bonum Math';-inkscape-font-specification:'TeX Gyre Bonum Math Italic';font-variant-ligatures:normal;font-variant-caps:normal;font-variant-numeric:normal;font-feature-settings:normal;text-align:start;writing-mode:lr-tb;text-anchor:start;stroke-width:0.62285"
     id="path1162" /><path
     d="m 580.84944,-42.778824 0.06,-0.3 -0.25,-0.02 c -0.43,-0.05 -0.56,-0.28 -0.45,-0.83 l 0.49,-2.47 c 0.17,-0.83 -0.3,-1.32 -1.24,-1.32 -0.76,0 -1.4,0.25 -2.24,0.88 l 0.16,-0.79 h -0.34 c -0.64,0.12 -0.98,0.16 -1.55,0.2 l -0.06,0.3 0.24,0.02 c 0.5,0.04 0.61,0.23 0.49,0.83 l -0.47,2.35 c -0.11,0.55 -0.34,0.78 -0.79,0.83 l -0.25,0.02 -0.06,0.3 h 2.69 l 0.06,-0.3 -0.25,-0.02 c -0.43,-0.05 -0.56,-0.28 -0.45,-0.83 l 0.49,-2.47 c 0.74,-0.56 1.38,-0.84 1.94,-0.84 0.55,0 0.78,0.35 0.65,1 l -0.46,2.31 c -0.11,0.55 -0.34,0.78 -0.79,0.83 l -0.25,0.02 -0.06,0.3 z"
     style="font-style:italic;font-variant:normal;font-weight:normal;font-stretch:normal;font-size:10px;font-family:'TeX Gyre Bonum Math';-inkscape-font-specification:'TeX Gyre Bonum Math Italic';font-variant-ligatures:normal;font-variant-caps:normal;font-variant-numeric:normal;font-feature-settings:normal;text-align:start;writing-mode:lr-tb;text-anchor:start;stroke-width:0.62285"
     id="path1164" /><path
     d="m 586.101,-43.938824 -0.3,-0.16 c -0.49,0.66 -1.01,0.96 -1.63,0.96 -1.36,0 -1.48,-1.07 -1.19,-2.53 h 3.47 c 0.33,-1.63 -1.03,-2.05 -1.77,-2.05 -1.37,0 -2.57,1.03 -2.86,2.47 -0.22,1.12 0.2,2.56 1.96,2.56 0.92,0 1.64,-0.38 2.32,-1.25 z m -0.61,-2.13 h -2.4 c 0.24,-0.66 0.63,-1.25 1.47,-1.25 1.03,0 1,0.97 0.93,1.22 z"
     style="font-style:italic;font-variant:normal;font-weight:normal;font-stretch:normal;font-size:10px;font-family:'TeX Gyre Bonum Math';-inkscape-font-specification:'TeX Gyre Bonum Math Italic';font-variant-ligatures:normal;font-variant-caps:normal;font-variant-numeric:normal;font-feature-settings:normal;text-align:start;writing-mode:lr-tb;text-anchor:start;stroke-width:0.62285"
     id="path1166" /></g><g
   aria-label="x"
   transform="scale(1,-1)"
   style="font-style:normal;font-weight:normal;font-size:30px;line-height:125%;font-family:sans-serif;letter-spacing:0px;word-spacing:0px;fill:#000000;fill-opacity:1;stroke:none;stroke-width:0.75px;stroke-linecap:butt;stroke-linejoin:miter;stroke-opacity:1"
   id="text13600"><path
     d="m 321.05506,-532.20203 v -0.42 c -0.756,-0.126 -1.008,-0.294 -1.624,-1.036 l -1.918,-2.45 1.218,-1.302 c 0.756,-0.742 1.176,-0.98 2.1,-1.162 v -0.42 h -2.954 v 0.42 c 0.42,0.056 0.882,0.168 0.49,0.7 l -1.19,1.344 -1.106,-1.344 c -0.364,-0.518 -0.098,-0.63 0.546,-0.7 v -0.42 h -3.472 v 0.42 c 0.672,0.098 0.924,0.266 1.428,0.854 l 1.638,2.058 -1.778,2.002 c -0.63,0.714 -0.994,0.938 -1.666,1.036 v 0.42 h 3.136 v -0.42 c -0.91,-0.126 -1.19,-0.476 -0.686,-1.036 l 1.4,-1.568 1.26,1.764 c 0.308,0.42 0.196,0.714 -0.7,0.84 v 0.42 z"
     style="font-style:normal;font-variant:normal;font-weight:bold;font-stretch:normal;font-size:14px;font-family:'TeX Gyre Bonum Math';-inkscape-font-specification:'TeX Gyre Bonum Math Bold';font-variant-ligatures:normal;font-variant-caps:normal;font-variant-numeric:normal;font-feature-settings:normal;text-align:start;writing-mode:lr-tb;text-anchor:start;stroke-width:0.75px"
     id="path1128" /></g><g
   aria-label="Center of"
   transform="scale(1,-1)"
   style="font-style:normal;font-weight:normal;font-size:30px;line-height:125%;font-family:sans-serif;letter-spacing:0px;word-spacing:0px;fill:#000000;fill-opacity:1;stroke:none;stroke-width:0.75px;stroke-linecap:butt;stroke-linejoin:miter;stroke-opacity:1"
   id="text13604"><path
     d="m 191.92476,-465.32245 -0.38,-0.24 c -1.13,1.3 -2.31,1.48 -2.77,1.48 -1,0 -2.34,-0.78 -1.89,-3.03 0.35,-1.77 1.59,-3.08 2.91,-3.08 1.54,0 1.83,1.06 2.14,2.15 h 0.32 v -2.41 h -0.33 l -0.29,0.42 c -0.5,-0.45 -1.07,-0.64 -1.93,-0.64 -1.33,0 -3.54,1.22 -4.01,3.57 -0.4,2 0.81,3.5 2.83,3.5 1.29,0 2.43,-0.57 3.4,-1.72 z"
     style="font-style:italic;font-variant:normal;font-weight:normal;font-stretch:normal;font-size:10px;font-family:'TeX Gyre Bonum Math';-inkscape-font-specification:'TeX Gyre Bonum Math Italic';font-variant-ligatures:normal;font-variant-caps:normal;font-variant-numeric:normal;font-feature-settings:normal;text-align:start;writing-mode:lr-tb;text-anchor:start;stroke-width:0.75px"
     id="path1181" /><path
     d="m 197.12711,-464.89245 -0.3,-0.16 c -0.49,0.66 -1.01,0.96 -1.63,0.96 -1.36,0 -1.48,-1.07 -1.19,-2.53 h 3.47 c 0.33,-1.63 -1.03,-2.05 -1.77,-2.05 -1.37,0 -2.57,1.03 -2.86,2.47 -0.22,1.12 0.2,2.56 1.96,2.56 0.92,0 1.64,-0.38 2.32,-1.25 z m -0.61,-2.13 h -2.4 c 0.24,-0.66 0.63,-1.25 1.47,-1.25 1.03,0 1,0.97 0.93,1.22 z"
     style="font-style:italic;font-variant:normal;font-weight:normal;font-stretch:normal;font-size:10px;font-family:'TeX Gyre Bonum Math';-inkscape-font-specification:'TeX Gyre Bonum Math Italic';font-variant-ligatures:normal;font-variant-caps:normal;font-variant-numeric:normal;font-feature-settings:normal;text-align:start;writing-mode:lr-tb;text-anchor:start;stroke-width:0.75px"
     id="path1183" /><path
     d="m 203.67242,-463.73245 0.06,-0.3 -0.25,-0.02 c -0.43,-0.05 -0.56,-0.28 -0.45,-0.83 l 0.49,-2.47 c 0.17,-0.83 -0.3,-1.32 -1.24,-1.32 -0.76,0 -1.4,0.25 -2.24,0.88 l 0.16,-0.79 h -0.34 c -0.64,0.12 -0.98,0.16 -1.55,0.2 l -0.06,0.3 0.24,0.02 c 0.5,0.04 0.61,0.23 0.49,0.83 l -0.47,2.35 c -0.11,0.55 -0.34,0.78 -0.79,0.83 l -0.25,0.02 -0.06,0.3 h 2.69 l 0.06,-0.3 -0.25,-0.02 c -0.43,-0.05 -0.56,-0.28 -0.45,-0.83 l 0.49,-2.47 c 0.74,-0.56 1.38,-0.84 1.94,-0.84 0.55,0 0.78,0.35 0.65,1 l -0.46,2.31 c -0.11,0.55 -0.34,0.78 -0.79,0.83 l -0.25,0.02 -0.06,0.3 z"
     style="font-style:italic;font-variant:normal;font-weight:normal;font-stretch:normal;font-size:10px;font-family:'TeX Gyre Bonum Math';-inkscape-font-specification:'TeX Gyre Bonum Math Italic';font-variant-ligatures:normal;font-variant-caps:normal;font-variant-numeric:normal;font-feature-settings:normal;text-align:start;writing-mode:lr-tb;text-anchor:start;stroke-width:0.75px"
     id="path1185" /><path
     d="m 207.78398,-464.34245 -0.22,-0.22 c -0.42,0.39 -0.68,0.52 -0.98,0.52 -0.51,0 -0.67,-0.41 -0.48,-1.32 l 0.57,-2.89 h 1.43 l 0.07,-0.33 h -1.43 l 0.36,-1.82 h -0.38 c -0.23,1.23 -0.78,1.78 -1.77,1.82 l -0.07,0.33 h 0.84 l -0.67,3.35 c -0.2,1.01 0.54,1.26 1.18,1.26 0.59,0 1.1,-0.23 1.55,-0.7 z"
     style="font-style:italic;font-variant:normal;font-weight:normal;font-stretch:normal;font-size:10px;font-family:'TeX Gyre Bonum Math';-inkscape-font-specification:'TeX Gyre Bonum Math Italic';font-variant-ligatures:normal;font-variant-caps:normal;font-variant-numeric:normal;font-feature-settings:normal;text-align:start;writing-mode:lr-tb;text-anchor:start;stroke-width:0.75px"
     id="path1187" /><path
     d="m 212.73258,-464.89245 -0.3,-0.16 c -0.49,0.66 -1.01,0.96 -1.63,0.96 -1.36,0 -1.48,-1.07 -1.19,-2.53 h 3.47 c 0.33,-1.63 -1.03,-2.05 -1.77,-2.05 -1.37,0 -2.57,1.03 -2.86,2.47 -0.22,1.12 0.2,2.56 1.96,2.56 0.92,0 1.64,-0.38 2.32,-1.25 z m -0.61,-2.13 h -2.4 c 0.24,-0.66 0.63,-1.25 1.47,-1.25 1.03,0 1,0.97 0.93,1.22 z"
     style="font-style:italic;font-variant:normal;font-weight:normal;font-stretch:normal;font-size:10px;font-family:'TeX Gyre Bonum Math';-inkscape-font-specification:'TeX Gyre Bonum Math Italic';font-variant-ligatures:normal;font-variant-caps:normal;font-variant-numeric:normal;font-feature-settings:normal;text-align:start;writing-mode:lr-tb;text-anchor:start;stroke-width:0.75px"
     id="path1189" /><path
     d="m 218.13789,-468.11245 c 0.06,-0.33 -0.19,-0.56 -0.62,-0.56 -0.83,0 -1.43,0.59 -1.87,0.89 l 0.16,-0.8 h -0.34 c -0.64,0.12 -0.98,0.16 -1.55,0.2 l -0.06,0.3 0.24,0.02 c 0.5,0.04 0.61,0.23 0.49,0.83 l -0.47,2.35 c -0.11,0.55 -0.34,0.78 -0.79,0.83 l -0.25,0.02 -0.06,0.3 h 2.69 l 0.06,-0.3 -0.25,-0.02 c -0.43,-0.05 -0.56,-0.28 -0.45,-0.83 l 0.49,-2.45 c 0.44,-0.4 0.74,-0.56 1.03,-0.56 0.17,0 0.24,0.03 0.39,0.15 0.15,0.13 0.3,0.18 0.48,0.18 0.33,0 0.61,-0.23 0.68,-0.55 z"
     style="font-style:italic;font-variant:normal;font-weight:normal;font-stretch:normal;font-size:10px;font-family:'TeX Gyre Bonum Math';-inkscape-font-specification:'TeX Gyre Bonum Math Italic';font-variant-ligatures:normal;font-variant-caps:normal;font-variant-numeric:normal;font-feature-settings:normal;text-align:start;writing-mode:lr-tb;text-anchor:start;stroke-width:0.75px"
     id="path1191" /><path
     d="m 226.12554,-466.12245 c 0.18,-0.92 0.02,-2.55 -1.96,-2.55 -1.94,0 -2.75,1.63 -2.93,2.53 -0.3,1.51 0.47,2.5 1.96,2.5 1.45,0 2.63,-1 2.93,-2.48 z m -1.03,0.05 c -0.26,1.27 -0.93,2.03 -1.81,2.03 -0.92,0 -1.29,-0.77 -1.02,-2.12 0.25,-1.28 0.98,-2.11 1.83,-2.11 0.9,0 1.27,0.83 1,2.2 z"
     style="font-style:italic;font-variant:normal;font-weight:normal;font-stretch:normal;font-size:10px;font-family:'TeX Gyre Bonum Math';-inkscape-font-specification:'TeX Gyre Bonum Math Italic';font-variant-ligatures:normal;font-variant-caps:normal;font-variant-numeric:normal;font-feature-settings:normal;text-align:start;writing-mode:lr-tb;text-anchor:start;stroke-width:0.75px"
     id="path1193" /><path
     d="m 231.48101,-470.50245 c 0.07,-0.33 -0.25,-0.57 -0.74,-0.57 -0.42,0 -2.24,0.15 -2.62,2.02 l -0.09,0.47 h -0.84 l -0.07,0.33 h 0.84 l -0.67,3.37 c -0.11,0.55 -0.34,0.78 -0.79,0.83 l -0.25,0.02 -0.06,0.3 h 2.69 l 0.06,-0.3 -0.25,-0.02 c -0.43,-0.05 -0.56,-0.28 -0.45,-0.83 l 0.67,-3.37 h 0.99 l 0.07,-0.33 h -0.99 l 0.21,-1.06 c 0.17,-0.82 0.65,-1 0.93,-1 0.17,0 0.3,0.1 0.41,0.29 0.11,0.19 0.23,0.28 0.41,0.28 0.24,0 0.5,-0.2 0.54,-0.43 z"
     style="font-style:italic;font-variant:normal;font-weight:normal;font-stretch:normal;font-size:10px;font-family:'TeX Gyre Bonum Math';-inkscape-font-specification:'TeX Gyre Bonum Math Italic';font-variant-ligatures:normal;font-variant-caps:normal;font-variant-numeric:normal;font-feature-settings:normal;text-align:start;writing-mode:lr-tb;text-anchor:start;stroke-width:0.75px"
     id="path1195" /></g><g
   aria-label="Projection"
   transform="scale(1,-1)"
   style="font-style:normal;font-weight:normal;font-size:30px;line-height:125%;font-family:sans-serif;letter-spacing:0px;word-spacing:0px;fill:#000000;fill-opacity:1;stroke:none;stroke-width:0.75px;stroke-linecap:butt;stroke-linejoin:miter;stroke-opacity:1"
   id="text13620"><path
     d="m 191.69476,-459.1583 c 0.24,-1.18 -0.58,-1.91 -2.12,-1.91 h -3.32 l -0.06,0.31 0.24,0.03 c 0.51,0.07 0.6,0.28 0.43,1.1 l -0.78,3.93 c -0.17,0.82 -0.34,1.03 -0.87,1.1 l -0.26,0.03 -0.06,0.31 h 2.92 l 0.06,-0.31 -0.36,-0.03 c -0.49,-0.04 -0.59,-0.29 -0.43,-1.1 l 0.29,-1.47 h 1.41 c 2.07,0 2.76,-1.23 2.91,-1.99 z m -1.03,0.03 c -0.13,0.65 -0.62,1.53 -1.95,1.53 h -1.25 l 0.48,-2.41 c 0.11,-0.54 0.31,-0.64 1.27,-0.64 0.92,0 1.7,0.3 1.45,1.52 z"
     style="font-style:italic;font-variant:normal;font-weight:normal;font-stretch:normal;font-size:10px;font-family:'TeX Gyre Bonum Math';-inkscape-font-specification:'TeX Gyre Bonum Math Italic';font-variant-ligatures:normal;font-variant-caps:normal;font-variant-numeric:normal;font-feature-settings:normal;text-align:start;writing-mode:lr-tb;text-anchor:start;stroke-width:0.75px"
     id="path1198" /><path
     d="m 196.12617,-458.6383 c 0.06,-0.33 -0.19,-0.56 -0.62,-0.56 -0.83,0 -1.43,0.59 -1.87,0.89 l 0.16,-0.8 h -0.34 c -0.64,0.12 -0.98,0.16 -1.55,0.2 l -0.06,0.3 0.24,0.02 c 0.5,0.04 0.61,0.23 0.49,0.83 l -0.47,2.35 c -0.11,0.55 -0.34,0.78 -0.79,0.83 l -0.25,0.02 -0.06,0.3 h 2.69 l 0.06,-0.3 -0.25,-0.02 c -0.43,-0.05 -0.56,-0.28 -0.45,-0.83 l 0.49,-2.45 c 0.44,-0.4 0.74,-0.56 1.03,-0.56 0.17,0 0.24,0.03 0.39,0.15 0.15,0.13 0.3,0.18 0.48,0.18 0.33,0 0.61,-0.23 0.68,-0.55 z"
     style="font-style:italic;font-variant:normal;font-weight:normal;font-stretch:normal;font-size:10px;font-family:'TeX Gyre Bonum Math';-inkscape-font-specification:'TeX Gyre Bonum Math Italic';font-variant-ligatures:normal;font-variant-caps:normal;font-variant-numeric:normal;font-feature-settings:normal;text-align:start;writing-mode:lr-tb;text-anchor:start;stroke-width:0.75px"
     id="path1200" /><path
     d="m 200.9107,-456.6483 c 0.18,-0.92 0.02,-2.55 -1.96,-2.55 -1.94,0 -2.75,1.63 -2.93,2.53 -0.3,1.51 0.47,2.5 1.96,2.5 1.45,0 2.63,-1 2.93,-2.48 z m -1.03,0.05 c -0.26,1.27 -0.93,2.03 -1.81,2.03 -0.92,0 -1.29,-0.77 -1.02,-2.12 0.25,-1.28 0.98,-2.11 1.83,-2.11 0.9,0 1.27,0.83 1,2.2 z"
     style="font-style:italic;font-variant:normal;font-weight:normal;font-stretch:normal;font-size:10px;font-family:'TeX Gyre Bonum Math';-inkscape-font-specification:'TeX Gyre Bonum Math Italic';font-variant-ligatures:normal;font-variant-caps:normal;font-variant-numeric:normal;font-feature-settings:normal;text-align:start;writing-mode:lr-tb;text-anchor:start;stroke-width:0.75px"
     id="path1202" /><path
     d="m 202.71617,-453.7883 1.06,-5.32 h -0.34 c -0.64,0.12 -0.98,0.16 -1.55,0.2 l -0.06,0.3 0.24,0.02 c 0.5,0.04 0.61,0.23 0.49,0.83 l -0.69,3.45 c -0.22,1.1 -0.33,2.01 -1.12,2.01 -0.23,0 -0.33,-0.06 -0.49,-0.3 -0.13,-0.2 -0.23,-0.26 -0.39,-0.26 -0.25,0 -0.5,0.18 -0.54,0.4 -0.07,0.36 0.31,0.61 0.95,0.61 0.55,0 2.09,-0.2 2.44,-1.94 z m 1.44,-6.77 c 0.06,-0.32 -0.15,-0.59 -0.46,-0.59 -0.33,0 -0.65,0.26 -0.72,0.59 -0.06,0.32 0.15,0.59 0.47,0.59 0.32,0 0.65,-0.27 0.71,-0.59 z"
     style="font-style:italic;font-variant:normal;font-weight:normal;font-stretch:normal;font-size:10px;font-family:'TeX Gyre Bonum Math';-inkscape-font-specification:'TeX Gyre Bonum Math Italic';font-variant-ligatures:normal;font-variant-caps:normal;font-variant-numeric:normal;font-feature-settings:normal;text-align:start;writing-mode:lr-tb;text-anchor:start;stroke-width:0.75px"
     id="path1204" /><path
     d="m 208.92398,-455.4183 -0.3,-0.16 c -0.49,0.66 -1.01,0.96 -1.63,0.96 -1.36,0 -1.48,-1.07 -1.19,-2.53 h 3.47 c 0.33,-1.63 -1.03,-2.05 -1.77,-2.05 -1.37,0 -2.57,1.03 -2.86,2.47 -0.22,1.12 0.2,2.56 1.96,2.56 0.92,0 1.64,-0.38 2.32,-1.25 z m -0.61,-2.13 h -2.4 c 0.24,-0.66 0.63,-1.25 1.47,-1.25 1.03,0 1,0.97 0.93,1.22 z"
     style="font-style:italic;font-variant:normal;font-weight:normal;font-stretch:normal;font-size:10px;font-family:'TeX Gyre Bonum Math';-inkscape-font-specification:'TeX Gyre Bonum Math Italic';font-variant-ligatures:normal;font-variant-caps:normal;font-variant-numeric:normal;font-feature-settings:normal;text-align:start;writing-mode:lr-tb;text-anchor:start;stroke-width:0.75px"
     id="path1206" /><path
     d="m 214.17929,-455.3383 -0.26,-0.18 c -0.7,0.7 -1.16,0.95 -1.77,0.95 -1.03,0 -1.55,-0.83 -1.3,-2.07 0.19,-0.97 0.72,-2.16 1.89,-2.16 0.52,0 0.93,0.31 0.86,0.66 l -0.08,0.35 c -0.06,0.29 0.11,0.51 0.4,0.51 0.29,0 0.56,-0.24 0.62,-0.55 0.11,-0.55 -0.38,-1.37 -1.76,-1.37 -1.95,0 -2.77,1.62 -2.95,2.52 -0.29,1.49 0.49,2.51 1.96,2.51 0.96,0 1.7,-0.36 2.39,-1.17 z"
     style="font-style:italic;font-variant:normal;font-weight:normal;font-stretch:normal;font-size:10px;font-family:'TeX Gyre Bonum Math';-inkscape-font-specification:'TeX Gyre Bonum Math Italic';font-variant-ligatures:normal;font-variant-caps:normal;font-variant-numeric:normal;font-feature-settings:normal;text-align:start;writing-mode:lr-tb;text-anchor:start;stroke-width:0.75px"
     id="path1208" /><path
     d="m 218.17461,-454.8683 -0.22,-0.22 c -0.42,0.39 -0.68,0.52 -0.98,0.52 -0.51,0 -0.67,-0.41 -0.48,-1.32 l 0.57,-2.89 h 1.43 l 0.07,-0.33 h -1.43 l 0.36,-1.82 h -0.38 c -0.23,1.23 -0.78,1.78 -1.77,1.82 l -0.07,0.33 h 0.84 l -0.67,3.35 c -0.2,1.01 0.54,1.26 1.18,1.26 0.59,0 1.1,-0.23 1.55,-0.7 z"
     style="font-style:italic;font-variant:normal;font-weight:normal;font-stretch:normal;font-size:10px;font-family:'TeX Gyre Bonum Math';-inkscape-font-specification:'TeX Gyre Bonum Math Italic';font-variant-ligatures:normal;font-variant-caps:normal;font-variant-numeric:normal;font-feature-settings:normal;text-align:start;writing-mode:lr-tb;text-anchor:start;stroke-width:0.75px"
     id="path1210" /><path
     d="m 220.8632,-454.2583 0.06,-0.3 -0.24,-0.02 c -0.44,-0.05 -0.56,-0.28 -0.45,-0.83 l 0.74,-3.7 h -0.34 c -0.63,0.11 -0.97,0.16 -1.51,0.2 l -0.06,0.3 0.2,0.02 c 0.51,0.05 0.61,0.23 0.49,0.83 l -0.47,2.35 c -0.11,0.55 -0.34,0.78 -0.79,0.83 l -0.25,0.02 -0.06,0.3 z m 0.49,-6.3 c 0.06,-0.32 -0.15,-0.59 -0.46,-0.59 -0.33,0 -0.65,0.26 -0.72,0.59 -0.06,0.32 0.15,0.59 0.47,0.59 0.32,0 0.65,-0.27 0.71,-0.59 z"
     style="font-style:italic;font-variant:normal;font-weight:normal;font-stretch:normal;font-size:10px;font-family:'TeX Gyre Bonum Math';-inkscape-font-specification:'TeX Gyre Bonum Math Italic';font-variant-ligatures:normal;font-variant-caps:normal;font-variant-numeric:normal;font-feature-settings:normal;text-align:start;writing-mode:lr-tb;text-anchor:start;stroke-width:0.75px"
     id="path1212" /><path
     d="m 226.73101,-456.6483 c 0.18,-0.92 0.02,-2.55 -1.96,-2.55 -1.94,0 -2.75,1.63 -2.93,2.53 -0.3,1.51 0.47,2.5 1.96,2.5 1.45,0 2.63,-1 2.93,-2.48 z m -1.03,0.05 c -0.26,1.27 -0.93,2.03 -1.81,2.03 -0.92,0 -1.29,-0.77 -1.02,-2.12 0.25,-1.28 0.98,-2.11 1.83,-2.11 0.9,0 1.27,0.83 1,2.2 z"
     style="font-style:italic;font-variant:normal;font-weight:normal;font-stretch:normal;font-size:10px;font-family:'TeX Gyre Bonum Math';-inkscape-font-specification:'TeX Gyre Bonum Math Italic';font-variant-ligatures:normal;font-variant-caps:normal;font-variant-numeric:normal;font-feature-settings:normal;text-align:start;writing-mode:lr-tb;text-anchor:start;stroke-width:0.75px"
     id="path1214" /><path
     d="m 233.08648,-454.2583 0.06,-0.3 -0.25,-0.02 c -0.43,-0.05 -0.56,-0.28 -0.45,-0.83 l 0.49,-2.47 c 0.17,-0.83 -0.3,-1.32 -1.24,-1.32 -0.76,0 -1.4,0.25 -2.24,0.88 l 0.16,-0.79 h -0.34 c -0.64,0.12 -0.98,0.16 -1.55,0.2 l -0.06,0.3 0.24,0.02 c 0.5,0.04 0.61,0.23 0.49,0.83 l -0.47,2.35 c -0.11,0.55 -0.34,0.78 -0.79,0.83 l -0.25,0.02 -0.06,0.3 h 2.69 l 0.06,-0.3 -0.25,-0.02 c -0.43,-0.05 -0.56,-0.28 -0.45,-0.83 l 0.49,-2.47 c 0.74,-0.56 1.38,-0.84 1.94,-0.84 0.55,0 0.78,0.35 0.65,1 l -0.46,2.31 c -0.11,0.55 -0.34,0.78 -0.79,0.83 l -0.25,0.02 -0.06,0.3 z"
     style="font-style:italic;font-variant:normal;font-weight:normal;font-stretch:normal;font-size:10px;font-family:'TeX Gyre Bonum Math';-inkscape-font-specification:'TeX Gyre Bonum Math Italic';font-variant-ligatures:normal;font-variant-caps:normal;font-variant-numeric:normal;font-feature-settings:normal;text-align:start;writing-mode:lr-tb;text-anchor:start;stroke-width:0.75px"
     id="path1216" /></g><g
   aria-label="Principal Axis"
   transform="scale(1,-1)"
   style="font-style:normal;font-weight:normal;font-size:30px;line-height:125%;font-family:sans-serif;letter-spacing:0px;word-spacing:0px;fill:#000000;fill-opacity:1;stroke:none;stroke-width:0.75px;stroke-linecap:butt;stroke-linejoin:miter;stroke-opacity:1"
   id="text13604-0"><path
     d="m 395.94139,-466.89893 c 0.24,-1.18 -0.58,-1.91 -2.12,-1.91 h -3.32 l -0.06,0.31 0.24,0.03 c 0.51,0.07 0.6,0.28 0.43,1.1 l -0.78,3.93 c -0.17,0.82 -0.34,1.03 -0.87,1.1 l -0.26,0.03 -0.06,0.31 h 2.92 l 0.06,-0.31 -0.36,-0.03 c -0.49,-0.04 -0.59,-0.29 -0.43,-1.1 l 0.29,-1.47 h 1.41 c 2.07,0 2.76,-1.23 2.91,-1.99 z m -1.03,0.03 c -0.13,0.65 -0.62,1.53 -1.95,1.53 h -1.25 l 0.48,-2.41 c 0.11,-0.54 0.31,-0.64 1.27,-0.64 0.92,0 1.7,0.3 1.45,1.52 z"
     style="font-style:italic;font-variant:normal;font-weight:normal;font-stretch:normal;font-size:10px;font-family:'TeX Gyre Bonum Math';-inkscape-font-specification:'TeX Gyre Bonum Math Italic';font-variant-ligatures:normal;font-variant-caps:normal;font-variant-numeric:normal;font-feature-settings:normal;text-align:start;writing-mode:lr-tb;text-anchor:start;stroke-width:0.75px"
     id="path1061" /><path
     d="m 400.3728,-466.37893 c 0.06,-0.33 -0.19,-0.56 -0.62,-0.56 -0.83,0 -1.43,0.59 -1.87,0.89 l 0.16,-0.8 h -0.34 c -0.64,0.12 -0.98,0.16 -1.55,0.2 l -0.06,0.3 0.24,0.02 c 0.5,0.04 0.61,0.23 0.49,0.83 l -0.47,2.35 c -0.11,0.55 -0.34,0.78 -0.79,0.83 l -0.25,0.02 -0.06,0.3 h 2.69 l 0.06,-0.3 -0.25,-0.02 c -0.43,-0.05 -0.56,-0.28 -0.45,-0.83 l 0.49,-2.45 c 0.44,-0.4 0.74,-0.56 1.03,-0.56 0.17,0 0.24,0.03 0.39,0.15 0.15,0.13 0.3,0.18 0.48,0.18 0.33,0 0.61,-0.23 0.68,-0.55 z"
     style="font-style:italic;font-variant:normal;font-weight:normal;font-stretch:normal;font-size:10px;font-family:'TeX Gyre Bonum Math';-inkscape-font-specification:'TeX Gyre Bonum Math Italic';font-variant-ligatures:normal;font-variant-caps:normal;font-variant-numeric:normal;font-feature-settings:normal;text-align:start;writing-mode:lr-tb;text-anchor:start;stroke-width:0.75px"
     id="path1063" /><path
     d="m 402.29733,-461.99893 0.06,-0.3 -0.24,-0.02 c -0.44,-0.05 -0.56,-0.28 -0.45,-0.83 l 0.74,-3.7 h -0.34 c -0.63,0.11 -0.97,0.16 -1.51,0.2 l -0.06,0.3 0.2,0.02 c 0.51,0.05 0.61,0.23 0.49,0.83 l -0.47,2.35 c -0.11,0.55 -0.34,0.78 -0.79,0.83 l -0.25,0.02 -0.06,0.3 z m 0.49,-6.3 c 0.06,-0.32 -0.15,-0.59 -0.46,-0.59 -0.33,0 -0.65,0.26 -0.72,0.59 -0.06,0.32 0.15,0.59 0.47,0.59 0.32,0 0.65,-0.27 0.71,-0.59 z"
     style="font-style:italic;font-variant:normal;font-weight:normal;font-stretch:normal;font-size:10px;font-family:'TeX Gyre Bonum Math';-inkscape-font-specification:'TeX Gyre Bonum Math Italic';font-variant-ligatures:normal;font-variant-caps:normal;font-variant-numeric:normal;font-feature-settings:normal;text-align:start;writing-mode:lr-tb;text-anchor:start;stroke-width:0.75px"
     id="path1065" /><path
     d="m 408.91514,-461.99893 0.06,-0.3 -0.25,-0.02 c -0.43,-0.05 -0.56,-0.28 -0.45,-0.83 l 0.49,-2.47 c 0.17,-0.83 -0.3,-1.32 -1.24,-1.32 -0.76,0 -1.4,0.25 -2.24,0.88 l 0.16,-0.79 h -0.34 c -0.64,0.12 -0.98,0.16 -1.55,0.2 l -0.06,0.3 0.24,0.02 c 0.5,0.04 0.61,0.23 0.49,0.83 l -0.47,2.35 c -0.11,0.55 -0.34,0.78 -0.79,0.83 l -0.25,0.02 -0.06,0.3 h 2.69 l 0.06,-0.3 -0.25,-0.02 c -0.43,-0.05 -0.56,-0.28 -0.45,-0.83 l 0.49,-2.47 c 0.74,-0.56 1.38,-0.84 1.94,-0.84 0.55,0 0.78,0.35 0.65,1 l -0.46,2.31 c -0.11,0.55 -0.34,0.78 -0.79,0.83 l -0.25,0.02 -0.06,0.3 z"
     style="font-style:italic;font-variant:normal;font-weight:normal;font-stretch:normal;font-size:10px;font-family:'TeX Gyre Bonum Math';-inkscape-font-specification:'TeX Gyre Bonum Math Italic';font-variant-ligatures:normal;font-variant-caps:normal;font-variant-numeric:normal;font-feature-settings:normal;text-align:start;writing-mode:lr-tb;text-anchor:start;stroke-width:0.75px"
     id="path1067" /><path
     d="m 414.2267,-463.07893 -0.26,-0.18 c -0.7,0.7 -1.16,0.95 -1.77,0.95 -1.03,0 -1.55,-0.83 -1.3,-2.07 0.19,-0.97 0.72,-2.16 1.89,-2.16 0.52,0 0.93,0.31 0.86,0.66 l -0.08,0.35 c -0.06,0.29 0.11,0.51 0.4,0.51 0.29,0 0.56,-0.24 0.62,-0.55 0.11,-0.55 -0.38,-1.37 -1.76,-1.37 -1.95,0 -2.77,1.62 -2.95,2.52 -0.29,1.49 0.49,2.51 1.96,2.51 0.96,0 1.7,-0.36 2.39,-1.17 z"
     style="font-style:italic;font-variant:normal;font-weight:normal;font-stretch:normal;font-size:10px;font-family:'TeX Gyre Bonum Math';-inkscape-font-specification:'TeX Gyre Bonum Math Italic';font-variant-ligatures:normal;font-variant-caps:normal;font-variant-numeric:normal;font-feature-settings:normal;text-align:start;writing-mode:lr-tb;text-anchor:start;stroke-width:0.75px"
     id="path1069" /><path
     d="m 417.10202,-461.99893 0.06,-0.3 -0.24,-0.02 c -0.44,-0.05 -0.56,-0.28 -0.45,-0.83 l 0.74,-3.7 h -0.34 c -0.63,0.11 -0.97,0.16 -1.51,0.2 l -0.06,0.3 0.2,0.02 c 0.51,0.05 0.61,0.23 0.49,0.83 l -0.47,2.35 c -0.11,0.55 -0.34,0.78 -0.79,0.83 l -0.25,0.02 -0.06,0.3 z m 0.49,-6.3 c 0.06,-0.32 -0.15,-0.59 -0.46,-0.59 -0.33,0 -0.65,0.26 -0.72,0.59 -0.06,0.32 0.15,0.59 0.47,0.59 0.32,0 0.65,-0.27 0.71,-0.59 z"
     style="font-style:italic;font-variant:normal;font-weight:normal;font-stretch:normal;font-size:10px;font-family:'TeX Gyre Bonum Math';-inkscape-font-specification:'TeX Gyre Bonum Math Italic';font-variant-ligatures:normal;font-variant-caps:normal;font-variant-numeric:normal;font-feature-settings:normal;text-align:start;writing-mode:lr-tb;text-anchor:start;stroke-width:0.75px"
     id="path1071" /><path
     d="m 423.54983,-464.44893 c 0.25,-1.27 -0.28,-2.49 -1.68,-2.49 -0.66,0 -1.23,0.24 -1.78,0.75 l 0.13,-0.66 h -0.34 c -0.6,0.11 -0.92,0.15 -1.52,0.2 l -0.06,0.3 0.21,0.02 c 0.51,0.05 0.61,0.23 0.49,0.83 l -0.93,4.63 c -0.1,0.54 -0.33,0.79 -0.78,0.83 l -0.26,0.02 -0.06,0.3 h 2.69 l 0.06,-0.3 -0.24,-0.02 c -0.43,-0.04 -0.56,-0.29 -0.46,-0.83 l 0.31,-1.55 c 0.39,0.35 0.85,0.51 1.48,0.51 1.27,0 2.45,-1.1 2.74,-2.54 z m -1.04,0.12 c -0.23,1.14 -1.02,1.97 -1.86,1.97 -0.5,0 -0.91,-0.19 -1.22,-0.55 l 0.56,-2.78 c 0.53,-0.56 0.97,-0.8 1.48,-0.8 0.89,0 1.3,0.85 1.04,2.16 z"
     style="font-style:italic;font-variant:normal;font-weight:normal;font-stretch:normal;font-size:10px;font-family:'TeX Gyre Bonum Math';-inkscape-font-specification:'TeX Gyre Bonum Math Italic';font-variant-ligatures:normal;font-variant-caps:normal;font-variant-numeric:normal;font-feature-settings:normal;text-align:start;writing-mode:lr-tb;text-anchor:start;stroke-width:0.75px"
     id="path1073" /><path
     d="m 429.35123,-462.29893 -0.14,-0.26 c -0.2,0.15 -0.32,0.2 -0.49,0.2 -0.55,0 -0.46,-0.5 -0.36,-0.98 l 0.42,-2.12 c 0.24,-1.2 -0.81,-1.48 -1.62,-1.48 -0.98,0 -2.28,0.5 -2.44,1.27 -0.04,0.24 0.14,0.44 0.4,0.44 0.28,0 0.55,-0.23 0.61,-0.51 l 0.04,-0.28 c 0.06,-0.29 0.56,-0.52 1.12,-0.52 0.71,0 1.09,0.35 0.98,0.9 l -0.16,0.8 c -1.06,0.11 -3.43,0.28 -3.71,1.69 -0.14,0.72 0.4,1.24 1.29,1.24 0.67,0 1.2,-0.21 1.99,-0.77 0.08,0.54 0.37,0.77 0.96,0.77 0.42,0 0.78,-0.12 1.11,-0.39 z m -1.98,-0.83 c -0.67,0.53 -1.13,0.74 -1.63,0.74 -0.48,0 -0.8,-0.38 -0.7,-0.86 0.13,-0.67 1.06,-1.11 2.6,-1.24 z"
     style="font-style:italic;font-variant:normal;font-weight:normal;font-stretch:normal;font-size:10px;font-family:'TeX Gyre Bonum Math';-inkscape-font-specification:'TeX Gyre Bonum Math Italic';font-variant-ligatures:normal;font-variant-caps:normal;font-variant-numeric:normal;font-feature-settings:normal;text-align:start;writing-mode:lr-tb;text-anchor:start;stroke-width:0.75px"
     id="path1075" /><path
     d="m 432.08202,-461.99893 0.06,-0.3 -0.23,-0.02 c -0.44,-0.05 -0.56,-0.28 -0.45,-0.83 l 1.2,-6.02 h -0.4 c -0.54,0.2 -0.78,0.26 -1.47,0.34 l -0.07,0.31 0.21,0.02 c 0.53,0.05 0.6,0.23 0.43,1.12 l -0.85,4.23 c -0.11,0.55 -0.33,0.78 -0.79,0.83 l -0.24,0.02 -0.06,0.3 z"
     style="font-style:italic;font-variant:normal;font-weight:normal;font-stretch:normal;font-size:10px;font-family:'TeX Gyre Bonum Math';-inkscape-font-specification:'TeX Gyre Bonum Math Italic';font-variant-ligatures:normal;font-variant-caps:normal;font-variant-numeric:normal;font-feature-settings:normal;text-align:start;writing-mode:lr-tb;text-anchor:start;stroke-width:0.75px"
     id="path1077" /><path
     d="m 442.57295,-461.99893 0.06,-0.31 c -0.63,-0.1 -0.73,-0.21 -0.9,-1.14 l -1.05,-5.36 h -0.93 l -2.6,4.41 c -1.01,1.71 -1.22,1.94 -1.91,2.07 l -0.12,0.02 -0.06,0.31 h 2.68 l 0.06,-0.31 c -0.35,-0.05 -0.51,-0.09 -0.61,-0.16 -0.31,-0.24 -0.15,-0.64 0.18,-1.2 l 0.5,-0.86 h 2.58 l 0.24,1.29 c 0.09,0.62 -0.01,0.81 -0.87,0.93 l -0.06,0.31 z m -2.22,-2.96 h -2.25 l 1.71,-3 z"
     style="font-style:italic;font-variant:normal;font-weight:normal;font-stretch:normal;font-size:10px;font-family:'TeX Gyre Bonum Math';-inkscape-font-specification:'TeX Gyre Bonum Math Italic';font-variant-ligatures:normal;font-variant-caps:normal;font-variant-numeric:normal;font-feature-settings:normal;text-align:start;writing-mode:lr-tb;text-anchor:start;stroke-width:0.75px"
     id="path1079" /><path
     d="m 447.98983,-461.99893 0.06,-0.3 c -0.52,-0.09 -0.68,-0.21 -1.01,-0.74 l -1.02,-1.75 1.05,-0.93 c 0.65,-0.53 0.98,-0.7 1.67,-0.83 l 0.06,-0.3 h -2.11 l -0.06,0.3 c 0.29,0.04 0.61,0.12 0.25,0.5 l -1.04,0.96 -0.6,-0.96 c -0.19,-0.37 0.02,-0.45 0.49,-0.5 l 0.06,-0.3 h -2.48 l -0.06,0.3 c 0.47,0.07 0.62,0.19 0.9,0.61 l 0.87,1.47 -1.55,1.43 c -0.55,0.51 -0.85,0.67 -1.34,0.74 l -0.06,0.3 h 2.24 l 0.06,-0.3 c -0.63,-0.09 -0.78,-0.34 -0.34,-0.74 l 1.22,-1.12 0.65,1.26 c 0.16,0.3 0.04,0.51 -0.62,0.6 l -0.06,0.3 z"
     style="font-style:italic;font-variant:normal;font-weight:normal;font-stretch:normal;font-size:10px;font-family:'TeX Gyre Bonum Math';-inkscape-font-specification:'TeX Gyre Bonum Math Italic';font-variant-ligatures:normal;font-variant-caps:normal;font-variant-numeric:normal;font-feature-settings:normal;text-align:start;writing-mode:lr-tb;text-anchor:start;stroke-width:0.75px"
     id="path1081" /><path
     d="m 450.7153,-461.99893 0.06,-0.3 -0.24,-0.02 c -0.44,-0.05 -0.56,-0.28 -0.45,-0.83 l 0.74,-3.7 h -0.34 c -0.63,0.11 -0.97,0.16 -1.51,0.2 l -0.06,0.3 0.2,0.02 c 0.51,0.05 0.61,0.23 0.49,0.83 l -0.47,2.35 c -0.11,0.55 -0.34,0.78 -0.79,0.83 l -0.25,0.02 -0.06,0.3 z m 0.49,-6.3 c 0.06,-0.32 -0.15,-0.59 -0.46,-0.59 -0.33,0 -0.65,0.26 -0.72,0.59 -0.06,0.32 0.15,0.59 0.47,0.59 0.32,0 0.65,-0.27 0.71,-0.59 z"
     style="font-style:italic;font-variant:normal;font-weight:normal;font-stretch:normal;font-size:10px;font-family:'TeX Gyre Bonum Math';-inkscape-font-specification:'TeX Gyre Bonum Math Italic';font-variant-ligatures:normal;font-variant-caps:normal;font-variant-numeric:normal;font-feature-settings:normal;text-align:start;writing-mode:lr-tb;text-anchor:start;stroke-width:0.75px"
     id="path1083" /><path
     d="m 456.02311,-463.52893 c 0.13,-0.68 -0.19,-1.08 -1.02,-1.29 l -1.32,-0.34 c -0.32,-0.08 -0.74,-0.19 -0.65,-0.63 0.08,-0.43 0.57,-0.75 1.16,-0.75 0.76,0 1.32,0.48 1.49,1.27 h 0.32 l -0.01,-1.54 h -0.28 l -0.17,0.36 c -0.36,-0.34 -0.77,-0.49 -1.33,-0.49 -1.02,0 -1.96,0.64 -2.12,1.46 -0.13,0.63 0.23,1 1.23,1.27 l 1.22,0.32 c 0.47,0.13 0.66,0.34 0.6,0.66 -0.11,0.52 -0.75,0.92 -1.48,0.92 -0.62,0 -1.17,-0.27 -1.45,-0.72 -0.14,-0.21 -0.2,-0.41 -0.27,-0.79 h -0.34 l -0.01,1.78 h 0.33 l 0.19,-0.42 c 0.46,0.41 0.85,0.55 1.5,0.55 1.2,0 2.22,-0.69 2.41,-1.62 z"
     style="font-style:italic;font-variant:normal;font-weight:normal;font-stretch:normal;font-size:10px;font-family:'TeX Gyre Bonum Math';-inkscape-font-specification:'TeX Gyre Bonum Math Italic';font-variant-ligatures:normal;font-variant-caps:normal;font-variant-numeric:normal;font-feature-settings:normal;text-align:start;writing-mode:lr-tb;text-anchor:start;stroke-width:0.75px"
     id="path1085" /></g>
<g
   aria-label="C(u0 ,v0)"
   transform="scale(1,-1)"
   style="font-style:normal;font-weight:normal;line-height:125%;font-family:sans-serif;letter-spacing:0px;word-spacing:0px;baseline-shift:baseline;fill:#000000;fill-opacity:1;stroke:none;stroke-width:0.75px;stroke-linecap:butt;stroke-linejoin:miter;stroke-opacity:1"
   id="text1016"><path
     d="m 320.52815,-480.99934 -0.456,-0.288 c -1.356,1.56 -2.772,1.776 -3.324,1.776 -1.2,0 -2.808,-0.936 -2.268,-3.636 0.42,-2.124 1.908,-3.696 3.492,-3.696 1.848,0 2.196,1.272 2.568,2.58 h 0.384 v -2.892 h -0.396 l -0.348,0.504 c -0.6,-0.54 -1.284,-0.768 -2.316,-0.768 -1.596,0 -4.248,1.464 -4.812,4.284 -0.48,2.4 0.972,4.2 3.396,4.2 1.548,0 2.916,-0.684 4.08,-2.064 z"
     style="font-style:italic;font-variant:normal;font-weight:normal;font-stretch:normal;font-family:'TeX Gyre Bonum Math';-inkscape-font-specification:'TeX Gyre Bonum Math Italic'"
     id="path1131" /><path
     d="m 324.80297,-477.33934 c -1.344,-0.744 -1.488,-2.4 -1.08,-4.452 l 0.168,-0.84 c 0.408,-2.052 1.224,-3.708 2.856,-4.452 l -0.108,-0.336 c -1.872,0.852 -3.408,2.412 -3.888,4.788 l -0.168,0.84 c -0.48,2.376 0.432,3.936 1.968,4.788 z"
     style="font-style:italic;font-variant:normal;font-weight:normal;font-stretch:normal;font-family:'TeX Gyre Bonum Math';-inkscape-font-specification:'TeX Gyre Bonum Math Italic'"
     id="path1133" /><path
     d="m 333.94678,-479.09134 0.072,-0.36 -0.3,-0.024 c -0.516,-0.06 -0.672,-0.336 -0.54,-0.996 l 0.888,-4.44 h -0.408 c -0.648,0.144 -0.9,0.168 -1.86,0.24 l -0.072,0.36 0.288,0.024 c 0.6,0.048 0.732,0.276 0.588,0.996 l -0.54,2.676 c -0.936,0.708 -1.716,1.056 -2.304,1.056 -0.756,0 -1.008,-0.408 -0.828,-1.32 l 0.804,-4.032 h -0.408 c -0.648,0.144 -0.924,0.18 -1.86,0.24 l -0.072,0.36 0.288,0.024 c 0.6,0.048 0.732,0.276 0.588,0.996 l -0.504,2.508 c -0.288,1.44 0.564,1.8 1.428,1.8 0.864,0 1.584,-0.288 2.772,-1.116 l -0.204,1.008 z"
     style="font-style:italic;font-variant:normal;font-weight:normal;font-stretch:normal;font-family:'TeX Gyre Bonum Math';-inkscape-font-specification:'TeX Gyre Bonum Math Italic'"
     id="path1135" /><path
     d="m 339.36043,-479.31214 c 0.3354,-1.6614 -0.3042,-2.7924 -1.5756,-2.7924 -1.404,0 -2.4102,1.4274 -2.6676,2.7378 -0.3354,1.6458 0.3042,2.7768 1.56,2.7768 1.2558,0 2.3634,-1.1232 2.6832,-2.7222 z m -0.8268,-0.0546 c -0.234,1.1544 -0.741,2.4024 -1.7628,2.4024 -0.5148,0 -1.2246,-0.3432 -0.8346,-2.3166 0.1716,-0.8424 0.6942,-2.4492 1.8018,-2.4492 1.0374,0 1.014,1.2714 0.7956,2.3634 z"
     style="font-style:italic;font-variant:normal;font-weight:normal;font-stretch:normal;font-size:64.99999762%;font-family:'TeX Gyre Bonum Math';-inkscape-font-specification:'TeX Gyre Bonum Math Italic';baseline-shift:sub"
     id="path1137" /><path
     d="m 345.68807,-479.46334 c 0.12,-0.588 -0.156,-1.032 -0.636,-1.032 -0.432,0 -0.816,0.336 -0.912,0.792 -0.072,0.384 0.132,0.684 0.48,0.684 0.156,0 0.252,-0.036 0.48,-0.18 -0.228,0.564 -0.576,0.924 -1.128,1.212 l 0.084,0.24 c 0.912,-0.372 1.488,-0.972 1.632,-1.716 z"
     style="font-style:italic;font-variant:normal;font-weight:normal;font-stretch:normal;font-family:'TeX Gyre Bonum Math';-inkscape-font-specification:'TeX Gyre Bonum Math Italic'"
     id="path1139" /><path
     d="m 354.28382,-484.52734 0.072,-0.384 h -2.472 l -0.072,0.36 c 0.78,0.12 0.804,0.492 0.42,1.116 l -1.896,3.288 -0.648,-3.564 c -0.084,-0.696 0.108,-0.756 0.84,-0.84 l 0.072,-0.36 h -2.928 l -0.072,0.372 c 0.516,0.084 0.66,0.216 0.816,0.828 l 0.984,4.62 h 0.708 l 2.688,-4.248 c 0.468,-0.708 0.888,-1.056 1.488,-1.188 z"
     style="font-style:italic;font-variant:normal;font-weight:normal;font-stretch:normal;font-family:'TeX Gyre Bonum Math';-inkscape-font-specification:'TeX Gyre Bonum Math Italic'"
     id="path1141" /><path
     d="m 358.1116,-479.31214 c 0.3354,-1.6614 -0.3042,-2.7924 -1.5756,-2.7924 -1.404,0 -2.4102,1.4274 -2.6676,2.7378 -0.3354,1.6458 0.3042,2.7768 1.56,2.7768 1.2558,0 2.3634,-1.1232 2.6832,-2.7222 z m -0.8268,-0.0546 c -0.234,1.1544 -0.741,2.4024 -1.7628,2.4024 -0.5148,0 -1.2246,-0.3432 -0.8346,-2.3166 0.1716,-0.8424 0.6942,-2.4492 1.8018,-2.4492 1.0374,0 1.014,1.2714 0.7956,2.3634 z"
     style="font-style:italic;font-variant:normal;font-weight:normal;font-stretch:normal;font-size:64.99999762%;font-family:'TeX Gyre Bonum Math';-inkscape-font-specification:'TeX Gyre Bonum Math Italic';baseline-shift:sub"
     id="path1143" /><path
     d="m 362.4555,-481.79134 0.168,-0.84 c 0.48,-2.376 -0.432,-3.936 -1.98,-4.788 l -0.24,0.336 c 1.332,0.744 1.488,2.4 1.08,4.452 l -0.168,0.84 c -0.408,2.052 -1.236,3.708 -2.856,4.452 l 0.096,0.336 c 1.884,-0.852 3.42,-2.412 3.9,-4.788 z"
     style="font-style:italic;font-variant:normal;font-weight:normal;font-stretch:normal;font-family:'TeX Gyre Bonum Math';-inkscape-font-specification:'TeX Gyre Bonum Math Italic'"
     id="path1145" /></g><g
   id="g148-1"
   transform="matrix(0,-0.62285,0.62285,0,306.55887,472.9227)"><path
     d="M 3.9428001e-4,1.632068 C -1.1587132,1.632068 -2.1179745,2.5177379 -2.1179745,3.6007701 c 0,1.0819388 0.9592613,1.9676087 2.11836878001,1.9676087 C 1.1595017,5.5683788 2.1187631,4.6827089 2.1187631,3.6007701 2.1187631,2.5177379 1.1595017,1.632068 3.9428001e-4,1.632068"
     style="fill:#110f0d;fill-opacity:1;fill-rule:evenodd;stroke:none;stroke-width:0.60348386"
     id="path150-0"
     inkscape:connector-curvature="0" /></g><g
   id="g152-7"
   transform="matrix(0,-0.41491384,0.34051822,0,307.22823,472.89751)"
   style="paint-order:stroke fill markers"><path
     d="m 0,0 -0.84,0.12 c -4.433,0.998 -4.483,7.857 -0.12,9 l 0.84,0.12 C 4.771,9.081 5.6,2.07 1.26,0.24 L 0.84,0.12 0.42,0.06 Z M 0.06,2.04 H 0.3 L 0.48,2.1 C 2.766,2.85 2.585,6.837 0.18,7.2 L 0,7.26 H -0.18 C -2.731,6.831 -2.919,2.869 -0.54,2.1 L -0.3,2.04 h 0.18"
     style="fill:#110f0d;fill-opacity:1;fill-rule:nonzero;stroke:none;paint-order:stroke fill markers"
     id="path154-8"
     inkscape:connector-curvature="0" /></g><g
   id="g148-7"
   transform="matrix(0,-0.62285,0.62285,0,416.57665,595.93139)"><path
     d="M 3.9428001e-4,1.632068 C -1.1587132,1.632068 -2.1179745,2.5177379 -2.1179745,3.6007701 c 0,1.0819388 0.9592613,1.9676087 2.11836878001,1.9676087 C 1.1595017,5.5683788 2.1187631,4.6827089 2.1187631,3.6007701 2.1187631,2.5177379 1.1595017,1.632068 3.9428001e-4,1.632068"
     style="fill:#110f0d;fill-opacity:1;fill-rule:evenodd;stroke:none;stroke-width:0.60348386"
     id="path150-03"
     inkscape:connector-curvature="0" /></g><g
   id="g152-0"
   transform="matrix(0,-0.41491384,0.34051822,0,417.24601,595.9062)"
   style="paint-order:stroke fill markers"><path
     d="m 0,0 -0.84,0.12 c -4.433,0.998 -4.483,7.857 -0.12,9 l 0.84,0.12 C 4.771,9.081 5.6,2.07 1.26,0.24 L 0.84,0.12 0.42,0.06 Z M 0.06,2.04 H 0.3 L 0.48,2.1 C 2.766,2.85 2.585,6.837 0.18,7.2 L 0,7.26 H -0.18 C -2.731,6.831 -2.919,2.869 -0.54,2.1 L -0.3,2.04 h 0.18"
     style="fill:#110f0d;fill-opacity:1;fill-rule:nonzero;stroke:none;paint-order:stroke fill markers"
     id="path154-5"
     inkscape:connector-curvature="0" /></g></g></svg>