<?xml version="1.0" encoding="utf-8" standalone="no"?>
<!DOCTYPE svg PUBLIC "-//W3C//DTD SVG 1.1//EN"
  "http://www.w3.org/Graphics/SVG/1.1/DTD/svg11.dtd">
<!-- Created with matplotlib (http://matplotlib.org/) -->
<svg height="432pt" version="1.1" viewBox="0 0 576 432" width="576pt" xmlns="http://www.w3.org/2000/svg" xmlns:xlink="http://www.w3.org/1999/xlink">
 <defs>
  <style type="text/css">
*{stroke-linecap:butt;stroke-linejoin:round;stroke-miterlimit:100000;}
  </style>
 </defs>
 <g id="figure_1">
  <g id="patch_1">
   <path d="M 0 432 
L 576 432 
L 576 0 
L 0 0 
z
" style="fill:#ffffff;"/>
  </g>
  <g id="axes_1">
   <g id="patch_2">
    <path d="M 83.4975 403.34 
L 563.04 403.34 
L 563.04 18.81 
L 83.4975 18.81 
z
" style="fill:#ffffff;"/>
   </g>
   <g id="patch_3">
    <path clip-path="url(#pca902f3119)" d="M 138.967639 315.958907 
L 186.975831 315.958907 
L 186.975831 304.045741 
L 138.967639 304.045741 
L 138.967639 315.958907 
z
" style="fill:#228b22;fill-opacity:0.5;stroke:#228b22;stroke-linejoin:miter;stroke-width:2.0;"/>
   </g>
   <g id="patch_4">
    <path clip-path="url(#pca902f3119)" d="M 298.994945 228.88982 
L 347.003137 228.88982 
L 347.003137 188.314328 
L 298.994945 188.314328 
L 298.994945 228.88982 
z
" style="fill:#ff0000;fill-opacity:0.5;stroke:#ff0000;stroke-linejoin:miter;stroke-width:2.0;"/>
   </g>
   <g id="patch_5">
    <path clip-path="url(#pca902f3119)" d="M 459.022251 318.203855 
L 507.030443 318.203855 
L 507.030443 291.235796 
L 459.022251 291.235796 
L 459.022251 318.203855 
z
" style="fill:#ffff00;fill-opacity:0.5;stroke:#ffff00;stroke-linejoin:miter;stroke-width:2.0;"/>
   </g>
   <g id="line2d_1">
    <path clip-path="url(#pca902f3119)" d="M 162.971735 315.958907 
L 162.971735 331.314252 
" style="fill:none;stroke:#228b22;stroke-dasharray:6.000000,6.000000;stroke-dashoffset:0.0;stroke-width:2.0;"/>
   </g>
   <g id="line2d_2">
    <path clip-path="url(#pca902f3119)" d="M 162.971735 304.045741 
L 162.971735 286.261405 
" style="fill:none;stroke:#228b22;stroke-dasharray:6.000000,6.000000;stroke-dashoffset:0.0;stroke-width:2.0;"/>
   </g>
   <g id="line2d_3">
    <path clip-path="url(#pca902f3119)" d="M 150.969687 331.314252 
L 174.973783 331.314252 
" style="fill:none;stroke:#228b22;stroke-linecap:square;stroke-width:2.0;"/>
   </g>
   <g id="line2d_4">
    <path clip-path="url(#pca902f3119)" d="M 150.969687 286.261405 
L 174.973783 286.261405 
" style="fill:none;stroke:#228b22;stroke-linecap:square;stroke-width:2.0;"/>
   </g>
   <g id="line2d_5">
    <path clip-path="url(#pca902f3119)" d="M 138.967639 311.058514 
L 186.975831 311.058514 
" style="fill:none;stroke:#228b22;stroke-linecap:square;stroke-width:2.0;"/>
   </g>
   <g id="line2d_6">
    <defs>
     <path d="M 0 3 
C 0.795609 3 1.55874 2.683901 2.12132 2.12132 
C 2.683901 1.55874 3 0.795609 3 0 
C 3 -0.795609 2.683901 -1.55874 2.12132 -2.12132 
C 1.55874 -2.683901 0.795609 -3 0 -3 
C -0.795609 -3 -1.55874 -2.683901 -2.12132 -2.12132 
C -2.683901 -1.55874 -3 -0.795609 -3 0 
C -3 0.795609 -2.683901 1.55874 -2.12132 2.12132 
C -1.55874 2.683901 -0.795609 3 0 3 
z
" id="m07c362f5e3" style="stroke:#000000;stroke-width:0.5;"/>
    </defs>
    <g clip-path="url(#pca902f3119)">
     <use style="fill:#0000ff;opacity:0.5;stroke:#000000;stroke-width:0.5;" x="162.97173468345957" xlink:href="#m07c362f5e3" y="340.9028678747377"/>
     <use style="fill:#0000ff;opacity:0.5;stroke:#000000;stroke-width:0.5;" x="162.97173468345957" xlink:href="#m07c362f5e3" y="339.2378700792362"/>
     <use style="fill:#0000ff;opacity:0.5;stroke:#000000;stroke-width:0.5;" x="162.97173468345957" xlink:href="#m07c362f5e3" y="337.4907161882426"/>
     <use style="fill:#0000ff;opacity:0.5;stroke:#000000;stroke-width:0.5;" x="162.97173468345957" xlink:href="#m07c362f5e3" y="337.06260750774663"/>
     <use style="fill:#0000ff;opacity:0.5;stroke:#000000;stroke-width:0.5;" x="162.97173468345957" xlink:href="#m07c362f5e3" y="340.0850934897237"/>
     <use style="fill:#0000ff;opacity:0.5;stroke:#000000;stroke-width:0.5;" x="162.97173468345957" xlink:href="#m07c362f5e3" y="336.2264963215032"/>
     <use style="fill:#0000ff;opacity:0.5;stroke:#000000;stroke-width:0.5;" x="162.97173468345957" xlink:href="#m07c362f5e3" y="-1.0"/>
     <use style="fill:#0000ff;opacity:0.5;stroke:#000000;stroke-width:0.5;" x="162.97173468345957" xlink:href="#m07c362f5e3" y="-1.0"/>
     <use style="fill:#0000ff;opacity:0.5;stroke:#000000;stroke-width:0.5;" x="162.97173468345957" xlink:href="#m07c362f5e3" y="283.2737011957961"/>
     <use style="fill:#0000ff;opacity:0.5;stroke:#000000;stroke-width:0.5;" x="162.97173468345957" xlink:href="#m07c362f5e3" y="283.59063256904057"/>
     <use style="fill:#0000ff;opacity:0.5;stroke:#000000;stroke-width:0.5;" x="162.97173468345957" xlink:href="#m07c362f5e3" y="285.0992456260098"/>
     <use style="fill:#0000ff;opacity:0.5;stroke:#000000;stroke-width:0.5;" x="162.97173468345957" xlink:href="#m07c362f5e3" y="271.70326925135373"/>
     <use style="fill:#0000ff;opacity:0.5;stroke:#000000;stroke-width:0.5;" x="162.97173468345957" xlink:href="#m07c362f5e3" y="276.9847127468954"/>
     <use style="fill:#0000ff;opacity:0.5;stroke:#000000;stroke-width:0.5;" x="162.97173468345957" xlink:href="#m07c362f5e3" y="271.549306707843"/>
     <use style="fill:#0000ff;opacity:0.5;stroke:#000000;stroke-width:0.5;" x="162.97173468345957" xlink:href="#m07c362f5e3" y="279.2488185156358"/>
     <use style="fill:#0000ff;opacity:0.5;stroke:#000000;stroke-width:0.5;" x="162.97173468345957" xlink:href="#m07c362f5e3" y="284.4970356666887"/>
     <use style="fill:#0000ff;opacity:0.5;stroke:#000000;stroke-width:0.5;" x="162.97173468345957" xlink:href="#m07c362f5e3" y="277.199085580034"/>
     <use style="fill:#0000ff;opacity:0.5;stroke:#000000;stroke-width:0.5;" x="162.97173468345957" xlink:href="#m07c362f5e3" y="283.0410426583512"/>
     <use style="fill:#0000ff;opacity:0.5;stroke:#000000;stroke-width:0.5;" x="162.97173468345957" xlink:href="#m07c362f5e3" y="281.12111414983457"/>
     <use style="fill:#0000ff;opacity:0.5;stroke:#000000;stroke-width:0.5;" x="162.97173468345957" xlink:href="#m07c362f5e3" y="279.38554225105383"/>
     <use style="fill:#0000ff;opacity:0.5;stroke:#000000;stroke-width:0.5;" x="162.97173468345957" xlink:href="#m07c362f5e3" y="272.75615417528525"/>
     <use style="fill:#0000ff;opacity:0.5;stroke:#000000;stroke-width:0.5;" x="162.97173468345957" xlink:href="#m07c362f5e3" y="272.96354156402606"/>
     <use style="fill:#0000ff;opacity:0.5;stroke:#000000;stroke-width:0.5;" x="162.97173468345957" xlink:href="#m07c362f5e3" y="271.49786776179633"/>
     <use style="fill:#0000ff;opacity:0.5;stroke:#000000;stroke-width:0.5;" x="162.97173468345957" xlink:href="#m07c362f5e3" y="286.00011475760857"/>
     <use style="fill:#0000ff;opacity:0.5;stroke:#000000;stroke-width:0.5;" x="162.97173468345957" xlink:href="#m07c362f5e3" y="282.7608852692954"/>
     <use style="fill:#0000ff;opacity:0.5;stroke:#000000;stroke-width:0.5;" x="162.97173468345957" xlink:href="#m07c362f5e3" y="283.6628010295663"/>
     <use style="fill:#0000ff;opacity:0.5;stroke:#000000;stroke-width:0.5;" x="162.97173468345957" xlink:href="#m07c362f5e3" y="261.6737230572402"/>
     <use style="fill:#0000ff;opacity:0.5;stroke:#000000;stroke-width:0.5;" x="162.97173468345957" xlink:href="#m07c362f5e3" y="281.0645274557206"/>
     <use style="fill:#0000ff;opacity:0.5;stroke:#000000;stroke-width:0.5;" x="162.97173468345957" xlink:href="#m07c362f5e3" y="285.97915878468956"/>
     <use style="fill:#0000ff;opacity:0.5;stroke:#000000;stroke-width:0.5;" x="162.97173468345957" xlink:href="#m07c362f5e3" y="262.92837680037303"/>
     <use style="fill:#0000ff;opacity:0.5;stroke:#000000;stroke-width:0.5;" x="162.97173468345957" xlink:href="#m07c362f5e3" y="285.76758993498095"/>
     <use style="fill:#0000ff;opacity:0.5;stroke:#000000;stroke-width:0.5;" x="162.97173468345957" xlink:href="#m07c362f5e3" y="281.46371664866734"/>
     <use style="fill:#0000ff;opacity:0.5;stroke:#000000;stroke-width:0.5;" x="162.97173468345957" xlink:href="#m07c362f5e3" y="284.02545234616446"/>
     <use style="fill:#0000ff;opacity:0.5;stroke:#000000;stroke-width:0.5;" x="162.97173468345957" xlink:href="#m07c362f5e3" y="260.06972001317416"/>
     <use style="fill:#0000ff;opacity:0.5;stroke:#000000;stroke-width:0.5;" x="162.97173468345957" xlink:href="#m07c362f5e3" y="283.48035542528413"/>
     <use style="fill:#0000ff;opacity:0.5;stroke:#000000;stroke-width:0.5;" x="162.97173468345957" xlink:href="#m07c362f5e3" y="284.98636602822995"/>
     <use style="fill:#0000ff;opacity:0.5;stroke:#000000;stroke-width:0.5;" x="162.97173468345957" xlink:href="#m07c362f5e3" y="285.0773445626408"/>
     <use style="fill:#0000ff;opacity:0.5;stroke:#000000;stroke-width:0.5;" x="162.97173468345957" xlink:href="#m07c362f5e3" y="220.4077303703735"/>
     <use style="fill:#0000ff;opacity:0.5;stroke:#000000;stroke-width:0.5;" x="162.97173468345957" xlink:href="#m07c362f5e3" y="265.7135945256971"/>
     <use style="fill:#0000ff;opacity:0.5;stroke:#000000;stroke-width:0.5;" x="162.97173468345957" xlink:href="#m07c362f5e3" y="276.03302107839545"/>
     <use style="fill:#0000ff;opacity:0.5;stroke:#000000;stroke-width:0.5;" x="162.97173468345957" xlink:href="#m07c362f5e3" y="254.4543819087899"/>
     <use style="fill:#0000ff;opacity:0.5;stroke:#000000;stroke-width:0.5;" x="162.97173468345957" xlink:href="#m07c362f5e3" y="281.65394143338824"/>
     <use style="fill:#0000ff;opacity:0.5;stroke:#000000;stroke-width:0.5;" x="162.97173468345957" xlink:href="#m07c362f5e3" y="277.4273089389574"/>
     <use style="fill:#0000ff;opacity:0.5;stroke:#000000;stroke-width:0.5;" x="162.97173468345957" xlink:href="#m07c362f5e3" y="285.58586121168787"/>
     <use style="fill:#0000ff;opacity:0.5;stroke:#000000;stroke-width:0.5;" x="162.97173468345957" xlink:href="#m07c362f5e3" y="285.72624302525617"/>
     <use style="fill:#0000ff;opacity:0.5;stroke:#000000;stroke-width:0.5;" x="162.97173468345957" xlink:href="#m07c362f5e3" y="285.4356386640073"/>
     <use style="fill:#0000ff;opacity:0.5;stroke:#000000;stroke-width:0.5;" x="162.97173468345957" xlink:href="#m07c362f5e3" y="285.17970408598165"/>
     <use style="fill:#0000ff;opacity:0.5;stroke:#000000;stroke-width:0.5;" x="162.97173468345957" xlink:href="#m07c362f5e3" y="285.0991439615764"/>
     <use style="fill:#0000ff;opacity:0.5;stroke:#000000;stroke-width:0.5;" x="162.97173468345957" xlink:href="#m07c362f5e3" y="280.9481078561941"/>
     <use style="fill:#0000ff;opacity:0.5;stroke:#000000;stroke-width:0.5;" x="162.97173468345957" xlink:href="#m07c362f5e3" y="283.27874939705987"/>
     <use style="fill:#0000ff;opacity:0.5;stroke:#000000;stroke-width:0.5;" x="162.97173468345957" xlink:href="#m07c362f5e3" y="277.23894362990245"/>
     <use style="fill:#0000ff;opacity:0.5;stroke:#000000;stroke-width:0.5;" x="162.97173468345957" xlink:href="#m07c362f5e3" y="284.48249045711157"/>
     <use style="fill:#0000ff;opacity:0.5;stroke:#000000;stroke-width:0.5;" x="162.97173468345957" xlink:href="#m07c362f5e3" y="280.430256057639"/>
     <use style="fill:#0000ff;opacity:0.5;stroke:#000000;stroke-width:0.5;" x="162.97173468345957" xlink:href="#m07c362f5e3" y="285.82662552356794"/>
     <use style="fill:#0000ff;opacity:0.5;stroke:#000000;stroke-width:0.5;" x="162.97173468345957" xlink:href="#m07c362f5e3" y="283.97138437372723"/>
     <use style="fill:#0000ff;opacity:0.5;stroke:#000000;stroke-width:0.5;" x="162.97173468345957" xlink:href="#m07c362f5e3" y="282.7621122802622"/>
     <use style="fill:#0000ff;opacity:0.5;stroke:#000000;stroke-width:0.5;" x="162.97173468345957" xlink:href="#m07c362f5e3" y="285.0356258020803"/>
     <use style="fill:#0000ff;opacity:0.5;stroke:#000000;stroke-width:0.5;" x="162.97173468345957" xlink:href="#m07c362f5e3" y="278.1324225506107"/>
     <use style="fill:#0000ff;opacity:0.5;stroke:#000000;stroke-width:0.5;" x="162.97173468345957" xlink:href="#m07c362f5e3" y="271.0226906784161"/>
     <use style="fill:#0000ff;opacity:0.5;stroke:#000000;stroke-width:0.5;" x="162.97173468345957" xlink:href="#m07c362f5e3" y="276.39047104244264"/>
     <use style="fill:#0000ff;opacity:0.5;stroke:#000000;stroke-width:0.5;" x="162.97173468345957" xlink:href="#m07c362f5e3" y="240.88586451731746"/>
     <use style="fill:#0000ff;opacity:0.5;stroke:#000000;stroke-width:0.5;" x="162.97173468345957" xlink:href="#m07c362f5e3" y="239.66967661565485"/>
     <use style="fill:#0000ff;opacity:0.5;stroke:#000000;stroke-width:0.5;" x="162.97173468345957" xlink:href="#m07c362f5e3" y="245.57779667966145"/>
     <use style="fill:#0000ff;opacity:0.5;stroke:#000000;stroke-width:0.5;" x="162.97173468345957" xlink:href="#m07c362f5e3" y="250.831821750052"/>
     <use style="fill:#0000ff;opacity:0.5;stroke:#000000;stroke-width:0.5;" x="162.97173468345957" xlink:href="#m07c362f5e3" y="238.14911862134724"/>
     <use style="fill:#0000ff;opacity:0.5;stroke:#000000;stroke-width:0.5;" x="162.97173468345957" xlink:href="#m07c362f5e3" y="246.8580667609711"/>
     <use style="fill:#0000ff;opacity:0.5;stroke:#000000;stroke-width:0.5;" x="162.97173468345957" xlink:href="#m07c362f5e3" y="259.4918683054526"/>
     <use style="fill:#0000ff;opacity:0.5;stroke:#000000;stroke-width:0.5;" x="162.97173468345957" xlink:href="#m07c362f5e3" y="246.43281991715028"/>
     <use style="fill:#0000ff;opacity:0.5;stroke:#000000;stroke-width:0.5;" x="162.97173468345957" xlink:href="#m07c362f5e3" y="243.76888652635608"/>
     <use style="fill:#0000ff;opacity:0.5;stroke:#000000;stroke-width:0.5;" x="162.97173468345957" xlink:href="#m07c362f5e3" y="247.6858579371213"/>
     <use style="fill:#0000ff;opacity:0.5;stroke:#000000;stroke-width:0.5;" x="162.97173468345957" xlink:href="#m07c362f5e3" y="275.29576495692936"/>
     <use style="fill:#0000ff;opacity:0.5;stroke:#000000;stroke-width:0.5;" x="162.97173468345957" xlink:href="#m07c362f5e3" y="282.9499235550461"/>
     <use style="fill:#0000ff;opacity:0.5;stroke:#000000;stroke-width:0.5;" x="162.97173468345957" xlink:href="#m07c362f5e3" y="247.88250191587431"/>
     <use style="fill:#0000ff;opacity:0.5;stroke:#000000;stroke-width:0.5;" x="162.97173468345957" xlink:href="#m07c362f5e3" y="275.08913695639876"/>
     <use style="fill:#0000ff;opacity:0.5;stroke:#000000;stroke-width:0.5;" x="162.97173468345957" xlink:href="#m07c362f5e3" y="282.29480447258527"/>
     <use style="fill:#0000ff;opacity:0.5;stroke:#000000;stroke-width:0.5;" x="162.97173468345957" xlink:href="#m07c362f5e3" y="285.6468352426824"/>
     <use style="fill:#0000ff;opacity:0.5;stroke:#000000;stroke-width:0.5;" x="162.97173468345957" xlink:href="#m07c362f5e3" y="285.87620518692876"/>
     <use style="fill:#0000ff;opacity:0.5;stroke:#000000;stroke-width:0.5;" x="162.97173468345957" xlink:href="#m07c362f5e3" y="285.6431640231291"/>
     <use style="fill:#0000ff;opacity:0.5;stroke:#000000;stroke-width:0.5;" x="162.97173468345957" xlink:href="#m07c362f5e3" y="279.1764327814949"/>
     <use style="fill:#0000ff;opacity:0.5;stroke:#000000;stroke-width:0.5;" x="162.97173468345957" xlink:href="#m07c362f5e3" y="275.7577033238785"/>
     <use style="fill:#0000ff;opacity:0.5;stroke:#000000;stroke-width:0.5;" x="162.97173468345957" xlink:href="#m07c362f5e3" y="276.56761750700264"/>
     <use style="fill:#0000ff;opacity:0.5;stroke:#000000;stroke-width:0.5;" x="162.97173468345957" xlink:href="#m07c362f5e3" y="286.1225007860829"/>
     <use style="fill:#0000ff;opacity:0.5;stroke:#000000;stroke-width:0.5;" x="162.97173468345957" xlink:href="#m07c362f5e3" y="276.972897202275"/>
     <use style="fill:#0000ff;opacity:0.5;stroke:#000000;stroke-width:0.5;" x="162.97173468345957" xlink:href="#m07c362f5e3" y="280.1121563048145"/>
     <use style="fill:#0000ff;opacity:0.5;stroke:#000000;stroke-width:0.5;" x="162.97173468345957" xlink:href="#m07c362f5e3" y="284.8126402069911"/>
     <use style="fill:#0000ff;opacity:0.5;stroke:#000000;stroke-width:0.5;" x="162.97173468345957" xlink:href="#m07c362f5e3" y="282.7437437281968"/>
     <use style="fill:#0000ff;opacity:0.5;stroke:#000000;stroke-width:0.5;" x="162.97173468345957" xlink:href="#m07c362f5e3" y="285.44074215906494"/>
     <use style="fill:#0000ff;opacity:0.5;stroke:#000000;stroke-width:0.5;" x="162.97173468345957" xlink:href="#m07c362f5e3" y="285.65177443664015"/>
     <use style="fill:#0000ff;opacity:0.5;stroke:#000000;stroke-width:0.5;" x="162.97173468345957" xlink:href="#m07c362f5e3" y="285.28144115690395"/>
     <use style="fill:#0000ff;opacity:0.5;stroke:#000000;stroke-width:0.5;" x="162.97173468345957" xlink:href="#m07c362f5e3" y="278.9112420028159"/>
     <use style="fill:#0000ff;opacity:0.5;stroke:#000000;stroke-width:0.5;" x="162.97173468345957" xlink:href="#m07c362f5e3" y="285.26086238204067"/>
     <use style="fill:#0000ff;opacity:0.5;stroke:#000000;stroke-width:0.5;" x="162.97173468345957" xlink:href="#m07c362f5e3" y="281.22514504018505"/>
     <use style="fill:#0000ff;opacity:0.5;stroke:#000000;stroke-width:0.5;" x="162.97173468345957" xlink:href="#m07c362f5e3" y="279.11319178601843"/>
     <use style="fill:#0000ff;opacity:0.5;stroke:#000000;stroke-width:0.5;" x="162.97173468345957" xlink:href="#m07c362f5e3" y="280.89873891352033"/>
     <use style="fill:#0000ff;opacity:0.5;stroke:#000000;stroke-width:0.5;" x="162.97173468345957" xlink:href="#m07c362f5e3" y="284.24264059413156"/>
     <use style="fill:#0000ff;opacity:0.5;stroke:#000000;stroke-width:0.5;" x="162.97173468345957" xlink:href="#m07c362f5e3" y="282.74437341749535"/>
     <use style="fill:#0000ff;opacity:0.5;stroke:#000000;stroke-width:0.5;" x="162.97173468345957" xlink:href="#m07c362f5e3" y="285.4776771982298"/>
     <use style="fill:#0000ff;opacity:0.5;stroke:#000000;stroke-width:0.5;" x="162.97173468345957" xlink:href="#m07c362f5e3" y="285.8752230627748"/>
     <use style="fill:#0000ff;opacity:0.5;stroke:#000000;stroke-width:0.5;" x="162.97173468345957" xlink:href="#m07c362f5e3" y="285.5639724903784"/>
     <use style="fill:#0000ff;opacity:0.5;stroke:#000000;stroke-width:0.5;" x="162.97173468345957" xlink:href="#m07c362f5e3" y="283.75202935369896"/>
    </g>
   </g>
   <g id="line2d_7">
    <path clip-path="url(#pca902f3119)" d="M 322.999041 228.88982 
L 322.999041 277.03125 
" style="fill:none;stroke:#ff0000;stroke-dasharray:6.000000,6.000000;stroke-dashoffset:0.0;stroke-width:2.0;"/>
   </g>
   <g id="line2d_8">
    <path clip-path="url(#pca902f3119)" d="M 322.999041 188.314328 
L 322.999041 127.488728 
" style="fill:none;stroke:#ff0000;stroke-dasharray:6.000000,6.000000;stroke-dashoffset:0.0;stroke-width:2.0;"/>
   </g>
   <g id="line2d_9">
    <path clip-path="url(#pca902f3119)" d="M 310.996993 277.03125 
L 335.001089 277.03125 
" style="fill:none;stroke:#ff0000;stroke-linecap:square;stroke-width:2.0;"/>
   </g>
   <g id="line2d_10">
    <path clip-path="url(#pca902f3119)" d="M 310.996993 127.488728 
L 335.001089 127.488728 
" style="fill:none;stroke:#ff0000;stroke-linecap:square;stroke-width:2.0;"/>
   </g>
   <g id="line2d_11">
    <path clip-path="url(#pca902f3119)" d="M 298.994945 213.839554 
L 347.003137 213.839554 
" style="fill:none;stroke:#ff0000;stroke-linecap:square;stroke-width:2.0;"/>
   </g>
   <g id="line2d_12">
    <g clip-path="url(#pca902f3119)">
     <use style="fill:#0000ff;opacity:0.5;stroke:#000000;stroke-width:0.5;" x="322.9990408100757" xlink:href="#m07c362f5e3" y="-537.0876152169994"/>
     <use style="fill:#0000ff;opacity:0.5;stroke:#000000;stroke-width:0.5;" x="322.9990408100757" xlink:href="#m07c362f5e3" y="-1.0"/>
     <use style="fill:#0000ff;opacity:0.5;stroke:#000000;stroke-width:0.5;" x="322.9990408100757" xlink:href="#m07c362f5e3" y="125.76609983012662"/>
     <use style="fill:#0000ff;opacity:0.5;stroke:#000000;stroke-width:0.5;" x="322.9990408100757" xlink:href="#m07c362f5e3" y="111.4823168102879"/>
     <use style="fill:#0000ff;opacity:0.5;stroke:#000000;stroke-width:0.5;" x="322.9990408100757" xlink:href="#m07c362f5e3" y="116.94397500807776"/>
     <use style="fill:#0000ff;opacity:0.5;stroke:#000000;stroke-width:0.5;" x="322.9990408100757" xlink:href="#m07c362f5e3" y="118.28100574390038"/>
     <use style="fill:#0000ff;opacity:0.5;stroke:#000000;stroke-width:0.5;" x="322.9990408100757" xlink:href="#m07c362f5e3" y="126.58096113215981"/>
     <use style="fill:#0000ff;opacity:0.5;stroke:#000000;stroke-width:0.5;" x="322.9990408100757" xlink:href="#m07c362f5e3" y="124.35058219634737"/>
     <use style="fill:#0000ff;opacity:0.5;stroke:#000000;stroke-width:0.5;" x="322.9990408100757" xlink:href="#m07c362f5e3" y="125.75598666890198"/>
     <use style="fill:#0000ff;opacity:0.5;stroke:#000000;stroke-width:0.5;" x="322.9990408100757" xlink:href="#m07c362f5e3" y="125.04175820275742"/>
     <use style="fill:#0000ff;opacity:0.5;stroke:#000000;stroke-width:0.5;" x="322.9990408100757" xlink:href="#m07c362f5e3" y="104.61869759262606"/>
     <use style="fill:#0000ff;opacity:0.5;stroke:#000000;stroke-width:0.5;" x="322.9990408100757" xlink:href="#m07c362f5e3" y="122.59755843592592"/>
     <use style="fill:#0000ff;opacity:0.5;stroke:#000000;stroke-width:0.5;" x="322.9990408100757" xlink:href="#m07c362f5e3" y="112.32904908702108"/>
     <use style="fill:#0000ff;opacity:0.5;stroke:#000000;stroke-width:0.5;" x="322.9990408100757" xlink:href="#m07c362f5e3" y="-1.0"/>
     <use style="fill:#0000ff;opacity:0.5;stroke:#000000;stroke-width:0.5;" x="322.9990408100757" xlink:href="#m07c362f5e3" y="-1.0"/>
     <use style="fill:#0000ff;opacity:0.5;stroke:#000000;stroke-width:0.5;" x="322.9990408100757" xlink:href="#m07c362f5e3" y="85.65043837345013"/>
     <use style="fill:#0000ff;opacity:0.5;stroke:#000000;stroke-width:0.5;" x="322.9990408100757" xlink:href="#m07c362f5e3" y="82.38973635282753"/>
     <use style="fill:#0000ff;opacity:0.5;stroke:#000000;stroke-width:0.5;" x="322.9990408100757" xlink:href="#m07c362f5e3" y="117.84783090411844"/>
     <use style="fill:#0000ff;opacity:0.5;stroke:#000000;stroke-width:0.5;" x="322.9990408100757" xlink:href="#m07c362f5e3" y="53.42398924797203"/>
     <use style="fill:#0000ff;opacity:0.5;stroke:#000000;stroke-width:0.5;" x="322.9990408100757" xlink:href="#m07c362f5e3" y="73.13761615381509"/>
     <use style="fill:#0000ff;opacity:0.5;stroke:#000000;stroke-width:0.5;" x="322.9990408100757" xlink:href="#m07c362f5e3" y="100.13149482004155"/>
     <use style="fill:#0000ff;opacity:0.5;stroke:#000000;stroke-width:0.5;" x="322.9990408100757" xlink:href="#m07c362f5e3" y="59.83969333641744"/>
     <use style="fill:#0000ff;opacity:0.5;stroke:#000000;stroke-width:0.5;" x="322.9990408100757" xlink:href="#m07c362f5e3" y="67.57723582391793"/>
     <use style="fill:#0000ff;opacity:0.5;stroke:#000000;stroke-width:0.5;" x="322.9990408100757" xlink:href="#m07c362f5e3" y="93.42913066424182"/>
     <use style="fill:#0000ff;opacity:0.5;stroke:#000000;stroke-width:0.5;" x="322.9990408100757" xlink:href="#m07c362f5e3" y="78.9149362275752"/>
     <use style="fill:#0000ff;opacity:0.5;stroke:#000000;stroke-width:0.5;" x="322.9990408100757" xlink:href="#m07c362f5e3" y="121.65157360217512"/>
     <use style="fill:#0000ff;opacity:0.5;stroke:#000000;stroke-width:0.5;" x="322.9990408100757" xlink:href="#m07c362f5e3" y="127.19251102705596"/>
     <use style="fill:#0000ff;opacity:0.5;stroke:#000000;stroke-width:0.5;" x="322.9990408100757" xlink:href="#m07c362f5e3" y="93.89465041414627"/>
     <use style="fill:#0000ff;opacity:0.5;stroke:#000000;stroke-width:0.5;" x="322.9990408100757" xlink:href="#m07c362f5e3" y="52.07042469968843"/>
     <use style="fill:#0000ff;opacity:0.5;stroke:#000000;stroke-width:0.5;" x="322.9990408100757" xlink:href="#m07c362f5e3" y="102.99721320531859"/>
     <use style="fill:#0000ff;opacity:0.5;stroke:#000000;stroke-width:0.5;" x="322.9990408100757" xlink:href="#m07c362f5e3" y="84.18506934295755"/>
     <use style="fill:#0000ff;opacity:0.5;stroke:#000000;stroke-width:0.5;" x="322.9990408100757" xlink:href="#m07c362f5e3" y="69.26217061199384"/>
     <use style="fill:#0000ff;opacity:0.5;stroke:#000000;stroke-width:0.5;" x="322.9990408100757" xlink:href="#m07c362f5e3" y="62.68756065833611"/>
     <use style="fill:#0000ff;opacity:0.5;stroke:#000000;stroke-width:0.5;" x="322.9990408100757" xlink:href="#m07c362f5e3" y="108.92558470674919"/>
     <use style="fill:#0000ff;opacity:0.5;stroke:#000000;stroke-width:0.5;" x="322.9990408100757" xlink:href="#m07c362f5e3" y="102.42128045668693"/>
     <use style="fill:#0000ff;opacity:0.5;stroke:#000000;stroke-width:0.5;" x="322.9990408100757" xlink:href="#m07c362f5e3" y="115.50403640713529"/>
     <use style="fill:#0000ff;opacity:0.5;stroke:#000000;stroke-width:0.5;" x="322.9990408100757" xlink:href="#m07c362f5e3" y="106.12148186714882"/>
     <use style="fill:#0000ff;opacity:0.5;stroke:#000000;stroke-width:0.5;" x="322.9990408100757" xlink:href="#m07c362f5e3" y="126.80995467364488"/>
     <use style="fill:#0000ff;opacity:0.5;stroke:#000000;stroke-width:0.5;" x="322.9990408100757" xlink:href="#m07c362f5e3" y="101.39960032692613"/>
     <use style="fill:#0000ff;opacity:0.5;stroke:#000000;stroke-width:0.5;" x="322.9990408100757" xlink:href="#m07c362f5e3" y="118.47482385317022"/>
     <use style="fill:#0000ff;opacity:0.5;stroke:#000000;stroke-width:0.5;" x="322.9990408100757" xlink:href="#m07c362f5e3" y="121.16707945798203"/>
     <use style="fill:#0000ff;opacity:0.5;stroke:#000000;stroke-width:0.5;" x="322.9990408100757" xlink:href="#m07c362f5e3" y="120.43178928009166"/>
     <use style="fill:#0000ff;opacity:0.5;stroke:#000000;stroke-width:0.5;" x="322.9990408100757" xlink:href="#m07c362f5e3" y="106.15354750555849"/>
     <use style="fill:#0000ff;opacity:0.5;stroke:#000000;stroke-width:0.5;" x="322.9990408100757" xlink:href="#m07c362f5e3" y="118.47466623162512"/>
     <use style="fill:#0000ff;opacity:0.5;stroke:#000000;stroke-width:0.5;" x="322.9990408100757" xlink:href="#m07c362f5e3" y="126.12881206761324"/>
     <use style="fill:#0000ff;opacity:0.5;stroke:#000000;stroke-width:0.5;" x="322.9990408100757" xlink:href="#m07c362f5e3" y="123.36493381210175"/>
     <use style="fill:#0000ff;opacity:0.5;stroke:#000000;stroke-width:0.5;" x="322.9990408100757" xlink:href="#m07c362f5e3" y="121.4354081317062"/>
     <use style="fill:#0000ff;opacity:0.5;stroke:#000000;stroke-width:0.5;" x="322.9990408100757" xlink:href="#m07c362f5e3" y="60.8894153573724"/>
     <use style="fill:#0000ff;opacity:0.5;stroke:#000000;stroke-width:0.5;" x="322.9990408100757" xlink:href="#m07c362f5e3" y="107.10492637142175"/>
     <use style="fill:#0000ff;opacity:0.5;stroke:#000000;stroke-width:0.5;" x="322.9990408100757" xlink:href="#m07c362f5e3" y="89.50986534293861"/>
     <use style="fill:#0000ff;opacity:0.5;stroke:#000000;stroke-width:0.5;" x="322.9990408100757" xlink:href="#m07c362f5e3" y="95.8973482897992"/>
     <use style="fill:#0000ff;opacity:0.5;stroke:#000000;stroke-width:0.5;" x="322.9990408100757" xlink:href="#m07c362f5e3" y="107.51562913541449"/>
     <use style="fill:#0000ff;opacity:0.5;stroke:#000000;stroke-width:0.5;" x="322.9990408100757" xlink:href="#m07c362f5e3" y="79.4025893992117"/>
     <use style="fill:#0000ff;opacity:0.5;stroke:#000000;stroke-width:0.5;" x="322.9990408100757" xlink:href="#m07c362f5e3" y="116.81463514409432"/>
     <use style="fill:#0000ff;opacity:0.5;stroke:#000000;stroke-width:0.5;" x="322.9990408100757" xlink:href="#m07c362f5e3" y="78.70280181834283"/>
     <use style="fill:#0000ff;opacity:0.5;stroke:#000000;stroke-width:0.5;" x="322.9990408100757" xlink:href="#m07c362f5e3" y="92.01977983726272"/>
     <use style="fill:#0000ff;opacity:0.5;stroke:#000000;stroke-width:0.5;" x="322.9990408100757" xlink:href="#m07c362f5e3" y="87.05101133203885"/>
     <use style="fill:#0000ff;opacity:0.5;stroke:#000000;stroke-width:0.5;" x="322.9990408100757" xlink:href="#m07c362f5e3" y="111.27103225770156"/>
     <use style="fill:#0000ff;opacity:0.5;stroke:#000000;stroke-width:0.5;" x="322.9990408100757" xlink:href="#m07c362f5e3" y="84.2684545172911"/>
     <use style="fill:#0000ff;opacity:0.5;stroke:#000000;stroke-width:0.5;" x="322.9990408100757" xlink:href="#m07c362f5e3" y="93.91727763455367"/>
     <use style="fill:#0000ff;opacity:0.5;stroke:#000000;stroke-width:0.5;" x="322.9990408100757" xlink:href="#m07c362f5e3" y="94.47699047355292"/>
     <use style="fill:#0000ff;opacity:0.5;stroke:#000000;stroke-width:0.5;" x="322.9990408100757" xlink:href="#m07c362f5e3" y="82.3318726463749"/>
     <use style="fill:#0000ff;opacity:0.5;stroke:#000000;stroke-width:0.5;" x="322.9990408100757" xlink:href="#m07c362f5e3" y="72.79660457324132"/>
     <use style="fill:#0000ff;opacity:0.5;stroke:#000000;stroke-width:0.5;" x="322.9990408100757" xlink:href="#m07c362f5e3" y="81.70723437980138"/>
     <use style="fill:#0000ff;opacity:0.5;stroke:#000000;stroke-width:0.5;" x="322.9990408100757" xlink:href="#m07c362f5e3" y="84.47381748965586"/>
     <use style="fill:#0000ff;opacity:0.5;stroke:#000000;stroke-width:0.5;" x="322.9990408100757" xlink:href="#m07c362f5e3" y="88.5305092353666"/>
     <use style="fill:#0000ff;opacity:0.5;stroke:#000000;stroke-width:0.5;" x="322.9990408100757" xlink:href="#m07c362f5e3" y="118.51732755974211"/>
     <use style="fill:#0000ff;opacity:0.5;stroke:#000000;stroke-width:0.5;" x="322.9990408100757" xlink:href="#m07c362f5e3" y="73.68212499009962"/>
     <use style="fill:#0000ff;opacity:0.5;stroke:#000000;stroke-width:0.5;" x="322.9990408100757" xlink:href="#m07c362f5e3" y="125.63034573546321"/>
     <use style="fill:#0000ff;opacity:0.5;stroke:#000000;stroke-width:0.5;" x="322.9990408100757" xlink:href="#m07c362f5e3" y="120.4865113349424"/>
     <use style="fill:#0000ff;opacity:0.5;stroke:#000000;stroke-width:0.5;" x="322.9990408100757" xlink:href="#m07c362f5e3" y="117.06924401134836"/>
     <use style="fill:#0000ff;opacity:0.5;stroke:#000000;stroke-width:0.5;" x="322.9990408100757" xlink:href="#m07c362f5e3" y="112.0043231709185"/>
     <use style="fill:#0000ff;opacity:0.5;stroke:#000000;stroke-width:0.5;" x="322.9990408100757" xlink:href="#m07c362f5e3" y="120.3360923597063"/>
     <use style="fill:#0000ff;opacity:0.5;stroke:#000000;stroke-width:0.5;" x="322.9990408100757" xlink:href="#m07c362f5e3" y="109.28018045503774"/>
     <use style="fill:#0000ff;opacity:0.5;stroke:#000000;stroke-width:0.5;" x="322.9990408100757" xlink:href="#m07c362f5e3" y="112.28158821011931"/>
     <use style="fill:#0000ff;opacity:0.5;stroke:#000000;stroke-width:0.5;" x="322.9990408100757" xlink:href="#m07c362f5e3" y="125.26998970200111"/>
     <use style="fill:#0000ff;opacity:0.5;stroke:#000000;stroke-width:0.5;" x="322.9990408100757" xlink:href="#m07c362f5e3" y="121.64682707004664"/>
     <use style="fill:#0000ff;opacity:0.5;stroke:#000000;stroke-width:0.5;" x="322.9990408100757" xlink:href="#m07c362f5e3" y="124.62459723688477"/>
     <use style="fill:#0000ff;opacity:0.5;stroke:#000000;stroke-width:0.5;" x="322.9990408100757" xlink:href="#m07c362f5e3" y="118.95076408992242"/>
     <use style="fill:#0000ff;opacity:0.5;stroke:#000000;stroke-width:0.5;" x="322.9990408100757" xlink:href="#m07c362f5e3" y="126.35594981137848"/>
     <use style="fill:#0000ff;opacity:0.5;stroke:#000000;stroke-width:0.5;" x="322.9990408100757" xlink:href="#m07c362f5e3" y="120.2812430066702"/>
     <use style="fill:#0000ff;opacity:0.5;stroke:#000000;stroke-width:0.5;" x="322.9990408100757" xlink:href="#m07c362f5e3" y="110.54734986766061"/>
     <use style="fill:#0000ff;opacity:0.5;stroke:#000000;stroke-width:0.5;" x="322.9990408100757" xlink:href="#m07c362f5e3" y="101.87696216418573"/>
     <use style="fill:#0000ff;opacity:0.5;stroke:#000000;stroke-width:0.5;" x="322.9990408100757" xlink:href="#m07c362f5e3" y="105.83539668778661"/>
     <use style="fill:#0000ff;opacity:0.5;stroke:#000000;stroke-width:0.5;" x="322.9990408100757" xlink:href="#m07c362f5e3" y="84.42859299188001"/>
     <use style="fill:#0000ff;opacity:0.5;stroke:#000000;stroke-width:0.5;" x="322.9990408100757" xlink:href="#m07c362f5e3" y="94.02176833978353"/>
     <use style="fill:#0000ff;opacity:0.5;stroke:#000000;stroke-width:0.5;" x="322.9990408100757" xlink:href="#m07c362f5e3" y="98.15509642895495"/>
     <use style="fill:#0000ff;opacity:0.5;stroke:#000000;stroke-width:0.5;" x="322.9990408100757" xlink:href="#m07c362f5e3" y="76.59071280137408"/>
     <use style="fill:#0000ff;opacity:0.5;stroke:#000000;stroke-width:0.5;" x="322.9990408100757" xlink:href="#m07c362f5e3" y="59.87487476906955"/>
     <use style="fill:#0000ff;opacity:0.5;stroke:#000000;stroke-width:0.5;" x="322.9990408100757" xlink:href="#m07c362f5e3" y="93.77620654146523"/>
     <use style="fill:#0000ff;opacity:0.5;stroke:#000000;stroke-width:0.5;" x="322.9990408100757" xlink:href="#m07c362f5e3" y="83.6795566777568"/>
     <use style="fill:#0000ff;opacity:0.5;stroke:#000000;stroke-width:0.5;" x="322.9990408100757" xlink:href="#m07c362f5e3" y="76.92187206745251"/>
     <use style="fill:#0000ff;opacity:0.5;stroke:#000000;stroke-width:0.5;" x="322.9990408100757" xlink:href="#m07c362f5e3" y="71.53115848341139"/>
     <use style="fill:#0000ff;opacity:0.5;stroke:#000000;stroke-width:0.5;" x="322.9990408100757" xlink:href="#m07c362f5e3" y="113.00762802272055"/>
     <use style="fill:#0000ff;opacity:0.5;stroke:#000000;stroke-width:0.5;" x="322.9990408100757" xlink:href="#m07c362f5e3" y="64.10025843955617"/>
     <use style="fill:#0000ff;opacity:0.5;stroke:#000000;stroke-width:0.5;" x="322.9990408100757" xlink:href="#m07c362f5e3" y="65.48839118540184"/>
     <use style="fill:#0000ff;opacity:0.5;stroke:#000000;stroke-width:0.5;" x="322.9990408100757" xlink:href="#m07c362f5e3" y="82.42825074377754"/>
     <use style="fill:#0000ff;opacity:0.5;stroke:#000000;stroke-width:0.5;" x="322.9990408100757" xlink:href="#m07c362f5e3" y="81.15118083969463"/>
     <use style="fill:#0000ff;opacity:0.5;stroke:#000000;stroke-width:0.5;" x="322.9990408100757" xlink:href="#m07c362f5e3" y="127.14040929738803"/>
     <use style="fill:#0000ff;opacity:0.5;stroke:#000000;stroke-width:0.5;" x="322.9990408100757" xlink:href="#m07c362f5e3" y="107.13564105741119"/>
     <use style="fill:#0000ff;opacity:0.5;stroke:#000000;stroke-width:0.5;" x="322.9990408100757" xlink:href="#m07c362f5e3" y="106.87474295527642"/>
     <use style="fill:#0000ff;opacity:0.5;stroke:#000000;stroke-width:0.5;" x="322.9990408100757" xlink:href="#m07c362f5e3" y="117.37329170462061"/>
     <use style="fill:#0000ff;opacity:0.5;stroke:#000000;stroke-width:0.5;" x="322.9990408100757" xlink:href="#m07c362f5e3" y="125.10178791825501"/>
     <use style="fill:#0000ff;opacity:0.5;stroke:#000000;stroke-width:0.5;" x="322.9990408100757" xlink:href="#m07c362f5e3" y="117.63533258416908"/>
     <use style="fill:#0000ff;opacity:0.5;stroke:#000000;stroke-width:0.5;" x="322.9990408100757" xlink:href="#m07c362f5e3" y="112.55074049481954"/>
     <use style="fill:#0000ff;opacity:0.5;stroke:#000000;stroke-width:0.5;" x="322.9990408100757" xlink:href="#m07c362f5e3" y="126.77580977213017"/>
     <use style="fill:#0000ff;opacity:0.5;stroke:#000000;stroke-width:0.5;" x="322.9990408100757" xlink:href="#m07c362f5e3" y="106.31802397198146"/>
     <use style="fill:#0000ff;opacity:0.5;stroke:#000000;stroke-width:0.5;" x="322.9990408100757" xlink:href="#m07c362f5e3" y="109.67846832749336"/>
     <use style="fill:#0000ff;opacity:0.5;stroke:#000000;stroke-width:0.5;" x="322.9990408100757" xlink:href="#m07c362f5e3" y="112.70096169923892"/>
     <use style="fill:#0000ff;opacity:0.5;stroke:#000000;stroke-width:0.5;" x="322.9990408100757" xlink:href="#m07c362f5e3" y="101.03722209516167"/>
     <use style="fill:#0000ff;opacity:0.5;stroke:#000000;stroke-width:0.5;" x="322.9990408100757" xlink:href="#m07c362f5e3" y="126.02002072590193"/>
     <use style="fill:#0000ff;opacity:0.5;stroke:#000000;stroke-width:0.5;" x="322.9990408100757" xlink:href="#m07c362f5e3" y="121.89656627637277"/>
     <use style="fill:#0000ff;opacity:0.5;stroke:#000000;stroke-width:0.5;" x="322.9990408100757" xlink:href="#m07c362f5e3" y="124.1771030296332"/>
     <use style="fill:#0000ff;opacity:0.5;stroke:#000000;stroke-width:0.5;" x="322.9990408100757" xlink:href="#m07c362f5e3" y="109.52665778759831"/>
     <use style="fill:#0000ff;opacity:0.5;stroke:#000000;stroke-width:0.5;" x="322.9990408100757" xlink:href="#m07c362f5e3" y="122.56830360250757"/>
     <use style="fill:#0000ff;opacity:0.5;stroke:#000000;stroke-width:0.5;" x="322.9990408100757" xlink:href="#m07c362f5e3" y="89.24807334623205"/>
     <use style="fill:#0000ff;opacity:0.5;stroke:#000000;stroke-width:0.5;" x="322.9990408100757" xlink:href="#m07c362f5e3" y="82.6927948360626"/>
     <use style="fill:#0000ff;opacity:0.5;stroke:#000000;stroke-width:0.5;" x="322.9990408100757" xlink:href="#m07c362f5e3" y="78.40025460336477"/>
     <use style="fill:#0000ff;opacity:0.5;stroke:#000000;stroke-width:0.5;" x="322.9990408100757" xlink:href="#m07c362f5e3" y="103.06552070034445"/>
     <use style="fill:#0000ff;opacity:0.5;stroke:#000000;stroke-width:0.5;" x="322.9990408100757" xlink:href="#m07c362f5e3" y="110.5828755384153"/>
     <use style="fill:#0000ff;opacity:0.5;stroke:#000000;stroke-width:0.5;" x="322.9990408100757" xlink:href="#m07c362f5e3" y="90.94104343031944"/>
     <use style="fill:#0000ff;opacity:0.5;stroke:#000000;stroke-width:0.5;" x="322.9990408100757" xlink:href="#m07c362f5e3" y="76.37500080600427"/>
     <use style="fill:#0000ff;opacity:0.5;stroke:#000000;stroke-width:0.5;" x="322.9990408100757" xlink:href="#m07c362f5e3" y="91.5523863493242"/>
     <use style="fill:#0000ff;opacity:0.5;stroke:#000000;stroke-width:0.5;" x="322.9990408100757" xlink:href="#m07c362f5e3" y="102.2648613146992"/>
     <use style="fill:#0000ff;opacity:0.5;stroke:#000000;stroke-width:0.5;" x="322.9990408100757" xlink:href="#m07c362f5e3" y="53.96313926514097"/>
     <use style="fill:#0000ff;opacity:0.5;stroke:#000000;stroke-width:0.5;" x="322.9990408100757" xlink:href="#m07c362f5e3" y="79.48191166822517"/>
     <use style="fill:#0000ff;opacity:0.5;stroke:#000000;stroke-width:0.5;" x="322.9990408100757" xlink:href="#m07c362f5e3" y="76.6597737573781"/>
     <use style="fill:#0000ff;opacity:0.5;stroke:#000000;stroke-width:0.5;" x="322.9990408100757" xlink:href="#m07c362f5e3" y="127.08417962940297"/>
     <use style="fill:#0000ff;opacity:0.5;stroke:#000000;stroke-width:0.5;" x="322.9990408100757" xlink:href="#m07c362f5e3" y="123.76716240873532"/>
     <use style="fill:#0000ff;opacity:0.5;stroke:#000000;stroke-width:0.5;" x="322.9990408100757" xlink:href="#m07c362f5e3" y="54.85401552436156"/>
     <use style="fill:#0000ff;opacity:0.5;stroke:#000000;stroke-width:0.5;" x="322.9990408100757" xlink:href="#m07c362f5e3" y="95.94494610093182"/>
     <use style="fill:#0000ff;opacity:0.5;stroke:#000000;stroke-width:0.5;" x="322.9990408100757" xlink:href="#m07c362f5e3" y="103.6718662514632"/>
     <use style="fill:#0000ff;opacity:0.5;stroke:#000000;stroke-width:0.5;" x="322.9990408100757" xlink:href="#m07c362f5e3" y="117.06113731808625"/>
     <use style="fill:#0000ff;opacity:0.5;stroke:#000000;stroke-width:0.5;" x="322.9990408100757" xlink:href="#m07c362f5e3" y="95.25592293200447"/>
     <use style="fill:#0000ff;opacity:0.5;stroke:#000000;stroke-width:0.5;" x="322.9990408100757" xlink:href="#m07c362f5e3" y="78.46500134109567"/>
     <use style="fill:#0000ff;opacity:0.5;stroke:#000000;stroke-width:0.5;" x="322.9990408100757" xlink:href="#m07c362f5e3" y="81.57272491132818"/>
     <use style="fill:#0000ff;opacity:0.5;stroke:#000000;stroke-width:0.5;" x="322.9990408100757" xlink:href="#m07c362f5e3" y="120.89259135767287"/>
     <use style="fill:#0000ff;opacity:0.5;stroke:#000000;stroke-width:0.5;" x="322.9990408100757" xlink:href="#m07c362f5e3" y="72.66014810189824"/>
     <use style="fill:#0000ff;opacity:0.5;stroke:#000000;stroke-width:0.5;" x="322.9990408100757" xlink:href="#m07c362f5e3" y="62.752978166984065"/>
     <use style="fill:#0000ff;opacity:0.5;stroke:#000000;stroke-width:0.5;" x="322.9990408100757" xlink:href="#m07c362f5e3" y="62.418447481772716"/>
     <use style="fill:#0000ff;opacity:0.5;stroke:#000000;stroke-width:0.5;" x="322.9990408100757" xlink:href="#m07c362f5e3" y="79.13162998074444"/>
     <use style="fill:#0000ff;opacity:0.5;stroke:#000000;stroke-width:0.5;" x="322.9990408100757" xlink:href="#m07c362f5e3" y="107.76957800968648"/>
     <use style="fill:#0000ff;opacity:0.5;stroke:#000000;stroke-width:0.5;" x="322.9990408100757" xlink:href="#m07c362f5e3" y="87.18354367084737"/>
     <use style="fill:#0000ff;opacity:0.5;stroke:#000000;stroke-width:0.5;" x="322.9990408100757" xlink:href="#m07c362f5e3" y="76.74401530015814"/>
     <use style="fill:#0000ff;opacity:0.5;stroke:#000000;stroke-width:0.5;" x="322.9990408100757" xlink:href="#m07c362f5e3" y="100.84619412149414"/>
     <use style="fill:#0000ff;opacity:0.5;stroke:#000000;stroke-width:0.5;" x="322.9990408100757" xlink:href="#m07c362f5e3" y="125.3175635239308"/>
     <use style="fill:#0000ff;opacity:0.5;stroke:#000000;stroke-width:0.5;" x="322.9990408100757" xlink:href="#m07c362f5e3" y="109.68568978226938"/>
     <use style="fill:#0000ff;opacity:0.5;stroke:#000000;stroke-width:0.5;" x="322.9990408100757" xlink:href="#m07c362f5e3" y="79.67902918849404"/>
     <use style="fill:#0000ff;opacity:0.5;stroke:#000000;stroke-width:0.5;" x="322.9990408100757" xlink:href="#m07c362f5e3" y="68.76458093705793"/>
     <use style="fill:#0000ff;opacity:0.5;stroke:#000000;stroke-width:0.5;" x="322.9990408100757" xlink:href="#m07c362f5e3" y="69.50744567708693"/>
     <use style="fill:#0000ff;opacity:0.5;stroke:#000000;stroke-width:0.5;" x="322.9990408100757" xlink:href="#m07c362f5e3" y="89.98729233398376"/>
     <use style="fill:#0000ff;opacity:0.5;stroke:#000000;stroke-width:0.5;" x="322.9990408100757" xlink:href="#m07c362f5e3" y="77.71290063368679"/>
     <use style="fill:#0000ff;opacity:0.5;stroke:#000000;stroke-width:0.5;" x="322.9990408100757" xlink:href="#m07c362f5e3" y="89.22580458343856"/>
     <use style="fill:#0000ff;opacity:0.5;stroke:#000000;stroke-width:0.5;" x="322.9990408100757" xlink:href="#m07c362f5e3" y="106.00735156859639"/>
     <use style="fill:#0000ff;opacity:0.5;stroke:#000000;stroke-width:0.5;" x="322.9990408100757" xlink:href="#m07c362f5e3" y="120.0005374301474"/>
     <use style="fill:#0000ff;opacity:0.5;stroke:#000000;stroke-width:0.5;" x="322.9990408100757" xlink:href="#m07c362f5e3" y="102.4406801189694"/>
     <use style="fill:#0000ff;opacity:0.5;stroke:#000000;stroke-width:0.5;" x="322.9990408100757" xlink:href="#m07c362f5e3" y="112.7902649411173"/>
     <use style="fill:#0000ff;opacity:0.5;stroke:#000000;stroke-width:0.5;" x="322.9990408100757" xlink:href="#m07c362f5e3" y="115.91988327084647"/>
     <use style="fill:#0000ff;opacity:0.5;stroke:#000000;stroke-width:0.5;" x="322.9990408100757" xlink:href="#m07c362f5e3" y="102.07268399152815"/>
     <use style="fill:#0000ff;opacity:0.5;stroke:#000000;stroke-width:0.5;" x="322.9990408100757" xlink:href="#m07c362f5e3" y="124.36471001747327"/>
     <use style="fill:#0000ff;opacity:0.5;stroke:#000000;stroke-width:0.5;" x="322.9990408100757" xlink:href="#m07c362f5e3" y="106.1255684605606"/>
     <use style="fill:#0000ff;opacity:0.5;stroke:#000000;stroke-width:0.5;" x="322.9990408100757" xlink:href="#m07c362f5e3" y="124.39641618964345"/>
     <use style="fill:#0000ff;opacity:0.5;stroke:#000000;stroke-width:0.5;" x="322.9990408100757" xlink:href="#m07c362f5e3" y="98.2963473929301"/>
     <use style="fill:#0000ff;opacity:0.5;stroke:#000000;stroke-width:0.5;" x="322.9990408100757" xlink:href="#m07c362f5e3" y="122.08698732615676"/>
     <use style="fill:#0000ff;opacity:0.5;stroke:#000000;stroke-width:0.5;" x="322.9990408100757" xlink:href="#m07c362f5e3" y="109.68491128414365"/>
     <use style="fill:#0000ff;opacity:0.5;stroke:#000000;stroke-width:0.5;" x="322.9990408100757" xlink:href="#m07c362f5e3" y="116.98062583062665"/>
     <use style="fill:#0000ff;opacity:0.5;stroke:#000000;stroke-width:0.5;" x="322.9990408100757" xlink:href="#m07c362f5e3" y="105.02167142692866"/>
     <use style="fill:#0000ff;opacity:0.5;stroke:#000000;stroke-width:0.5;" x="322.9990408100757" xlink:href="#m07c362f5e3" y="115.2445150399908"/>
     <use style="fill:#0000ff;opacity:0.5;stroke:#000000;stroke-width:0.5;" x="322.9990408100757" xlink:href="#m07c362f5e3" y="123.72002306594669"/>
     <use style="fill:#0000ff;opacity:0.5;stroke:#000000;stroke-width:0.5;" x="322.9990408100757" xlink:href="#m07c362f5e3" y="112.27581501736307"/>
     <use style="fill:#0000ff;opacity:0.5;stroke:#000000;stroke-width:0.5;" x="322.9990408100757" xlink:href="#m07c362f5e3" y="107.01367401360352"/>
     <use style="fill:#0000ff;opacity:0.5;stroke:#000000;stroke-width:0.5;" x="322.9990408100757" xlink:href="#m07c362f5e3" y="120.52215557470333"/>
     <use style="fill:#0000ff;opacity:0.5;stroke:#000000;stroke-width:0.5;" x="322.9990408100757" xlink:href="#m07c362f5e3" y="119.85337304652671"/>
    </g>
   </g>
   <g id="line2d_13">
    <path clip-path="url(#pca902f3119)" d="M 483.026347 318.203855 
L 483.026347 346.260809 
" style="fill:none;stroke:#ffff00;stroke-dasharray:6.000000,6.000000;stroke-dashoffset:0.0;stroke-width:2.0;"/>
   </g>
   <g id="line2d_14">
    <path clip-path="url(#pca902f3119)" d="M 483.026347 291.235796 
L 483.026347 250.831268 
" style="fill:none;stroke:#ffff00;stroke-dasharray:6.000000,6.000000;stroke-dashoffset:0.0;stroke-width:2.0;"/>
   </g>
   <g id="line2d_15">
    <path clip-path="url(#pca902f3119)" d="M 471.024299 346.260809 
L 495.028395 346.260809 
" style="fill:none;stroke:#ffff00;stroke-linecap:square;stroke-width:2.0;"/>
   </g>
   <g id="line2d_16">
    <path clip-path="url(#pca902f3119)" d="M 471.024299 250.831268 
L 495.028395 250.831268 
" style="fill:none;stroke:#ffff00;stroke-linecap:square;stroke-width:2.0;"/>
   </g>
   <g id="line2d_17">
    <path clip-path="url(#pca902f3119)" d="M 459.022251 307.0706 
L 507.030443 307.0706 
" style="fill:none;stroke:#ffff00;stroke-linecap:square;stroke-width:2.0;"/>
   </g>
   <g id="line2d_18">
    <g clip-path="url(#pca902f3119)">
     <use style="fill:#0000ff;opacity:0.5;stroke:#000000;stroke-width:0.5;" x="483.0263469366918" xlink:href="#m07c362f5e3" y="-168.39488255126844"/>
     <use style="fill:#0000ff;opacity:0.5;stroke:#000000;stroke-width:0.5;" x="483.0263469366918" xlink:href="#m07c362f5e3" y="-1.0"/>
     <use style="fill:#0000ff;opacity:0.5;stroke:#000000;stroke-width:0.5;" x="483.0263469366918" xlink:href="#m07c362f5e3" y="249.92564395441002"/>
     <use style="fill:#0000ff;opacity:0.5;stroke:#000000;stroke-width:0.5;" x="483.0263469366918" xlink:href="#m07c362f5e3" y="243.99751519974117"/>
     <use style="fill:#0000ff;opacity:0.5;stroke:#000000;stroke-width:0.5;" x="483.0263469366918" xlink:href="#m07c362f5e3" y="244.36435153726467"/>
     <use style="fill:#0000ff;opacity:0.5;stroke:#000000;stroke-width:0.5;" x="483.0263469366918" xlink:href="#m07c362f5e3" y="250.73369375403422"/>
     <use style="fill:#0000ff;opacity:0.5;stroke:#000000;stroke-width:0.5;" x="483.0263469366918" xlink:href="#m07c362f5e3" y="249.45760384616173"/>
     <use style="fill:#0000ff;opacity:0.5;stroke:#000000;stroke-width:0.5;" x="483.0263469366918" xlink:href="#m07c362f5e3" y="247.8177115745748"/>
     <use style="fill:#0000ff;opacity:0.5;stroke:#000000;stroke-width:0.5;" x="483.0263469366918" xlink:href="#m07c362f5e3" y="244.60247829520085"/>
     <use style="fill:#0000ff;opacity:0.5;stroke:#000000;stroke-width:0.5;" x="483.0263469366918" xlink:href="#m07c362f5e3" y="236.73149588611932"/>
     <use style="fill:#0000ff;opacity:0.5;stroke:#000000;stroke-width:0.5;" x="483.0263469366918" xlink:href="#m07c362f5e3" y="243.60522129324062"/>
     <use style="fill:#0000ff;opacity:0.5;stroke:#000000;stroke-width:0.5;" x="483.0263469366918" xlink:href="#m07c362f5e3" y="241.73109649056"/>
     <use style="fill:#0000ff;opacity:0.5;stroke:#000000;stroke-width:0.5;" x="483.0263469366918" xlink:href="#m07c362f5e3" y="215.5200160641861"/>
     <use style="fill:#0000ff;opacity:0.5;stroke:#000000;stroke-width:0.5;" x="483.0263469366918" xlink:href="#m07c362f5e3" y="220.90607437592692"/>
     <use style="fill:#0000ff;opacity:0.5;stroke:#000000;stroke-width:0.5;" x="483.0263469366918" xlink:href="#m07c362f5e3" y="237.88259385085766"/>
     <use style="fill:#0000ff;opacity:0.5;stroke:#000000;stroke-width:0.5;" x="483.0263469366918" xlink:href="#m07c362f5e3" y="226.41329241011223"/>
     <use style="fill:#0000ff;opacity:0.5;stroke:#000000;stroke-width:0.5;" x="483.0263469366918" xlink:href="#m07c362f5e3" y="233.33102453096487"/>
     <use style="fill:#0000ff;opacity:0.5;stroke:#000000;stroke-width:0.5;" x="483.0263469366918" xlink:href="#m07c362f5e3" y="240.8398145296853"/>
     <use style="fill:#0000ff;opacity:0.5;stroke:#000000;stroke-width:0.5;" x="483.0263469366918" xlink:href="#m07c362f5e3" y="242.94905147695866"/>
     <use style="fill:#0000ff;opacity:0.5;stroke:#000000;stroke-width:0.5;" x="483.0263469366918" xlink:href="#m07c362f5e3" y="250.50531217824394"/>
     <use style="fill:#0000ff;opacity:0.5;stroke:#000000;stroke-width:0.5;" x="483.0263469366918" xlink:href="#m07c362f5e3" y="246.3826116975333"/>
     <use style="fill:#0000ff;opacity:0.5;stroke:#000000;stroke-width:0.5;" x="483.0263469366918" xlink:href="#m07c362f5e3" y="249.4615391907141"/>
     <use style="fill:#0000ff;opacity:0.5;stroke:#000000;stroke-width:0.5;" x="483.0263469366918" xlink:href="#m07c362f5e3" y="247.16360198823995"/>
     <use style="fill:#0000ff;opacity:0.5;stroke:#000000;stroke-width:0.5;" x="483.0263469366918" xlink:href="#m07c362f5e3" y="246.85296169147261"/>
     <use style="fill:#0000ff;opacity:0.5;stroke:#000000;stroke-width:0.5;" x="483.0263469366918" xlink:href="#m07c362f5e3" y="245.6856026044675"/>
     <use style="fill:#0000ff;opacity:0.5;stroke:#000000;stroke-width:0.5;" x="483.0263469366918" xlink:href="#m07c362f5e3" y="249.91121254441074"/>
     <use style="fill:#0000ff;opacity:0.5;stroke:#000000;stroke-width:0.5;" x="483.0263469366918" xlink:href="#m07c362f5e3" y="250.73621602135555"/>
     <use style="fill:#0000ff;opacity:0.5;stroke:#000000;stroke-width:0.5;" x="483.0263469366918" xlink:href="#m07c362f5e3" y="248.02083730645725"/>
     <use style="fill:#0000ff;opacity:0.5;stroke:#000000;stroke-width:0.5;" x="483.0263469366918" xlink:href="#m07c362f5e3" y="247.45607699787183"/>
     <use style="fill:#0000ff;opacity:0.5;stroke:#000000;stroke-width:0.5;" x="483.0263469366918" xlink:href="#m07c362f5e3" y="241.06361215628806"/>
     <use style="fill:#0000ff;opacity:0.5;stroke:#000000;stroke-width:0.5;" x="483.0263469366918" xlink:href="#m07c362f5e3" y="248.62628097263914"/>
     <use style="fill:#0000ff;opacity:0.5;stroke:#000000;stroke-width:0.5;" x="483.0263469366918" xlink:href="#m07c362f5e3" y="249.66028823935673"/>
     <use style="fill:#0000ff;opacity:0.5;stroke:#000000;stroke-width:0.5;" x="483.0263469366918" xlink:href="#m07c362f5e3" y="237.88367526244005"/>
     <use style="fill:#0000ff;opacity:0.5;stroke:#000000;stroke-width:0.5;" x="483.0263469366918" xlink:href="#m07c362f5e3" y="245.68415550190528"/>
     <use style="fill:#0000ff;opacity:0.5;stroke:#000000;stroke-width:0.5;" x="483.0263469366918" xlink:href="#m07c362f5e3" y="250.23933663418163"/>
     <use style="fill:#0000ff;opacity:0.5;stroke:#000000;stroke-width:0.5;" x="483.0263469366918" xlink:href="#m07c362f5e3" y="248.11937394380558"/>
     <use style="fill:#0000ff;opacity:0.5;stroke:#000000;stroke-width:0.5;" x="483.0263469366918" xlink:href="#m07c362f5e3" y="249.9737606990864"/>
     <use style="fill:#0000ff;opacity:0.5;stroke:#000000;stroke-width:0.5;" x="483.0263469366918" xlink:href="#m07c362f5e3" y="235.94348042171308"/>
     <use style="fill:#0000ff;opacity:0.5;stroke:#000000;stroke-width:0.5;" x="483.0263469366918" xlink:href="#m07c362f5e3" y="248.33205973550793"/>
     <use style="fill:#0000ff;opacity:0.5;stroke:#000000;stroke-width:0.5;" x="483.0263469366918" xlink:href="#m07c362f5e3" y="241.4197358690111"/>
     <use style="fill:#0000ff;opacity:0.5;stroke:#000000;stroke-width:0.5;" x="483.0263469366918" xlink:href="#m07c362f5e3" y="211.0316862931024"/>
     <use style="fill:#0000ff;opacity:0.5;stroke:#000000;stroke-width:0.5;" x="483.0263469366918" xlink:href="#m07c362f5e3" y="250.5013739427921"/>
     <use style="fill:#0000ff;opacity:0.5;stroke:#000000;stroke-width:0.5;" x="483.0263469366918" xlink:href="#m07c362f5e3" y="229.69052677512053"/>
     <use style="fill:#0000ff;opacity:0.5;stroke:#000000;stroke-width:0.5;" x="483.0263469366918" xlink:href="#m07c362f5e3" y="220.53425764641355"/>
     <use style="fill:#0000ff;opacity:0.5;stroke:#000000;stroke-width:0.5;" x="483.0263469366918" xlink:href="#m07c362f5e3" y="240.86154425553215"/>
     <use style="fill:#0000ff;opacity:0.5;stroke:#000000;stroke-width:0.5;" x="483.0263469366918" xlink:href="#m07c362f5e3" y="222.31102270255434"/>
     <use style="fill:#0000ff;opacity:0.5;stroke:#000000;stroke-width:0.5;" x="483.0263469366918" xlink:href="#m07c362f5e3" y="245.04219500695356"/>
     <use style="fill:#0000ff;opacity:0.5;stroke:#000000;stroke-width:0.5;" x="483.0263469366918" xlink:href="#m07c362f5e3" y="246.5972614995245"/>
     <use style="fill:#0000ff;opacity:0.5;stroke:#000000;stroke-width:0.5;" x="483.0263469366918" xlink:href="#m07c362f5e3" y="248.1056287934334"/>
     <use style="fill:#0000ff;opacity:0.5;stroke:#000000;stroke-width:0.5;" x="483.0263469366918" xlink:href="#m07c362f5e3" y="240.08205458610468"/>
     <use style="fill:#0000ff;opacity:0.5;stroke:#000000;stroke-width:0.5;" x="483.0263469366918" xlink:href="#m07c362f5e3" y="245.80476029621457"/>
     <use style="fill:#0000ff;opacity:0.5;stroke:#000000;stroke-width:0.5;" x="483.0263469366918" xlink:href="#m07c362f5e3" y="250.34096058069102"/>
     <use style="fill:#0000ff;opacity:0.5;stroke:#000000;stroke-width:0.5;" x="483.0263469366918" xlink:href="#m07c362f5e3" y="246.1850995256964"/>
     <use style="fill:#0000ff;opacity:0.5;stroke:#000000;stroke-width:0.5;" x="483.0263469366918" xlink:href="#m07c362f5e3" y="230.7227666177985"/>
     <use style="fill:#0000ff;opacity:0.5;stroke:#000000;stroke-width:0.5;" x="483.0263469366918" xlink:href="#m07c362f5e3" y="233.17863907034848"/>
     <use style="fill:#0000ff;opacity:0.5;stroke:#000000;stroke-width:0.5;" x="483.0263469366918" xlink:href="#m07c362f5e3" y="238.63677353260326"/>
     <use style="fill:#0000ff;opacity:0.5;stroke:#000000;stroke-width:0.5;" x="483.0263469366918" xlink:href="#m07c362f5e3" y="234.73630882249927"/>
     <use style="fill:#0000ff;opacity:0.5;stroke:#000000;stroke-width:0.5;" x="483.0263469366918" xlink:href="#m07c362f5e3" y="232.9212201739751"/>
     <use style="fill:#0000ff;opacity:0.5;stroke:#000000;stroke-width:0.5;" x="483.0263469366918" xlink:href="#m07c362f5e3" y="250.69018174000894"/>
     <use style="fill:#0000ff;opacity:0.5;stroke:#000000;stroke-width:0.5;" x="483.0263469366918" xlink:href="#m07c362f5e3" y="244.03607477207333"/>
     <use style="fill:#0000ff;opacity:0.5;stroke:#000000;stroke-width:0.5;" x="483.0263469366918" xlink:href="#m07c362f5e3" y="237.02849856355684"/>
     <use style="fill:#0000ff;opacity:0.5;stroke:#000000;stroke-width:0.5;" x="483.0263469366918" xlink:href="#m07c362f5e3" y="228.31884918032637"/>
     <use style="fill:#0000ff;opacity:0.5;stroke:#000000;stroke-width:0.5;" x="483.0263469366918" xlink:href="#m07c362f5e3" y="236.735879734134"/>
     <use style="fill:#0000ff;opacity:0.5;stroke:#000000;stroke-width:0.5;" x="483.0263469366918" xlink:href="#m07c362f5e3" y="247.24654977872729"/>
     <use style="fill:#0000ff;opacity:0.5;stroke:#000000;stroke-width:0.5;" x="483.0263469366918" xlink:href="#m07c362f5e3" y="241.29381047043577"/>
     <use style="fill:#0000ff;opacity:0.5;stroke:#000000;stroke-width:0.5;" x="483.0263469366918" xlink:href="#m07c362f5e3" y="226.86479619508603"/>
     <use style="fill:#0000ff;opacity:0.5;stroke:#000000;stroke-width:0.5;" x="483.0263469366918" xlink:href="#m07c362f5e3" y="241.15534750667584"/>
     <use style="fill:#0000ff;opacity:0.5;stroke:#000000;stroke-width:0.5;" x="483.0263469366918" xlink:href="#m07c362f5e3" y="233.21965166318395"/>
     <use style="fill:#0000ff;opacity:0.5;stroke:#000000;stroke-width:0.5;" x="483.0263469366918" xlink:href="#m07c362f5e3" y="241.5659906206495"/>
     <use style="fill:#0000ff;opacity:0.5;stroke:#000000;stroke-width:0.5;" x="483.0263469366918" xlink:href="#m07c362f5e3" y="250.18305953074182"/>
     <use style="fill:#0000ff;opacity:0.5;stroke:#000000;stroke-width:0.5;" x="483.0263469366918" xlink:href="#m07c362f5e3" y="220.56907851935404"/>
     <use style="fill:#0000ff;opacity:0.5;stroke:#000000;stroke-width:0.5;" x="483.0263469366918" xlink:href="#m07c362f5e3" y="247.21420700690152"/>
     <use style="fill:#0000ff;opacity:0.5;stroke:#000000;stroke-width:0.5;" x="483.0263469366918" xlink:href="#m07c362f5e3" y="236.86849891052486"/>
     <use style="fill:#0000ff;opacity:0.5;stroke:#000000;stroke-width:0.5;" x="483.0263469366918" xlink:href="#m07c362f5e3" y="244.40223583486357"/>
     <use style="fill:#0000ff;opacity:0.5;stroke:#000000;stroke-width:0.5;" x="483.0263469366918" xlink:href="#m07c362f5e3" y="240.11729749436273"/>
     <use style="fill:#0000ff;opacity:0.5;stroke:#000000;stroke-width:0.5;" x="483.0263469366918" xlink:href="#m07c362f5e3" y="232.29406720536974"/>
     <use style="fill:#0000ff;opacity:0.5;stroke:#000000;stroke-width:0.5;" x="483.0263469366918" xlink:href="#m07c362f5e3" y="176.02435651234492"/>
     <use style="fill:#0000ff;opacity:0.5;stroke:#000000;stroke-width:0.5;" x="483.0263469366918" xlink:href="#m07c362f5e3" y="243.3538249573973"/>
     <use style="fill:#0000ff;opacity:0.5;stroke:#000000;stroke-width:0.5;" x="483.0263469366918" xlink:href="#m07c362f5e3" y="247.2934343247931"/>
     <use style="fill:#0000ff;opacity:0.5;stroke:#000000;stroke-width:0.5;" x="483.0263469366918" xlink:href="#m07c362f5e3" y="239.92825280979415"/>
     <use style="fill:#0000ff;opacity:0.5;stroke:#000000;stroke-width:0.5;" x="483.0263469366918" xlink:href="#m07c362f5e3" y="235.1072018714061"/>
     <use style="fill:#0000ff;opacity:0.5;stroke:#000000;stroke-width:0.5;" x="483.0263469366918" xlink:href="#m07c362f5e3" y="245.37114845659"/>
     <use style="fill:#0000ff;opacity:0.5;stroke:#000000;stroke-width:0.5;" x="483.0263469366918" xlink:href="#m07c362f5e3" y="247.51463537230075"/>
     <use style="fill:#0000ff;opacity:0.5;stroke:#000000;stroke-width:0.5;" x="483.0263469366918" xlink:href="#m07c362f5e3" y="242.13622178451243"/>
     <use style="fill:#0000ff;opacity:0.5;stroke:#000000;stroke-width:0.5;" x="483.0263469366918" xlink:href="#m07c362f5e3" y="248.64571603261172"/>
     <use style="fill:#0000ff;opacity:0.5;stroke:#000000;stroke-width:0.5;" x="483.0263469366918" xlink:href="#m07c362f5e3" y="247.82543357427096"/>
     <use style="fill:#0000ff;opacity:0.5;stroke:#000000;stroke-width:0.5;" x="483.0263469366918" xlink:href="#m07c362f5e3" y="249.42662773832004"/>
     <use style="fill:#0000ff;opacity:0.5;stroke:#000000;stroke-width:0.5;" x="483.0263469366918" xlink:href="#m07c362f5e3" y="248.41312899011095"/>
     <use style="fill:#0000ff;opacity:0.5;stroke:#000000;stroke-width:0.5;" x="483.0263469366918" xlink:href="#m07c362f5e3" y="248.0411375952343"/>
     <use style="fill:#0000ff;opacity:0.5;stroke:#000000;stroke-width:0.5;" x="483.0263469366918" xlink:href="#m07c362f5e3" y="243.8250803292116"/>
     <use style="fill:#0000ff;opacity:0.5;stroke:#000000;stroke-width:0.5;" x="483.0263469366918" xlink:href="#m07c362f5e3" y="247.48980221632473"/>
     <use style="fill:#0000ff;opacity:0.5;stroke:#000000;stroke-width:0.5;" x="483.0263469366918" xlink:href="#m07c362f5e3" y="248.03360896965253"/>
     <use style="fill:#0000ff;opacity:0.5;stroke:#000000;stroke-width:0.5;" x="483.0263469366918" xlink:href="#m07c362f5e3" y="241.32918279200945"/>
     <use style="fill:#0000ff;opacity:0.5;stroke:#000000;stroke-width:0.5;" x="483.0263469366918" xlink:href="#m07c362f5e3" y="249.73691478148015"/>
     <use style="fill:#0000ff;opacity:0.5;stroke:#000000;stroke-width:0.5;" x="483.0263469366918" xlink:href="#m07c362f5e3" y="247.3715617845853"/>
     <use style="fill:#0000ff;opacity:0.5;stroke:#000000;stroke-width:0.5;" x="483.0263469366918" xlink:href="#m07c362f5e3" y="249.15429478931912"/>
     <use style="fill:#0000ff;opacity:0.5;stroke:#000000;stroke-width:0.5;" x="483.0263469366918" xlink:href="#m07c362f5e3" y="239.1694174779315"/>
     <use style="fill:#0000ff;opacity:0.5;stroke:#000000;stroke-width:0.5;" x="483.0263469366918" xlink:href="#m07c362f5e3" y="231.54518305976623"/>
     <use style="fill:#0000ff;opacity:0.5;stroke:#000000;stroke-width:0.5;" x="483.0263469366918" xlink:href="#m07c362f5e3" y="-1.0"/>
     <use style="fill:#0000ff;opacity:0.5;stroke:#000000;stroke-width:0.5;" x="483.0263469366918" xlink:href="#m07c362f5e3" y="-1.0"/>
     <use style="fill:#0000ff;opacity:0.5;stroke:#000000;stroke-width:0.5;" x="483.0263469366918" xlink:href="#m07c362f5e3" y="249.60218884293374"/>
     <use style="fill:#0000ff;opacity:0.5;stroke:#000000;stroke-width:0.5;" x="483.0263469366918" xlink:href="#m07c362f5e3" y="244.2251336335229"/>
     <use style="fill:#0000ff;opacity:0.5;stroke:#000000;stroke-width:0.5;" x="483.0263469366918" xlink:href="#m07c362f5e3" y="249.1994098780346"/>
     <use style="fill:#0000ff;opacity:0.5;stroke:#000000;stroke-width:0.5;" x="483.0263469366918" xlink:href="#m07c362f5e3" y="248.61789388997994"/>
     <use style="fill:#0000ff;opacity:0.5;stroke:#000000;stroke-width:0.5;" x="483.0263469366918" xlink:href="#m07c362f5e3" y="248.33270647201635"/>
     <use style="fill:#0000ff;opacity:0.5;stroke:#000000;stroke-width:0.5;" x="483.0263469366918" xlink:href="#m07c362f5e3" y="232.82666301446963"/>
     <use style="fill:#0000ff;opacity:0.5;stroke:#000000;stroke-width:0.5;" x="483.0263469366918" xlink:href="#m07c362f5e3" y="243.50341415704096"/>
     <use style="fill:#0000ff;opacity:0.5;stroke:#000000;stroke-width:0.5;" x="483.0263469366918" xlink:href="#m07c362f5e3" y="248.98837620491886"/>
     <use style="fill:#0000ff;opacity:0.5;stroke:#000000;stroke-width:0.5;" x="483.0263469366918" xlink:href="#m07c362f5e3" y="242.59098411092532"/>
     <use style="fill:#0000ff;opacity:0.5;stroke:#000000;stroke-width:0.5;" x="483.0263469366918" xlink:href="#m07c362f5e3" y="250.74454621691496"/>
     <use style="fill:#0000ff;opacity:0.5;stroke:#000000;stroke-width:0.5;" x="483.0263469366918" xlink:href="#m07c362f5e3" y="230.03190069789036"/>
     <use style="fill:#0000ff;opacity:0.5;stroke:#000000;stroke-width:0.5;" x="483.0263469366918" xlink:href="#m07c362f5e3" y="241.77114481915197"/>
     <use style="fill:#0000ff;opacity:0.5;stroke:#000000;stroke-width:0.5;" x="483.0263469366918" xlink:href="#m07c362f5e3" y="228.79423964117944"/>
     <use style="fill:#0000ff;opacity:0.5;stroke:#000000;stroke-width:0.5;" x="483.0263469366918" xlink:href="#m07c362f5e3" y="229.26847262898622"/>
     <use style="fill:#0000ff;opacity:0.5;stroke:#000000;stroke-width:0.5;" x="483.0263469366918" xlink:href="#m07c362f5e3" y="212.33982834375766"/>
     <use style="fill:#0000ff;opacity:0.5;stroke:#000000;stroke-width:0.5;" x="483.0263469366918" xlink:href="#m07c362f5e3" y="237.79572025199738"/>
     <use style="fill:#0000ff;opacity:0.5;stroke:#000000;stroke-width:0.5;" x="483.0263469366918" xlink:href="#m07c362f5e3" y="237.2140435758114"/>
     <use style="fill:#0000ff;opacity:0.5;stroke:#000000;stroke-width:0.5;" x="483.0263469366918" xlink:href="#m07c362f5e3" y="247.24671358651983"/>
     <use style="fill:#0000ff;opacity:0.5;stroke:#000000;stroke-width:0.5;" x="483.0263469366918" xlink:href="#m07c362f5e3" y="-1.0"/>
     <use style="fill:#0000ff;opacity:0.5;stroke:#000000;stroke-width:0.5;" x="483.0263469366918" xlink:href="#m07c362f5e3" y="-1.0"/>
     <use style="fill:#0000ff;opacity:0.5;stroke:#000000;stroke-width:0.5;" x="483.0263469366918" xlink:href="#m07c362f5e3" y="246.06119064270266"/>
     <use style="fill:#0000ff;opacity:0.5;stroke:#000000;stroke-width:0.5;" x="483.0263469366918" xlink:href="#m07c362f5e3" y="245.3837023842066"/>
     <use style="fill:#0000ff;opacity:0.5;stroke:#000000;stroke-width:0.5;" x="483.0263469366918" xlink:href="#m07c362f5e3" y="244.27506010035881"/>
     <use style="fill:#0000ff;opacity:0.5;stroke:#000000;stroke-width:0.5;" x="483.0263469366918" xlink:href="#m07c362f5e3" y="238.14980473894363"/>
     <use style="fill:#0000ff;opacity:0.5;stroke:#000000;stroke-width:0.5;" x="483.0263469366918" xlink:href="#m07c362f5e3" y="241.05909272271185"/>
     <use style="fill:#0000ff;opacity:0.5;stroke:#000000;stroke-width:0.5;" x="483.0263469366918" xlink:href="#m07c362f5e3" y="248.99581329725913"/>
     <use style="fill:#0000ff;opacity:0.5;stroke:#000000;stroke-width:0.5;" x="483.0263469366918" xlink:href="#m07c362f5e3" y="242.32240177618996"/>
    </g>
   </g>
   <g id="patch_6">
    <path d="M 83.4975 18.81 
L 563.04 18.81 
" style="fill:none;stroke:#000000;stroke-linecap:square;stroke-linejoin:miter;"/>
   </g>
   <g id="patch_7">
    <path d="M 563.04 403.34 
L 563.04 18.81 
" style="fill:none;stroke:#000000;stroke-linecap:square;stroke-linejoin:miter;"/>
   </g>
   <g id="patch_8">
    <path d="M 83.4975 403.34 
L 563.04 403.34 
" style="fill:none;stroke:#000000;stroke-linecap:square;stroke-linejoin:miter;"/>
   </g>
   <g id="patch_9">
    <path d="M 83.4975 403.34 
L 83.4975 18.81 
" style="fill:none;stroke:#000000;stroke-linecap:square;stroke-linejoin:miter;"/>
   </g>
   <g id="matplotlib.axis_1">
    <g id="xtick_1">
     <g id="line2d_19">
      <defs>
       <path d="M 0 0 
L 0 -4 
" id="m5ebdacf99d" style="stroke:#000000;stroke-width:0.5;"/>
      </defs>
      <g>
       <use style="stroke:#000000;stroke-width:0.5;" x="162.97173468345957" xlink:href="#m5ebdacf99d" y="403.34000000000003"/>
      </g>
     </g>
     <g id="line2d_20">
      <defs>
       <path d="M 0 0 
L 0 4 
" id="me978f46471" style="stroke:#000000;stroke-width:0.5;"/>
      </defs>
      <g>
       <use style="stroke:#000000;stroke-width:0.5;" x="162.97173468345957" xlink:href="#me978f46471" y="18.810000000000002"/>
      </g>
     </g>
     <g id="text_1">
      <!-- LDB -->
      <defs>
       <path d="M 19.671875 64.796875 
L 19.671875 8.109375 
L 31.59375 8.109375 
Q 46.6875 8.109375 53.6875 14.9375 
Q 60.6875 21.78125 60.6875 36.53125 
Q 60.6875 51.171875 53.6875 57.984375 
Q 46.6875 64.796875 31.59375 64.796875 
z
M 9.8125 72.90625 
L 30.078125 72.90625 
Q 51.265625 72.90625 61.171875 64.09375 
Q 71.09375 55.28125 71.09375 36.53125 
Q 71.09375 17.671875 61.125 8.828125 
Q 51.171875 0 30.078125 0 
L 9.8125 0 
z
" id="BitstreamVeraSans-Roman-44"/>
       <path d="M 9.8125 72.90625 
L 19.671875 72.90625 
L 19.671875 8.296875 
L 55.171875 8.296875 
L 55.171875 0 
L 9.8125 0 
z
" id="BitstreamVeraSans-Roman-4c"/>
       <path d="M 19.671875 34.8125 
L 19.671875 8.109375 
L 35.5 8.109375 
Q 43.453125 8.109375 47.28125 11.40625 
Q 51.125 14.703125 51.125 21.484375 
Q 51.125 28.328125 47.28125 31.5625 
Q 43.453125 34.8125 35.5 34.8125 
z
M 19.671875 64.796875 
L 19.671875 42.828125 
L 34.28125 42.828125 
Q 41.5 42.828125 45.03125 45.53125 
Q 48.578125 48.25 48.578125 53.8125 
Q 48.578125 59.328125 45.03125 62.0625 
Q 41.5 64.796875 34.28125 64.796875 
z
M 9.8125 72.90625 
L 35.015625 72.90625 
Q 46.296875 72.90625 52.390625 68.21875 
Q 58.5 63.53125 58.5 54.890625 
Q 58.5 48.1875 55.375 44.234375 
Q 52.25 40.28125 46.1875 39.3125 
Q 53.46875 37.75 57.5 32.78125 
Q 61.53125 27.828125 61.53125 20.40625 
Q 61.53125 10.640625 54.890625 5.3125 
Q 48.25 0 35.984375 0 
L 9.8125 0 
z
" id="BitstreamVeraSans-Roman-42"/>
      </defs>
      <g transform="translate(150.89204718345957 416.458125)scale(0.12 -0.12)">
       <use xlink:href="#BitstreamVeraSans-Roman-4c"/>
       <use x="55.712890625" xlink:href="#BitstreamVeraSans-Roman-44"/>
       <use x="132.71484375" xlink:href="#BitstreamVeraSans-Roman-42"/>
      </g>
     </g>
    </g>
    <g id="xtick_2">
     <g id="line2d_21">
      <g>
       <use style="stroke:#000000;stroke-width:0.5;" x="322.9990408100757" xlink:href="#m5ebdacf99d" y="403.34000000000003"/>
      </g>
     </g>
     <g id="line2d_22">
      <g>
       <use style="stroke:#000000;stroke-width:0.5;" x="322.9990408100757" xlink:href="#me978f46471" y="18.810000000000002"/>
      </g>
     </g>
     <g id="text_2">
      <!-- BRISK -->
      <defs>
       <path d="M 44.390625 34.1875 
Q 47.5625 33.109375 50.5625 29.59375 
Q 53.5625 26.078125 56.59375 19.921875 
L 66.609375 0 
L 56 0 
L 46.6875 18.703125 
Q 43.0625 26.03125 39.671875 28.421875 
Q 36.28125 30.8125 30.421875 30.8125 
L 19.671875 30.8125 
L 19.671875 0 
L 9.8125 0 
L 9.8125 72.90625 
L 32.078125 72.90625 
Q 44.578125 72.90625 50.734375 67.671875 
Q 56.890625 62.453125 56.890625 51.90625 
Q 56.890625 45.015625 53.6875 40.46875 
Q 50.484375 35.9375 44.390625 34.1875 
M 19.671875 64.796875 
L 19.671875 38.921875 
L 32.078125 38.921875 
Q 39.203125 38.921875 42.84375 42.21875 
Q 46.484375 45.515625 46.484375 51.90625 
Q 46.484375 58.296875 42.84375 61.546875 
Q 39.203125 64.796875 32.078125 64.796875 
z
" id="BitstreamVeraSans-Roman-52"/>
       <path d="M 53.515625 70.515625 
L 53.515625 60.890625 
Q 47.90625 63.578125 42.921875 64.890625 
Q 37.9375 66.21875 33.296875 66.21875 
Q 25.25 66.21875 20.875 63.09375 
Q 16.5 59.96875 16.5 54.203125 
Q 16.5 49.359375 19.40625 46.890625 
Q 22.3125 44.4375 30.421875 42.921875 
L 36.375 41.703125 
Q 47.40625 39.59375 52.65625 34.296875 
Q 57.90625 29 57.90625 20.125 
Q 57.90625 9.515625 50.796875 4.046875 
Q 43.703125 -1.421875 29.984375 -1.421875 
Q 24.8125 -1.421875 18.96875 -0.25 
Q 13.140625 0.921875 6.890625 3.21875 
L 6.890625 13.375 
Q 12.890625 10.015625 18.65625 8.296875 
Q 24.421875 6.59375 29.984375 6.59375 
Q 38.421875 6.59375 43.015625 9.90625 
Q 47.609375 13.234375 47.609375 19.390625 
Q 47.609375 24.75 44.3125 27.78125 
Q 41.015625 30.8125 33.5 32.328125 
L 27.484375 33.5 
Q 16.453125 35.6875 11.515625 40.375 
Q 6.59375 45.0625 6.59375 53.421875 
Q 6.59375 63.09375 13.40625 68.65625 
Q 20.21875 74.21875 32.171875 74.21875 
Q 37.3125 74.21875 42.625 73.28125 
Q 47.953125 72.359375 53.515625 70.515625 
" id="BitstreamVeraSans-Roman-53"/>
       <path d="M 9.8125 72.90625 
L 19.671875 72.90625 
L 19.671875 42.09375 
L 52.390625 72.90625 
L 65.09375 72.90625 
L 28.90625 38.921875 
L 67.671875 0 
L 54.6875 0 
L 19.671875 35.109375 
L 19.671875 0 
L 9.8125 0 
z
" id="BitstreamVeraSans-Roman-4b"/>
       <path d="M 9.8125 72.90625 
L 19.671875 72.90625 
L 19.671875 0 
L 9.8125 0 
z
" id="BitstreamVeraSans-Roman-49"/>
      </defs>
      <g transform="translate(305.1996658100757 416.458125)scale(0.12 -0.12)">
       <use xlink:href="#BitstreamVeraSans-Roman-42"/>
       <use x="68.603515625" xlink:href="#BitstreamVeraSans-Roman-52"/>
       <use x="138.0859375" xlink:href="#BitstreamVeraSans-Roman-49"/>
       <use x="167.578125" xlink:href="#BitstreamVeraSans-Roman-53"/>
       <use x="231.0546875" xlink:href="#BitstreamVeraSans-Roman-4b"/>
      </g>
     </g>
    </g>
    <g id="xtick_3">
     <g id="line2d_23">
      <g>
       <use style="stroke:#000000;stroke-width:0.5;" x="483.0263469366918" xlink:href="#m5ebdacf99d" y="403.34000000000003"/>
      </g>
     </g>
     <g id="line2d_24">
      <g>
       <use style="stroke:#000000;stroke-width:0.5;" x="483.0263469366918" xlink:href="#me978f46471" y="18.810000000000002"/>
      </g>
     </g>
     <g id="text_3">
      <!-- BRIEF -->
      <defs>
       <path d="M 9.8125 72.90625 
L 51.703125 72.90625 
L 51.703125 64.59375 
L 19.671875 64.59375 
L 19.671875 43.109375 
L 48.578125 43.109375 
L 48.578125 34.8125 
L 19.671875 34.8125 
L 19.671875 0 
L 9.8125 0 
z
" id="BitstreamVeraSans-Roman-46"/>
       <path d="M 9.8125 72.90625 
L 55.90625 72.90625 
L 55.90625 64.59375 
L 19.671875 64.59375 
L 19.671875 43.015625 
L 54.390625 43.015625 
L 54.390625 34.71875 
L 19.671875 34.71875 
L 19.671875 8.296875 
L 56.78125 8.296875 
L 56.78125 0 
L 9.8125 0 
z
" id="BitstreamVeraSans-Roman-45"/>
      </defs>
      <g transform="translate(465.7285344366918 416.458125)scale(0.12 -0.12)">
       <use xlink:href="#BitstreamVeraSans-Roman-42"/>
       <use x="68.603515625" xlink:href="#BitstreamVeraSans-Roman-52"/>
       <use x="138.0859375" xlink:href="#BitstreamVeraSans-Roman-49"/>
       <use x="167.578125" xlink:href="#BitstreamVeraSans-Roman-45"/>
       <use x="230.76171875" xlink:href="#BitstreamVeraSans-Roman-46"/>
      </g>
     </g>
    </g>
   </g>
   <g id="matplotlib.axis_2">
    <g id="ytick_1">
     <g id="line2d_25">
      <defs>
       <path d="M 0 0 
L 4 0 
" id="m7c8db47a52" style="stroke:#000000;stroke-width:0.5;"/>
      </defs>
      <g>
       <use style="stroke:#000000;stroke-width:0.5;" x="83.4975" xlink:href="#m7c8db47a52" y="403.34000000000003"/>
      </g>
     </g>
     <g id="line2d_26">
      <defs>
       <path d="M 0 0 
L -4 0 
" id="ma8f38dc8f2" style="stroke:#000000;stroke-width:0.5;"/>
      </defs>
      <g>
       <use style="stroke:#000000;stroke-width:0.5;" x="563.04" xlink:href="#ma8f38dc8f2" y="403.34000000000003"/>
      </g>
     </g>
     <g id="text_4">
      <!-- 0.00000 -->
      <defs>
       <path d="M 31.78125 66.40625 
Q 24.171875 66.40625 20.328125 58.90625 
Q 16.5 51.421875 16.5 36.375 
Q 16.5 21.390625 20.328125 13.890625 
Q 24.171875 6.390625 31.78125 6.390625 
Q 39.453125 6.390625 43.28125 13.890625 
Q 47.125 21.390625 47.125 36.375 
Q 47.125 51.421875 43.28125 58.90625 
Q 39.453125 66.40625 31.78125 66.40625 
M 31.78125 74.21875 
Q 44.046875 74.21875 50.515625 64.515625 
Q 56.984375 54.828125 56.984375 36.375 
Q 56.984375 17.96875 50.515625 8.265625 
Q 44.046875 -1.421875 31.78125 -1.421875 
Q 19.53125 -1.421875 13.0625 8.265625 
Q 6.59375 17.96875 6.59375 36.375 
Q 6.59375 54.828125 13.0625 64.515625 
Q 19.53125 74.21875 31.78125 74.21875 
" id="BitstreamVeraSans-Roman-30"/>
       <path d="M 10.6875 12.40625 
L 21 12.40625 
L 21 0 
L 10.6875 0 
z
" id="BitstreamVeraSans-Roman-2e"/>
      </defs>
      <g transform="translate(29.87375 406.65125)scale(0.12 -0.12)">
       <use xlink:href="#BitstreamVeraSans-Roman-30"/>
       <use x="63.623046875" xlink:href="#BitstreamVeraSans-Roman-2e"/>
       <use x="95.41015625" xlink:href="#BitstreamVeraSans-Roman-30"/>
       <use x="159.033203125" xlink:href="#BitstreamVeraSans-Roman-30"/>
       <use x="222.65625" xlink:href="#BitstreamVeraSans-Roman-30"/>
       <use x="286.279296875" xlink:href="#BitstreamVeraSans-Roman-30"/>
       <use x="349.90234375" xlink:href="#BitstreamVeraSans-Roman-30"/>
      </g>
     </g>
    </g>
    <g id="ytick_2">
     <g id="line2d_27">
      <g>
       <use style="stroke:#000000;stroke-width:0.5;" x="83.4975" xlink:href="#m7c8db47a52" y="326.5160661785015"/>
      </g>
     </g>
     <g id="line2d_28">
      <g>
       <use style="stroke:#000000;stroke-width:0.5;" x="563.04" xlink:href="#ma8f38dc8f2" y="326.5160661785015"/>
      </g>
     </g>
     <g id="text_5">
      <!-- 0.00001 -->
      <defs>
       <path d="M 12.40625 8.296875 
L 28.515625 8.296875 
L 28.515625 63.921875 
L 10.984375 60.40625 
L 10.984375 69.390625 
L 28.421875 72.90625 
L 38.28125 72.90625 
L 38.28125 8.296875 
L 54.390625 8.296875 
L 54.390625 0 
L 12.40625 0 
z
" id="BitstreamVeraSans-Roman-31"/>
      </defs>
      <g transform="translate(29.87375 329.82731617850146)scale(0.12 -0.12)">
       <use xlink:href="#BitstreamVeraSans-Roman-30"/>
       <use x="63.623046875" xlink:href="#BitstreamVeraSans-Roman-2e"/>
       <use x="95.41015625" xlink:href="#BitstreamVeraSans-Roman-30"/>
       <use x="159.033203125" xlink:href="#BitstreamVeraSans-Roman-30"/>
       <use x="222.65625" xlink:href="#BitstreamVeraSans-Roman-30"/>
       <use x="286.279296875" xlink:href="#BitstreamVeraSans-Roman-30"/>
       <use x="349.90234375" xlink:href="#BitstreamVeraSans-Roman-31"/>
      </g>
     </g>
    </g>
    <g id="ytick_3">
     <g id="line2d_29">
      <g>
       <use style="stroke:#000000;stroke-width:0.5;" x="83.4975" xlink:href="#m7c8db47a52" y="249.69213235700295"/>
      </g>
     </g>
     <g id="line2d_30">
      <g>
       <use style="stroke:#000000;stroke-width:0.5;" x="563.04" xlink:href="#ma8f38dc8f2" y="249.69213235700295"/>
      </g>
     </g>
     <g id="text_6">
      <!-- 0.00002 -->
      <defs>
       <path d="M 19.1875 8.296875 
L 53.609375 8.296875 
L 53.609375 0 
L 7.328125 0 
L 7.328125 8.296875 
Q 12.9375 14.109375 22.625 23.890625 
Q 32.328125 33.6875 34.8125 36.53125 
Q 39.546875 41.84375 41.421875 45.53125 
Q 43.3125 49.21875 43.3125 52.78125 
Q 43.3125 58.59375 39.234375 62.25 
Q 35.15625 65.921875 28.609375 65.921875 
Q 23.96875 65.921875 18.8125 64.3125 
Q 13.671875 62.703125 7.8125 59.421875 
L 7.8125 69.390625 
Q 13.765625 71.78125 18.9375 73 
Q 24.125 74.21875 28.421875 74.21875 
Q 39.75 74.21875 46.484375 68.546875 
Q 53.21875 62.890625 53.21875 53.421875 
Q 53.21875 48.921875 51.53125 44.890625 
Q 49.859375 40.875 45.40625 35.40625 
Q 44.1875 33.984375 37.640625 27.21875 
Q 31.109375 20.453125 19.1875 8.296875 
" id="BitstreamVeraSans-Roman-32"/>
      </defs>
      <g transform="translate(29.87375 253.00338235700292)scale(0.12 -0.12)">
       <use xlink:href="#BitstreamVeraSans-Roman-30"/>
       <use x="63.623046875" xlink:href="#BitstreamVeraSans-Roman-2e"/>
       <use x="95.41015625" xlink:href="#BitstreamVeraSans-Roman-30"/>
       <use x="159.033203125" xlink:href="#BitstreamVeraSans-Roman-30"/>
       <use x="222.65625" xlink:href="#BitstreamVeraSans-Roman-30"/>
       <use x="286.279296875" xlink:href="#BitstreamVeraSans-Roman-30"/>
       <use x="349.90234375" xlink:href="#BitstreamVeraSans-Roman-32"/>
      </g>
     </g>
    </g>
    <g id="ytick_4">
     <g id="line2d_31">
      <g>
       <use style="stroke:#000000;stroke-width:0.5;" x="83.4975" xlink:href="#m7c8db47a52" y="172.8681985355044"/>
      </g>
     </g>
     <g id="line2d_32">
      <g>
       <use style="stroke:#000000;stroke-width:0.5;" x="563.04" xlink:href="#ma8f38dc8f2" y="172.8681985355044"/>
      </g>
     </g>
     <g id="text_7">
      <!-- 0.00003 -->
      <defs>
       <path d="M 40.578125 39.3125 
Q 47.65625 37.796875 51.625 33 
Q 55.609375 28.21875 55.609375 21.1875 
Q 55.609375 10.40625 48.1875 4.484375 
Q 40.765625 -1.421875 27.09375 -1.421875 
Q 22.515625 -1.421875 17.65625 -0.515625 
Q 12.796875 0.390625 7.625 2.203125 
L 7.625 11.71875 
Q 11.71875 9.328125 16.59375 8.109375 
Q 21.484375 6.890625 26.8125 6.890625 
Q 36.078125 6.890625 40.9375 10.546875 
Q 45.796875 14.203125 45.796875 21.1875 
Q 45.796875 27.640625 41.28125 31.265625 
Q 36.765625 34.90625 28.71875 34.90625 
L 20.21875 34.90625 
L 20.21875 43.015625 
L 29.109375 43.015625 
Q 36.375 43.015625 40.234375 45.921875 
Q 44.09375 48.828125 44.09375 54.296875 
Q 44.09375 59.90625 40.109375 62.90625 
Q 36.140625 65.921875 28.71875 65.921875 
Q 24.65625 65.921875 20.015625 65.03125 
Q 15.375 64.15625 9.8125 62.3125 
L 9.8125 71.09375 
Q 15.4375 72.65625 20.34375 73.4375 
Q 25.25 74.21875 29.59375 74.21875 
Q 40.828125 74.21875 47.359375 69.109375 
Q 53.90625 64.015625 53.90625 55.328125 
Q 53.90625 49.265625 50.4375 45.09375 
Q 46.96875 40.921875 40.578125 39.3125 
" id="BitstreamVeraSans-Roman-33"/>
      </defs>
      <g transform="translate(29.87375 176.1794485355044)scale(0.12 -0.12)">
       <use xlink:href="#BitstreamVeraSans-Roman-30"/>
       <use x="63.623046875" xlink:href="#BitstreamVeraSans-Roman-2e"/>
       <use x="95.41015625" xlink:href="#BitstreamVeraSans-Roman-30"/>
       <use x="159.033203125" xlink:href="#BitstreamVeraSans-Roman-30"/>
       <use x="222.65625" xlink:href="#BitstreamVeraSans-Roman-30"/>
       <use x="286.279296875" xlink:href="#BitstreamVeraSans-Roman-30"/>
       <use x="349.90234375" xlink:href="#BitstreamVeraSans-Roman-33"/>
      </g>
     </g>
    </g>
    <g id="ytick_5">
     <g id="line2d_33">
      <g>
       <use style="stroke:#000000;stroke-width:0.5;" x="83.4975" xlink:href="#m7c8db47a52" y="96.04426471400586"/>
      </g>
     </g>
     <g id="line2d_34">
      <g>
       <use style="stroke:#000000;stroke-width:0.5;" x="563.04" xlink:href="#ma8f38dc8f2" y="96.04426471400586"/>
      </g>
     </g>
     <g id="text_8">
      <!-- 0.00004 -->
      <defs>
       <path d="M 37.796875 64.3125 
L 12.890625 25.390625 
L 37.796875 25.390625 
z
M 35.203125 72.90625 
L 47.609375 72.90625 
L 47.609375 25.390625 
L 58.015625 25.390625 
L 58.015625 17.1875 
L 47.609375 17.1875 
L 47.609375 0 
L 37.796875 0 
L 37.796875 17.1875 
L 4.890625 17.1875 
L 4.890625 26.703125 
z
" id="BitstreamVeraSans-Roman-34"/>
      </defs>
      <g transform="translate(29.87375 99.35551471400584)scale(0.12 -0.12)">
       <use xlink:href="#BitstreamVeraSans-Roman-30"/>
       <use x="63.623046875" xlink:href="#BitstreamVeraSans-Roman-2e"/>
       <use x="95.41015625" xlink:href="#BitstreamVeraSans-Roman-30"/>
       <use x="159.033203125" xlink:href="#BitstreamVeraSans-Roman-30"/>
       <use x="222.65625" xlink:href="#BitstreamVeraSans-Roman-30"/>
       <use x="286.279296875" xlink:href="#BitstreamVeraSans-Roman-30"/>
       <use x="349.90234375" xlink:href="#BitstreamVeraSans-Roman-34"/>
      </g>
     </g>
    </g>
    <g id="ytick_6">
     <g id="line2d_35">
      <g>
       <use style="stroke:#000000;stroke-width:0.5;" x="83.4975" xlink:href="#m7c8db47a52" y="19.22033089250732"/>
      </g>
     </g>
     <g id="line2d_36">
      <g>
       <use style="stroke:#000000;stroke-width:0.5;" x="563.04" xlink:href="#ma8f38dc8f2" y="19.22033089250732"/>
      </g>
     </g>
     <g id="text_9">
      <!-- 0.00005 -->
      <defs>
       <path d="M 10.796875 72.90625 
L 49.515625 72.90625 
L 49.515625 64.59375 
L 19.828125 64.59375 
L 19.828125 46.734375 
Q 21.96875 47.46875 24.109375 47.828125 
Q 26.265625 48.1875 28.421875 48.1875 
Q 40.625 48.1875 47.75 41.5 
Q 54.890625 34.8125 54.890625 23.390625 
Q 54.890625 11.625 47.5625 5.09375 
Q 40.234375 -1.421875 26.90625 -1.421875 
Q 22.3125 -1.421875 17.546875 -0.640625 
Q 12.796875 0.140625 7.71875 1.703125 
L 7.71875 11.625 
Q 12.109375 9.234375 16.796875 8.0625 
Q 21.484375 6.890625 26.703125 6.890625 
Q 35.15625 6.890625 40.078125 11.328125 
Q 45.015625 15.765625 45.015625 23.390625 
Q 45.015625 31 40.078125 35.4375 
Q 35.15625 39.890625 26.703125 39.890625 
Q 22.75 39.890625 18.8125 39.015625 
Q 14.890625 38.140625 10.796875 36.28125 
z
" id="BitstreamVeraSans-Roman-35"/>
      </defs>
      <g transform="translate(29.87375 22.531580892507293)scale(0.12 -0.12)">
       <use xlink:href="#BitstreamVeraSans-Roman-30"/>
       <use x="63.623046875" xlink:href="#BitstreamVeraSans-Roman-2e"/>
       <use x="95.41015625" xlink:href="#BitstreamVeraSans-Roman-30"/>
       <use x="159.033203125" xlink:href="#BitstreamVeraSans-Roman-30"/>
       <use x="222.65625" xlink:href="#BitstreamVeraSans-Roman-30"/>
       <use x="286.279296875" xlink:href="#BitstreamVeraSans-Roman-30"/>
       <use x="349.90234375" xlink:href="#BitstreamVeraSans-Roman-35"/>
      </g>
     </g>
    </g>
    <g id="text_10">
     <!-- tiempo requerido (s) -->
     <defs>
      <path id="BitstreamVeraSans-Roman-20"/>
      <path d="M 8.015625 75.875 
L 15.828125 75.875 
Q 23.140625 64.359375 26.78125 53.3125 
Q 30.421875 42.28125 30.421875 31.390625 
Q 30.421875 20.453125 26.78125 9.375 
Q 23.140625 -1.703125 15.828125 -13.1875 
L 8.015625 -13.1875 
Q 14.5 -2 17.703125 9.0625 
Q 20.90625 20.125 20.90625 31.390625 
Q 20.90625 42.671875 17.703125 53.65625 
Q 14.5 64.65625 8.015625 75.875 
" id="BitstreamVeraSans-Roman-29"/>
      <path d="M 52 44.1875 
Q 55.375 50.25 60.0625 53.125 
Q 64.75 56 71.09375 56 
Q 79.640625 56 84.28125 50.015625 
Q 88.921875 44.046875 88.921875 33.015625 
L 88.921875 0 
L 79.890625 0 
L 79.890625 32.71875 
Q 79.890625 40.578125 77.09375 44.375 
Q 74.3125 48.1875 68.609375 48.1875 
Q 61.625 48.1875 57.5625 43.546875 
Q 53.515625 38.921875 53.515625 30.90625 
L 53.515625 0 
L 44.484375 0 
L 44.484375 32.71875 
Q 44.484375 40.625 41.703125 44.40625 
Q 38.921875 48.1875 33.109375 48.1875 
Q 26.21875 48.1875 22.15625 43.53125 
Q 18.109375 38.875 18.109375 30.90625 
L 18.109375 0 
L 9.078125 0 
L 9.078125 54.6875 
L 18.109375 54.6875 
L 18.109375 46.1875 
Q 21.1875 51.21875 25.484375 53.609375 
Q 29.78125 56 35.6875 56 
Q 41.65625 56 45.828125 52.96875 
Q 50 49.953125 52 44.1875 
" id="BitstreamVeraSans-Roman-6d"/>
      <path d="M 30.609375 48.390625 
Q 23.390625 48.390625 19.1875 42.75 
Q 14.984375 37.109375 14.984375 27.296875 
Q 14.984375 17.484375 19.15625 11.84375 
Q 23.34375 6.203125 30.609375 6.203125 
Q 37.796875 6.203125 41.984375 11.859375 
Q 46.1875 17.53125 46.1875 27.296875 
Q 46.1875 37.015625 41.984375 42.703125 
Q 37.796875 48.390625 30.609375 48.390625 
M 30.609375 56 
Q 42.328125 56 49.015625 48.375 
Q 55.71875 40.765625 55.71875 27.296875 
Q 55.71875 13.875 49.015625 6.21875 
Q 42.328125 -1.421875 30.609375 -1.421875 
Q 18.84375 -1.421875 12.171875 6.21875 
Q 5.515625 13.875 5.515625 27.296875 
Q 5.515625 40.765625 12.171875 48.375 
Q 18.84375 56 30.609375 56 
" id="BitstreamVeraSans-Roman-6f"/>
      <path d="M 9.421875 54.6875 
L 18.40625 54.6875 
L 18.40625 0 
L 9.421875 0 
z
M 9.421875 75.984375 
L 18.40625 75.984375 
L 18.40625 64.59375 
L 9.421875 64.59375 
z
" id="BitstreamVeraSans-Roman-69"/>
      <path d="M 31 75.875 
Q 24.46875 64.65625 21.28125 53.65625 
Q 18.109375 42.671875 18.109375 31.390625 
Q 18.109375 20.125 21.3125 9.0625 
Q 24.515625 -2 31 -13.1875 
L 23.1875 -13.1875 
Q 15.875 -1.703125 12.234375 9.375 
Q 8.59375 20.453125 8.59375 31.390625 
Q 8.59375 42.28125 12.203125 53.3125 
Q 15.828125 64.359375 23.1875 75.875 
z
" id="BitstreamVeraSans-Roman-28"/>
      <path d="M 56.203125 29.59375 
L 56.203125 25.203125 
L 14.890625 25.203125 
Q 15.484375 15.921875 20.484375 11.0625 
Q 25.484375 6.203125 34.421875 6.203125 
Q 39.59375 6.203125 44.453125 7.46875 
Q 49.3125 8.734375 54.109375 11.28125 
L 54.109375 2.78125 
Q 49.265625 0.734375 44.1875 -0.34375 
Q 39.109375 -1.421875 33.890625 -1.421875 
Q 20.796875 -1.421875 13.15625 6.1875 
Q 5.515625 13.8125 5.515625 26.8125 
Q 5.515625 40.234375 12.765625 48.109375 
Q 20.015625 56 32.328125 56 
Q 43.359375 56 49.78125 48.890625 
Q 56.203125 41.796875 56.203125 29.59375 
M 47.21875 32.234375 
Q 47.125 39.59375 43.09375 43.984375 
Q 39.0625 48.390625 32.421875 48.390625 
Q 24.90625 48.390625 20.390625 44.140625 
Q 15.875 39.890625 15.1875 32.171875 
z
" id="BitstreamVeraSans-Roman-65"/>
      <path d="M 45.40625 46.390625 
L 45.40625 75.984375 
L 54.390625 75.984375 
L 54.390625 0 
L 45.40625 0 
L 45.40625 8.203125 
Q 42.578125 3.328125 38.25 0.953125 
Q 33.9375 -1.421875 27.875 -1.421875 
Q 17.96875 -1.421875 11.734375 6.484375 
Q 5.515625 14.40625 5.515625 27.296875 
Q 5.515625 40.1875 11.734375 48.09375 
Q 17.96875 56 27.875 56 
Q 33.9375 56 38.25 53.625 
Q 42.578125 51.265625 45.40625 46.390625 
M 14.796875 27.296875 
Q 14.796875 17.390625 18.875 11.75 
Q 22.953125 6.109375 30.078125 6.109375 
Q 37.203125 6.109375 41.296875 11.75 
Q 45.40625 17.390625 45.40625 27.296875 
Q 45.40625 37.203125 41.296875 42.84375 
Q 37.203125 48.484375 30.078125 48.484375 
Q 22.953125 48.484375 18.875 42.84375 
Q 14.796875 37.203125 14.796875 27.296875 
" id="BitstreamVeraSans-Roman-64"/>
      <path d="M 18.3125 70.21875 
L 18.3125 54.6875 
L 36.8125 54.6875 
L 36.8125 47.703125 
L 18.3125 47.703125 
L 18.3125 18.015625 
Q 18.3125 11.328125 20.140625 9.421875 
Q 21.96875 7.515625 27.59375 7.515625 
L 36.8125 7.515625 
L 36.8125 0 
L 27.59375 0 
Q 17.1875 0 13.234375 3.875 
Q 9.28125 7.765625 9.28125 18.015625 
L 9.28125 47.703125 
L 2.6875 47.703125 
L 2.6875 54.6875 
L 9.28125 54.6875 
L 9.28125 70.21875 
z
" id="BitstreamVeraSans-Roman-74"/>
      <path d="M 8.5 21.578125 
L 8.5 54.6875 
L 17.484375 54.6875 
L 17.484375 21.921875 
Q 17.484375 14.15625 20.5 10.265625 
Q 23.53125 6.390625 29.59375 6.390625 
Q 36.859375 6.390625 41.078125 11.03125 
Q 45.3125 15.671875 45.3125 23.6875 
L 45.3125 54.6875 
L 54.296875 54.6875 
L 54.296875 0 
L 45.3125 0 
L 45.3125 8.40625 
Q 42.046875 3.421875 37.71875 1 
Q 33.40625 -1.421875 27.6875 -1.421875 
Q 18.265625 -1.421875 13.375 4.4375 
Q 8.5 10.296875 8.5 21.578125 
" id="BitstreamVeraSans-Roman-75"/>
      <path d="M 41.109375 46.296875 
Q 39.59375 47.171875 37.8125 47.578125 
Q 36.03125 48 33.890625 48 
Q 26.265625 48 22.1875 43.046875 
Q 18.109375 38.09375 18.109375 28.8125 
L 18.109375 0 
L 9.078125 0 
L 9.078125 54.6875 
L 18.109375 54.6875 
L 18.109375 46.1875 
Q 20.953125 51.171875 25.484375 53.578125 
Q 30.03125 56 36.53125 56 
Q 37.453125 56 38.578125 55.875 
Q 39.703125 55.765625 41.0625 55.515625 
z
" id="BitstreamVeraSans-Roman-72"/>
      <path d="M 44.28125 53.078125 
L 44.28125 44.578125 
Q 40.484375 46.53125 36.375 47.5 
Q 32.28125 48.484375 27.875 48.484375 
Q 21.1875 48.484375 17.84375 46.4375 
Q 14.5 44.390625 14.5 40.28125 
Q 14.5 37.15625 16.890625 35.375 
Q 19.28125 33.59375 26.515625 31.984375 
L 29.59375 31.296875 
Q 39.15625 29.25 43.1875 25.515625 
Q 47.21875 21.78125 47.21875 15.09375 
Q 47.21875 7.46875 41.1875 3.015625 
Q 35.15625 -1.421875 24.609375 -1.421875 
Q 20.21875 -1.421875 15.453125 -0.5625 
Q 10.6875 0.296875 5.421875 2 
L 5.421875 11.28125 
Q 10.40625 8.6875 15.234375 7.390625 
Q 20.0625 6.109375 24.8125 6.109375 
Q 31.15625 6.109375 34.5625 8.28125 
Q 37.984375 10.453125 37.984375 14.40625 
Q 37.984375 18.0625 35.515625 20.015625 
Q 33.0625 21.96875 24.703125 23.78125 
L 21.578125 24.515625 
Q 13.234375 26.265625 9.515625 29.90625 
Q 5.8125 33.546875 5.8125 39.890625 
Q 5.8125 47.609375 11.28125 51.796875 
Q 16.75 56 26.8125 56 
Q 31.78125 56 36.171875 55.265625 
Q 40.578125 54.546875 44.28125 53.078125 
" id="BitstreamVeraSans-Roman-73"/>
      <path d="M 18.109375 8.203125 
L 18.109375 -20.796875 
L 9.078125 -20.796875 
L 9.078125 54.6875 
L 18.109375 54.6875 
L 18.109375 46.390625 
Q 20.953125 51.265625 25.265625 53.625 
Q 29.59375 56 35.59375 56 
Q 45.5625 56 51.78125 48.09375 
Q 58.015625 40.1875 58.015625 27.296875 
Q 58.015625 14.40625 51.78125 6.484375 
Q 45.5625 -1.421875 35.59375 -1.421875 
Q 29.59375 -1.421875 25.265625 0.953125 
Q 20.953125 3.328125 18.109375 8.203125 
M 48.6875 27.296875 
Q 48.6875 37.203125 44.609375 42.84375 
Q 40.53125 48.484375 33.40625 48.484375 
Q 26.265625 48.484375 22.1875 42.84375 
Q 18.109375 37.203125 18.109375 27.296875 
Q 18.109375 17.390625 22.1875 11.75 
Q 26.265625 6.109375 33.40625 6.109375 
Q 40.53125 6.109375 44.609375 11.75 
Q 48.6875 17.390625 48.6875 27.296875 
" id="BitstreamVeraSans-Roman-70"/>
      <path d="M 14.796875 27.296875 
Q 14.796875 17.390625 18.875 11.75 
Q 22.953125 6.109375 30.078125 6.109375 
Q 37.203125 6.109375 41.296875 11.75 
Q 45.40625 17.390625 45.40625 27.296875 
Q 45.40625 37.203125 41.296875 42.84375 
Q 37.203125 48.484375 30.078125 48.484375 
Q 22.953125 48.484375 18.875 42.84375 
Q 14.796875 37.203125 14.796875 27.296875 
M 45.40625 8.203125 
Q 42.578125 3.328125 38.25 0.953125 
Q 33.9375 -1.421875 27.875 -1.421875 
Q 17.96875 -1.421875 11.734375 6.484375 
Q 5.515625 14.40625 5.515625 27.296875 
Q 5.515625 40.1875 11.734375 48.09375 
Q 17.96875 56 27.875 56 
Q 33.9375 56 38.25 53.625 
Q 42.578125 51.265625 45.40625 46.390625 
L 45.40625 54.6875 
L 54.390625 54.6875 
L 54.390625 -20.796875 
L 45.40625 -20.796875 
z
" id="BitstreamVeraSans-Roman-71"/>
     </defs>
     <g transform="translate(22.378124999999997 272.80562499999996)rotate(-90.0)scale(0.12 -0.12)">
      <use xlink:href="#BitstreamVeraSans-Roman-74"/>
      <use x="39.208984375" xlink:href="#BitstreamVeraSans-Roman-69"/>
      <use x="66.9921875" xlink:href="#BitstreamVeraSans-Roman-65"/>
      <use x="128.515625" xlink:href="#BitstreamVeraSans-Roman-6d"/>
      <use x="225.927734375" xlink:href="#BitstreamVeraSans-Roman-70"/>
      <use x="289.404296875" xlink:href="#BitstreamVeraSans-Roman-6f"/>
      <use x="350.5859375" xlink:href="#BitstreamVeraSans-Roman-20"/>
      <use x="382.373046875" xlink:href="#BitstreamVeraSans-Roman-72"/>
      <use x="423.455078125" xlink:href="#BitstreamVeraSans-Roman-65"/>
      <use x="484.978515625" xlink:href="#BitstreamVeraSans-Roman-71"/>
      <use x="548.455078125" xlink:href="#BitstreamVeraSans-Roman-75"/>
      <use x="611.833984375" xlink:href="#BitstreamVeraSans-Roman-65"/>
      <use x="673.357421875" xlink:href="#BitstreamVeraSans-Roman-72"/>
      <use x="714.470703125" xlink:href="#BitstreamVeraSans-Roman-69"/>
      <use x="742.25390625" xlink:href="#BitstreamVeraSans-Roman-64"/>
      <use x="805.73046875" xlink:href="#BitstreamVeraSans-Roman-6f"/>
      <use x="866.912109375" xlink:href="#BitstreamVeraSans-Roman-20"/>
      <use x="898.69921875" xlink:href="#BitstreamVeraSans-Roman-28"/>
      <use x="937.712890625" xlink:href="#BitstreamVeraSans-Roman-73"/>
      <use x="989.8125" xlink:href="#BitstreamVeraSans-Roman-29"/>
     </g>
    </g>
   </g>
  </g>
 </g>
 <defs>
  <clipPath id="pca902f3119">
   <rect height="384.53000000000003" width="479.54249999999996" x="83.4975" y="18.810000000000002"/>
  </clipPath>
 </defs>
</svg>
