<?xml version="1.0" encoding="UTF-8" standalone="no"?>
<!-- Created with Inkscape (http://www.inkscape.org/) -->

<svg
   xmlns:dc="http://purl.org/dc/elements/1.1/"
   xmlns:cc="http://creativecommons.org/ns#"
   xmlns:rdf="http://www.w3.org/1999/02/22-rdf-syntax-ns#"
   xmlns:svg="http://www.w3.org/2000/svg"
   xmlns="http://www.w3.org/2000/svg"
   xmlns:sodipodi="http://sodipodi.sourceforge.net/DTD/sodipodi-0.dtd"
   xmlns:inkscape="http://www.inkscape.org/namespaces/inkscape"
   width="457.04163"
   height="379.72739"
   id="svg2"
   version="1.1"
   inkscape:version="0.92.3 (unknown)"
   sodipodi:docname="diagcaja.svg"
   inkscape:export-filename="/home/juan/Cursos/R/imagenes/boxplot.png"
   inkscape:export-xdpi="90"
   inkscape:export-ydpi="90">
  <defs
     id="defs4">
    <marker
       inkscape:stockid="StopL"
       orient="auto"
       refY="0"
       refX="0"
       id="StopL"
       style="overflow:visible">
      <path
         id="path4038"
         d="M 0,5.65 0,-5.65"
         style="fill:none;stroke:#000000;stroke-width:1pt"
         transform="scale(0.8,0.8)"
         inkscape:connector-curvature="0" />
    </marker>
    <marker
       inkscape:stockid="Arrow2Mend"
       orient="auto"
       refY="0"
       refX="0"
       id="Arrow2Mend"
       style="overflow:visible">
      <path
         id="path3896"
         style="fill-rule:evenodd;stroke-width:0.625;stroke-linejoin:round"
         d="M 8.7185878,4.0337352 -2.2072895,0.01601326 8.7185884,-4.0017078 c -1.7454984,2.3720609 -1.7354408,5.6174519 -6e-7,8.035443 z"
         transform="scale(-0.6,-0.6)"
         inkscape:connector-curvature="0" />
    </marker>
    <marker
       inkscape:stockid="DotM"
       orient="auto"
       refY="0"
       refX="0"
       id="DotM"
       style="overflow:visible">
      <path
         id="path3933"
         d="m -2.5,-1 c 0,2.76 -2.24,5 -5,5 -2.76,0 -5,-2.24 -5,-5 0,-2.76 2.24,-5 5,-5 2.76,0 5,2.24 5,5 z"
         style="fill-rule:evenodd;stroke:#000000;stroke-width:1pt"
         transform="matrix(0.4,0,0,0.4,2.96,0.4)"
         inkscape:connector-curvature="0" />
    </marker>
    <marker
       inkscape:stockid="DotS"
       orient="auto"
       refY="0"
       refX="0"
       id="DotS"
       style="overflow:visible">
      <path
         id="path3936"
         d="m -2.5,-1 c 0,2.76 -2.24,5 -5,5 -2.76,0 -5,-2.24 -5,-5 0,-2.76 2.24,-5 5,-5 2.76,0 5,2.24 5,5 z"
         style="fill-rule:evenodd;stroke:#000000;stroke-width:1pt"
         transform="matrix(0.2,0,0,0.2,1.48,0.2)"
         inkscape:connector-curvature="0" />
    </marker>
    <marker
       inkscape:stockid="StopM"
       orient="auto"
       refY="0"
       refX="0"
       id="StopM"
       style="overflow:visible">
      <path
         id="path4041"
         d="M 0,5.65 0,-5.65"
         style="fill:none;stroke:#000000;stroke-width:1pt"
         transform="scale(0.4,0.4)"
         inkscape:connector-curvature="0" />
    </marker>
  </defs>
  <sodipodi:namedview
     id="base"
     pagecolor="#ffffff"
     bordercolor="#666666"
     borderopacity="1.0"
     inkscape:pageopacity="0.0"
     inkscape:pageshadow="2"
     inkscape:zoom="1.979899"
     inkscape:cx="45.677144"
     inkscape:cy="365.80249"
     inkscape:document-units="px"
     inkscape:current-layer="layer1"
     showgrid="false"
     showguides="true"
     inkscape:guide-bbox="true"
     fit-margin-top="0"
     fit-margin-left="0"
     fit-margin-right="0"
     fit-margin-bottom="0"
     inkscape:window-width="1301"
     inkscape:window-height="744"
     inkscape:window-x="65"
     inkscape:window-y="24"
     inkscape:window-maximized="1">
    <sodipodi:guide
       orientation="0,1"
       position="282.78982,198.71669"
       id="guide3050"
       inkscape:locked="false" />
    <sodipodi:guide
       orientation="0,1"
       position="288.5452,148.12686"
       id="guide3052"
       inkscape:locked="false" />
    <sodipodi:guide
       orientation="0,1"
       position="314.4148,91.127392"
       id="guide3054"
       inkscape:locked="false" />
    <sodipodi:guide
       orientation="0,1"
       position="250.2541,4.7167719"
       id="guide3056"
       inkscape:locked="false" />
    <sodipodi:guide
       orientation="0,1"
       position="249.11768,345.18553"
       id="guide3058"
       inkscape:locked="false" />
    <sodipodi:guide
       orientation="1,0"
       position="152.30087,260.19066"
       id="guide3060"
       inkscape:locked="false" />
    <sodipodi:guide
       orientation="1,0"
       position="221.03109,247.89879"
       id="guide5122"
       inkscape:locked="false" />
    <sodipodi:guide
       orientation="1,0"
       position="242.94169,269.20565"
       id="guide5745"
       inkscape:locked="false" />
  </sodipodi:namedview>
  <metadata
     id="metadata7">
    <rdf:RDF>
      <cc:Work
         rdf:about="">
        <dc:format>image/svg+xml</dc:format>
        <dc:type
           rdf:resource="http://purl.org/dc/dcmitype/StillImage" />
        <dc:title />
      </cc:Work>
    </rdf:RDF>
  </metadata>
  <g
     inkscape:label="Layer 1"
     inkscape:groupmode="layer"
     id="layer1"
     transform="translate(-181.04947,-272.69077)">
    <text
       xml:space="preserve"
       style="font-style:normal;font-variant:normal;font-weight:normal;font-stretch:normal;line-height:0%;font-family:'DejaVu Serif';-inkscape-font-specification:'DejaVu Serif';letter-spacing:0px;word-spacing:0px;fill:#000000;fill-opacity:1;stroke:none"
       x="239.60922"
       y="453.70148"
       id="text3062"><tspan
         sodipodi:role="line"
         id="tspan3064"
         x="239.60922"
         y="453.70148"
         style="font-size:20px;line-height:1.25">Q3 (75%)</tspan></text>
    <text
       xml:space="preserve"
       style="font-style:normal;font-variant:normal;font-weight:normal;font-stretch:normal;line-height:0%;font-family:'DejaVu Serif';-inkscape-font-specification:'DejaVu Serif';letter-spacing:0px;word-spacing:0px;fill:#000000;fill-opacity:1;stroke:none"
       x="239.888"
       y="561.17548"
       id="text3062-9"><tspan
         sodipodi:role="line"
         id="tspan3064-3"
         x="239.888"
         y="561.17548"
         style="font-size:20px;line-height:1.25">Q1 (25%)</tspan></text>
    <text
       xml:space="preserve"
       style="font-style:normal;font-variant:normal;font-weight:normal;font-stretch:normal;line-height:0%;font-family:'DejaVu Serif';-inkscape-font-specification:'DejaVu Serif';letter-spacing:0px;word-spacing:0px;fill:#000000;fill-opacity:1;stroke:none"
       x="180.05338"
       y="504.29129"
       id="text3087"><tspan
         sodipodi:role="line"
         id="tspan3089"
         x="180.05338"
         y="504.29129"
         style="font-size:20px;line-height:1.25">Mediana (50%)</tspan></text>
    <path
       style="fill:none;stroke:#000000;stroke-width:2.20000005;stroke-linecap:butt;stroke-linejoin:miter;stroke-miterlimit:4;stroke-opacity:1;stroke-dasharray:none;marker-start:url(#DotS);marker-end:url(#DotS)"
       d="m 479.82246,453.70146 0,107.47404"
       id="path3095"
       inkscape:connector-curvature="0" />
    <text
       xml:space="preserve"
       style="font-style:normal;font-variant:normal;font-weight:normal;font-stretch:normal;line-height:0%;font-family:'DejaVu Serif';-inkscape-font-specification:'DejaVu Serif';letter-spacing:0px;word-spacing:0px;fill:#000000;fill-opacity:1;stroke:none"
       x="487.10477"
       y="504.29129"
       id="text3087-8"><tspan
         sodipodi:role="line"
         id="tspan3089-8"
         x="487.10477"
         y="504.29129"
         style="font-size:20px;line-height:1.25">RIC = Q3 - Q1</tspan><tspan
         sodipodi:role="line"
         x="487.10477"
         y="529.29126"
         style="font-size:20px;line-height:1.25"
         id="tspan4890">(50% de datos)</tspan></text>
    <text
       xml:space="preserve"
       style="font-style:normal;font-variant:normal;font-weight:normal;font-stretch:normal;line-height:0%;font-family:'DejaVu Serif';-inkscape-font-specification:'DejaVu Serif';letter-spacing:0px;word-spacing:0px;fill:#000000;fill-opacity:1;stroke:none"
       x="444.46713"
       y="307.23264"
       id="text4892"><tspan
         sodipodi:role="line"
         id="tspan4894"
         x="444.46713"
         y="307.23264"
         style="font-size:20px;line-height:1.25">max(x)|<tspan
   style="font-size:14px"
   id="tspan3028">x ≤ Ls</tspan></tspan></text>
    <text
       xml:space="preserve"
       style="font-style:normal;font-variant:normal;font-weight:normal;font-stretch:normal;line-height:0%;font-family:'DejaVu Serif';-inkscape-font-specification:'DejaVu Serif';letter-spacing:0px;word-spacing:0px;fill:#000000;fill-opacity:1;stroke:none"
       x="449.74777"
       y="647.70135"
       id="text4892-3"><tspan
         sodipodi:role="line"
         id="tspan4894-9"
         x="449.74777"
         y="647.70135"
         style="font-size:20px;line-height:1.25">min(x)|<tspan
   style="font-size:14px"
   id="tspan3030">x ≥ Li</tspan></tspan></text>
    <text
       xml:space="preserve"
       style="font-style:normal;font-variant:normal;font-weight:normal;font-stretch:normal;line-height:0%;font-family:'DejaVu Serif';-inkscape-font-specification:'DejaVu Serif';letter-spacing:0px;word-spacing:0px;fill:#000000;fill-opacity:1;stroke:none"
       x="275.26657"
       y="288.68686"
       id="text4922"><tspan
         sodipodi:role="line"
         id="tspan4924"
         x="275.26657"
         y="288.68686"
         style="font-size:20px;line-height:1.25">Outlier</tspan></text>
    <path
       style="fill:none;stroke:#000000;stroke-width:1.79999995;stroke-linecap:butt;stroke-linejoin:miter;stroke-miterlimit:4;stroke-opacity:1;stroke-dasharray:none;marker-end:url(#Arrow2Mend)"
       d="m 351.53309,283.13102 40.91117,0"
       id="path4926"
       inkscape:connector-curvature="0" />
    <rect
       style="fill:none;stroke:#000000;stroke-width:1.5;stroke-miterlimit:4;stroke-opacity:1;stroke-dasharray:none"
       id="rect5120"
       width="119.7868"
       height="107.58931"
       x="342.07144"
       y="453.70145" />
    <path
       style="fill:none;stroke:#000000;stroke-width:3.2931242;stroke-linecap:butt;stroke-linejoin:miter;stroke-miterlimit:4;stroke-opacity:1;stroke-dasharray:none"
       d="m 342.38185,504.29129 119.20478,0"
       id="path5124"
       inkscape:connector-curvature="0" />
    <path
       style="fill:none;stroke:#000000;stroke-width:3;stroke-linecap:butt;stroke-linejoin:miter;stroke-miterlimit:4;stroke-opacity:1;stroke-dasharray:9, 9;stroke-dashoffset:29.99999946;marker-start:url(#StopL)"
       d="m 402.08056,647.70138 0,-86.41062"
       id="path5126"
       inkscape:connector-curvature="0"
       sodipodi:nodetypes="cc" />
    <path
       style="fill:none;stroke:#000000;stroke-width:3;stroke-linecap:butt;stroke-linejoin:miter;stroke-miterlimit:4;stroke-opacity:1;stroke-dasharray:9, 9;stroke-dashoffset:29.99999888;marker-end:url(#StopL)"
       d="m 402.08056,453.70146 0,-146.46884"
       id="path5126-7"
       inkscape:connector-curvature="0" />
    <path
       sodipodi:type="arc"
       style="fill:none;stroke:#000000;stroke-width:1.5;stroke-linecap:butt;stroke-linejoin:round;stroke-miterlimit:4;stroke-opacity:1;stroke-dasharray:none;stroke-dashoffset:29.99999946"
       id="path5718"
       sodipodi:cx="333.2872"
       sodipodi:cy="96.427856"
       sodipodi:rx="3.7249374"
       sodipodi:ry="3.7249374"
       d="m 337.01214,96.427856 a 3.7249374,3.7249374 0 0 1 -3.72494,3.724934 3.7249374,3.7249374 0 0 1 -3.72494,-3.724934 3.7249374,3.7249374 0 0 1 3.72494,-3.724937 3.7249374,3.7249374 0 0 1 3.72494,3.724937 z"
       transform="translate(68.793361,186.05245)" />
    <text
       xml:space="preserve"
       style="font-style:normal;font-variant:normal;font-weight:normal;font-stretch:normal;line-height:0%;font-family:'DejaVu Serif';-inkscape-font-specification:'DejaVu Serif';letter-spacing:0px;word-spacing:0px;fill:#000000;fill-opacity:1;stroke:none"
       x="423.99115"
       y="605.95117"
       id="text5720"><tspan
         sodipodi:role="line"
         id="tspan5722"
         x="423.99115"
         y="605.95117"
         style="font-size:20px;line-height:1.25">Li = Q1 - RIC·1.5</tspan></text>
    <text
       xml:space="preserve"
       style="font-style:normal;font-variant:normal;font-weight:normal;font-stretch:normal;line-height:0%;font-family:'DejaVu Serif';-inkscape-font-specification:'DejaVu Serif';letter-spacing:0px;word-spacing:0px;fill:#000000;fill-opacity:1;stroke:none"
       x="423.99115"
       y="383.21249"
       id="text5720-8"><tspan
         sodipodi:role="line"
         id="tspan5722-6"
         x="423.99115"
         y="383.21249"
         style="font-size:20px;line-height:1.25">Ls = Q3 + RIC·1.5</tspan></text>
  </g>
</svg>
