<?xml version="1.0" encoding="UTF-8" standalone="no"?>
<!-- Created with matplotlib (http://matplotlib.org/) -->

<svg
   xmlns:dc="http://purl.org/dc/elements/1.1/"
   xmlns:cc="http://creativecommons.org/ns#"
   xmlns:rdf="http://www.w3.org/1999/02/22-rdf-syntax-ns#"
   xmlns:svg="http://www.w3.org/2000/svg"
   xmlns="http://www.w3.org/2000/svg"
   xmlns:xlink="http://www.w3.org/1999/xlink"
   xmlns:sodipodi="http://sodipodi.sourceforge.net/DTD/sodipodi-0.dtd"
   xmlns:inkscape="http://www.inkscape.org/namespaces/inkscape"
   height="511.20001pt"
   version="1.1"
   viewBox="0 0 907.44751 511.20001"
   width="907.44751pt"
   id="svg422"
   sodipodi:docname="paths_euroc_gftt_brisk.svg"
   inkscape:version="0.92.3 (unknown)">
  <metadata
     id="metadata426">
    <rdf:RDF>
      <cc:Work
         rdf:about="">
        <dc:format>image/svg+xml</dc:format>
        <dc:type
           rdf:resource="http://purl.org/dc/dcmitype/StillImage" />
      </cc:Work>
    </rdf:RDF>
  </metadata>
  <sodipodi:namedview
     pagecolor="#ffffff"
     bordercolor="#666666"
     borderopacity="1"
     objecttolerance="10"
     gridtolerance="10"
     guidetolerance="10"
     inkscape:pageopacity="0"
     inkscape:pageshadow="2"
     inkscape:window-width="1301"
     inkscape:window-height="744"
     id="namedview424"
     showgrid="false"
     inkscape:zoom="0.18782051"
     inkscape:cx="584.85"
     inkscape:cy="340.8"
     inkscape:window-x="65"
     inkscape:window-y="24"
     inkscape:window-maximized="1"
     inkscape:current-layer="svg422" />
  <defs
     id="defs4"
     style="stroke-linecap:butt;stroke-linejoin:round;stroke-miterlimit:100000">
    <style
       type="text/css"
       id="style2">
*{stroke-linecap:butt;stroke-linejoin:round;stroke-miterlimit:100000;}
  </style>
  </defs>
  <g
     style="stroke-linecap:butt;stroke-linejoin:round;stroke-miterlimit:100000"
     id="patch_2"
     transform="translate(-146.3625,-63.9)">
    <path
       inkscape:connector-curvature="0"
       id="path9"
       style="fill:#ffffff;stroke-linecap:butt;stroke-linejoin:round;stroke-miterlimit:100000"
       d="M 146.3625,575.1 H 1053.81 V 63.9 H 146.3625 Z" />
  </g>
  <g
     style="stroke-linecap:butt;stroke-linejoin:round;stroke-miterlimit:100000"
     id="pane3d_1"
     transform="translate(-146.3625,-63.9)">
    <g
       style="stroke-linecap:butt;stroke-linejoin:round;stroke-miterlimit:100000"
       id="patch_3">
      <path
         inkscape:connector-curvature="0"
         id="path12"
         style="opacity:0.5;fill:#f2f2f2;stroke:#f2f2f2;stroke-linecap:butt;stroke-linejoin:miter;stroke-miterlimit:100000"
         d="m 967.79349,450.21308 -331.53357,-81.44901 0.85519,-253.75615 344.34775,65.48442" />
    </g>
  </g>
  <g
     style="stroke-linecap:butt;stroke-linejoin:round;stroke-miterlimit:100000"
     id="pane3d_2"
     transform="translate(-146.3625,-63.9)">
    <g
       style="stroke-linecap:butt;stroke-linejoin:round;stroke-miterlimit:100000"
       id="patch_4">
      <path
         inkscape:connector-curvature="0"
         id="path16"
         style="opacity:0.5;fill:#e6e6e6;stroke:#e6e6e6;stroke-linecap:butt;stroke-linejoin:miter;stroke-miterlimit:100000"
         d="m 260.33781,438.57073 375.92211,-69.80666 0.85519,-253.75615 -390.1789,56.10321" />
    </g>
  </g>
  <g
     style="stroke-linecap:butt;stroke-linejoin:round;stroke-miterlimit:100000"
     id="pane3d_3"
     transform="translate(-146.3625,-63.9)">
    <g
       style="stroke-linecap:butt;stroke-linejoin:round;stroke-miterlimit:100000"
       id="patch_5">
      <path
         inkscape:connector-curvature="0"
         id="path20"
         style="opacity:0.5;fill:#ececec;stroke:#ececec;stroke-linecap:butt;stroke-linejoin:miter;stroke-miterlimit:100000"
         d="M 584.98946,530.86714 967.79349,450.21308 636.25992,368.76407 260.33781,438.57073" />
    </g>
  </g>
  <g
     style="stroke-linecap:butt;stroke-linejoin:round;stroke-miterlimit:100000"
     id="axis3d_1"
     transform="translate(-146.3625,-63.9)">
    <g
       style="stroke-linecap:butt;stroke-linejoin:round;stroke-miterlimit:100000"
       id="line2d_1">
      <path
         inkscape:connector-curvature="0"
         id="path24"
         style="fill:none;stroke:#000000;stroke-width:0.75;stroke-linecap:square;stroke-linejoin:round;stroke-miterlimit:100000"
         d="M 967.79349,450.21308 584.98946,530.86714" />
    </g>
    <g
       style="stroke-linecap:butt;stroke-linejoin:round;stroke-miterlimit:100000"
       id="text_1">
      <!-- x (m) -->
      <defs
         id="defs32">
        <path
           style="stroke-linecap:butt;stroke-linejoin:round;stroke-miterlimit:100000"
           inkscape:connector-curvature="0"
           id="BitstreamVeraSans-Roman-29"
           d="m 8.015625,75.875 h 7.8125 q 7.3125,-11.515625 10.953125,-22.5625 3.640625,-11.03125 3.640625,-21.921875 0,-10.9375 -3.640625,-22.015625 -3.640625,-11.078125 -10.953125,-22.5625 h -7.8125 Q 14.5,-2 17.703125,9.0625 20.90625,20.125 20.90625,31.390625 q 0,11.28125 -3.203125,22.265625 -3.203125,11 -9.6875,22.21875" />
        <path
           style="stroke-linecap:butt;stroke-linejoin:round;stroke-miterlimit:100000"
           inkscape:connector-curvature="0"
           d=""
           id="BitstreamVeraSans-Roman-20" />
        <path
           style="stroke-linecap:butt;stroke-linejoin:round;stroke-miterlimit:100000"
           inkscape:connector-curvature="0"
           id="BitstreamVeraSans-Roman-6d"
           d="M 52,44.1875 Q 55.375,50.25 60.0625,53.125 64.75,56 71.09375,56 q 8.546875,0 13.1875,-5.984375 4.640625,-5.96875 4.640625,-17 V 0 h -9.03125 v 32.71875 q 0,7.859375 -2.796875,11.65625 -2.78125,3.8125 -8.484375,3.8125 -6.984375,0 -11.046875,-4.640625 -4.046875,-4.625 -4.046875,-12.640625 V 0 h -9.03125 v 32.71875 q 0,7.90625 -2.78125,11.6875 -2.78125,3.78125 -8.59375,3.78125 -6.890625,0 -10.953125,-4.65625 -4.046875,-4.65625 -4.046875,-12.625 V 0 h -9.03125 v 54.6875 h 9.03125 v -8.5 q 3.078125,5.03125 7.375,7.421875 Q 29.78125,56 35.6875,56 41.65625,56 45.828125,52.96875 50,49.953125 52,44.1875" />
        <path
           style="stroke-linecap:butt;stroke-linejoin:round;stroke-miterlimit:100000"
           inkscape:connector-curvature="0"
           id="BitstreamVeraSans-Roman-78"
           d="M 54.890625,54.6875 35.109375,28.078125 55.90625,0 H 45.3125 L 29.390625,21.484375 13.484375,0 H 2.875 L 24.125,28.609375 4.6875,54.6875 h 10.59375 l 14.5,-19.484375 14.5,19.484375 z" />
        <path
           style="stroke-linecap:butt;stroke-linejoin:round;stroke-miterlimit:100000"
           inkscape:connector-curvature="0"
           id="BitstreamVeraSans-Roman-28"
           d="M 31,75.875 Q 24.46875,64.65625 21.28125,53.65625 18.109375,42.671875 18.109375,31.390625 18.109375,20.125 21.3125,9.0625 24.515625,-2 31,-13.1875 H 23.1875 Q 15.875,-1.703125 12.234375,9.375 8.59375,20.453125 8.59375,31.390625 q 0,10.890625 3.609375,21.921875 3.625,11.046875 10.984375,22.5625 z" />
      </defs>
      <g
         style="stroke-linecap:butt;stroke-linejoin:round;stroke-miterlimit:100000"
         id="g44"
         transform="matrix(0.11742203,-0.02473998,-0.02473998,-0.11742203,792.09258,521.15342)">
        <use
           height="100%"
           width="100%"
           y="0"
           x="0"
           style="stroke-linecap:butt;stroke-linejoin:round;stroke-miterlimit:100000"
           id="use34"
           xlink:href="#BitstreamVeraSans-Roman-78" />
        <use
           height="100%"
           width="100%"
           y="0"
           style="stroke-linecap:butt;stroke-linejoin:round;stroke-miterlimit:100000"
           id="use36"
           xlink:href="#BitstreamVeraSans-Roman-20"
           x="59.179688" />
        <use
           height="100%"
           width="100%"
           y="0"
           style="stroke-linecap:butt;stroke-linejoin:round;stroke-miterlimit:100000"
           id="use38"
           xlink:href="#BitstreamVeraSans-Roman-28"
           x="90.966797" />
        <use
           height="100%"
           width="100%"
           y="0"
           style="stroke-linecap:butt;stroke-linejoin:round;stroke-miterlimit:100000"
           id="use40"
           xlink:href="#BitstreamVeraSans-Roman-6d"
           x="129.98047" />
        <use
           height="100%"
           width="100%"
           y="0"
           style="stroke-linecap:butt;stroke-linejoin:round;stroke-miterlimit:100000"
           id="use42"
           xlink:href="#BitstreamVeraSans-Roman-29"
           x="227.39258" />
      </g>
    </g>
    <g
       style="stroke-linecap:butt;stroke-linejoin:round;stroke-miterlimit:100000"
       id="Line3DCollection_1">
      <path
         inkscape:connector-curvature="0"
         id="path47"
         style="fill:none;stroke:#e6e6e6;stroke-linecap:butt;stroke-linejoin:round;stroke-miterlimit:100000"
         d="M 619.15635,523.66842 293.75286,432.36574 281.68885,166.1141" />
      <path
         inkscape:connector-curvature="0"
         id="path49"
         style="fill:none;stroke:#e6e6e6;stroke-linecap:butt;stroke-linejoin:round;stroke-miterlimit:100000"
         d="M 683.89644,510.02815 357.14206,420.59471 347.57774,156.64004" />
      <path
         inkscape:connector-curvature="0"
         id="path51"
         style="fill:none;stroke:#e6e6e6;stroke-linecap:butt;stroke-linejoin:round;stroke-miterlimit:100000"
         d="M 747.27001,496.67579 419.28692,409.05476 412.12523,147.35886" />
      <path
         inkscape:connector-curvature="0"
         id="path53"
         style="fill:none;stroke:#e6e6e6;stroke-linecap:butt;stroke-linejoin:round;stroke-miterlimit:100000"
         d="M 809.31989,483.60233 480.22372,397.73913 475.37188,138.26472" />
      <path
         inkscape:connector-curvature="0"
         id="path55"
         style="fill:none;stroke:#e6e6e6;stroke-linecap:butt;stroke-linejoin:round;stroke-miterlimit:100000"
         d="M 870.08711,470.79911 539.98734,386.64136 537.35662,129.35204" />
      <path
         inkscape:connector-curvature="0"
         id="path57"
         style="fill:none;stroke:#e6e6e6;stroke-linecap:butt;stroke-linejoin:round;stroke-miterlimit:100000"
         d="m 929.61104,458.25785 -330.9997,-82.50264 -0.4945,-255.13979" />
    </g>
    <g
       style="stroke-linecap:butt;stroke-linejoin:round;stroke-miterlimit:100000"
       id="xtick_1">
      <g
         style="stroke-linecap:butt;stroke-linejoin:round;stroke-miterlimit:100000"
         id="line2d_2">
        <path
           inkscape:connector-curvature="0"
           id="path60"
           style="fill:none;stroke:#000000;stroke-linecap:square;stroke-linejoin:round;stroke-miterlimit:100000"
           d="m 616.35469,522.88233 8.41533,2.36119" />
      </g>
      <g
         style="stroke-linecap:butt;stroke-linejoin:round;stroke-miterlimit:100000"
         id="text_2">
        <!-- −2 -->
        <defs
           id="defs65">
          <path
             style="stroke-linecap:butt;stroke-linejoin:round;stroke-miterlimit:100000"
             inkscape:connector-curvature="0"
             id="BitstreamVeraSans-Roman-2212"
             d="M 10.59375,35.5 H 73.1875 V 27.203125 H 10.59375 Z" />
          <path
             style="stroke-linecap:butt;stroke-linejoin:round;stroke-miterlimit:100000"
             inkscape:connector-curvature="0"
             id="BitstreamVeraSans-Roman-32"
             d="M 19.1875,8.296875 H 53.609375 V 0 H 7.328125 v 8.296875 q 5.609375,5.8125 15.296875,15.59375 9.703125,9.796875 12.1875,12.640625 4.734375,5.3125 6.609375,9 1.890625,3.6875 1.890625,7.25 0,5.8125 -4.078125,9.46875 -4.078125,3.671875 -10.625,3.671875 -4.640625,0 -9.796875,-1.609375 -5.140625,-1.609375 -11,-4.890625 v 9.96875 Q 13.765625,71.78125 18.9375,73 q 5.1875,1.21875 9.484375,1.21875 11.328125,0 18.0625,-5.671875 6.734375,-5.65625 6.734375,-15.125 0,-4.5 -1.6875,-8.53125 Q 49.859375,40.875 45.40625,35.40625 44.1875,33.984375 37.640625,27.21875 31.109375,20.453125 19.1875,8.296875" />
        </defs>
        <g
           style="stroke-linecap:butt;stroke-linejoin:round;stroke-miterlimit:100000"
           id="g71"
           transform="matrix(0.12,0,0,-0.12,621.69856,544.85188)">
          <use
             height="100%"
             width="100%"
             y="0"
             x="0"
             style="stroke-linecap:butt;stroke-linejoin:round;stroke-miterlimit:100000"
             id="use67"
             xlink:href="#BitstreamVeraSans-Roman-2212" />
          <use
             height="100%"
             width="100%"
             y="0"
             style="stroke-linecap:butt;stroke-linejoin:round;stroke-miterlimit:100000"
             id="use69"
             xlink:href="#BitstreamVeraSans-Roman-32"
             x="83.789062" />
        </g>
      </g>
    </g>
    <g
       style="stroke-linecap:butt;stroke-linejoin:round;stroke-miterlimit:100000"
       id="xtick_2">
      <g
         style="stroke-linecap:butt;stroke-linejoin:round;stroke-miterlimit:100000"
         id="line2d_3">
        <path
           inkscape:connector-curvature="0"
           id="path75"
           style="fill:none;stroke:#000000;stroke-linecap:square;stroke-linejoin:round;stroke-miterlimit:100000"
           d="m 681.08527,509.25873 8.44377,2.31108" />
      </g>
      <g
         style="stroke-linecap:butt;stroke-linejoin:round;stroke-miterlimit:100000"
         id="text_3">
        <!-- 0 -->
        <defs
           id="defs79">
          <path
             style="stroke-linecap:butt;stroke-linejoin:round;stroke-miterlimit:100000"
             inkscape:connector-curvature="0"
             id="BitstreamVeraSans-Roman-30"
             d="m 31.78125,66.40625 q -7.609375,0 -11.453125,-7.5 Q 16.5,51.421875 16.5,36.375 q 0,-14.984375 3.828125,-22.484375 3.84375,-7.5 11.453125,-7.5 7.671875,0 11.5,7.5 3.84375,7.5 3.84375,22.484375 0,15.046875 -3.84375,22.53125 -3.828125,7.5 -11.5,7.5 m 0,7.8125 q 12.265625,0 18.734375,-9.703125 6.46875,-9.6875 6.46875,-28.140625 0,-18.40625 -6.46875,-28.109375 -6.46875,-9.6875 -18.734375,-9.6875 -12.25,0 -18.71875,9.6875 Q 6.59375,17.96875 6.59375,36.375 q 0,18.453125 6.46875,28.140625 6.46875,9.703125 18.71875,9.703125" />
        </defs>
        <g
           style="stroke-linecap:butt;stroke-linejoin:round;stroke-miterlimit:100000"
           id="g83"
           transform="matrix(0.12,0,0,-0.12,691.42316,531.06626)">
          <use
             height="100%"
             width="100%"
             y="0"
             x="0"
             style="stroke-linecap:butt;stroke-linejoin:round;stroke-miterlimit:100000"
             id="use81"
             xlink:href="#BitstreamVeraSans-Roman-30" />
        </g>
      </g>
    </g>
    <g
       style="stroke-linecap:butt;stroke-linejoin:round;stroke-miterlimit:100000"
       id="xtick_3">
      <g
         style="stroke-linecap:butt;stroke-linejoin:round;stroke-miterlimit:100000"
         id="line2d_4">
        <path
           inkscape:connector-curvature="0"
           id="path87"
           style="fill:none;stroke:#000000;stroke-linecap:square;stroke-linejoin:round;stroke-miterlimit:100000"
           d="m 744.45036,495.92252 8.46915,2.26254" />
      </g>
      <g
         style="stroke-linecap:butt;stroke-linejoin:round;stroke-miterlimit:100000"
         id="text_4">
        <!-- 2 -->
        <g
           style="stroke-linecap:butt;stroke-linejoin:round;stroke-miterlimit:100000"
           id="g92"
           transform="matrix(0.12,0,0,-0.12,754.75271,517.57197)">
          <use
             height="100%"
             width="100%"
             y="0"
             x="0"
             style="stroke-linecap:butt;stroke-linejoin:round;stroke-miterlimit:100000"
             id="use90"
             xlink:href="#BitstreamVeraSans-Roman-32" />
        </g>
      </g>
    </g>
    <g
       style="stroke-linecap:butt;stroke-linejoin:round;stroke-miterlimit:100000"
       id="xtick_4">
      <g
         style="stroke-linecap:butt;stroke-linejoin:round;stroke-miterlimit:100000"
         id="line2d_5">
        <path
           inkscape:connector-curvature="0"
           id="path96"
           style="fill:none;stroke:#000000;stroke-linecap:square;stroke-linejoin:round;stroke-miterlimit:100000"
           d="m 806.49272,482.86471 8.49162,2.21551" />
      </g>
      <g
         style="stroke-linecap:butt;stroke-linejoin:round;stroke-miterlimit:100000"
         id="text_5">
        <!-- 4 -->
        <defs
           id="defs100">
          <path
             style="stroke-linecap:butt;stroke-linejoin:round;stroke-miterlimit:100000"
             inkscape:connector-curvature="0"
             id="BitstreamVeraSans-Roman-34"
             d="M 37.796875,64.3125 12.890625,25.390625 h 24.90625 z m -2.59375,8.59375 h 12.40625 V 25.390625 h 10.40625 V 17.1875 H 47.609375 V 0 h -9.8125 V 17.1875 H 4.890625 v 9.515625 z" />
        </defs>
        <g
           style="stroke-linecap:butt;stroke-linejoin:round;stroke-miterlimit:100000"
           id="g104"
           transform="matrix(0.12,0,0,-0.12,816.75792,504.35987)">
          <use
             height="100%"
             width="100%"
             y="0"
             x="0"
             style="stroke-linecap:butt;stroke-linejoin:round;stroke-miterlimit:100000"
             id="use102"
             xlink:href="#BitstreamVeraSans-Roman-34" />
        </g>
      </g>
    </g>
    <g
       style="stroke-linecap:butt;stroke-linejoin:round;stroke-miterlimit:100000"
       id="xtick_5">
      <g
         style="stroke-linecap:butt;stroke-linejoin:round;stroke-miterlimit:100000"
         id="line2d_6">
        <path
           inkscape:connector-curvature="0"
           id="path108"
           style="fill:none;stroke:#000000;stroke-linecap:square;stroke-linejoin:round;stroke-miterlimit:100000"
           d="m 867.25333,470.07665 8.51136,2.16994" />
      </g>
      <g
         style="stroke-linecap:butt;stroke-linejoin:round;stroke-miterlimit:100000"
         id="text_6">
        <!-- 6 -->
        <defs
           id="defs112">
          <path
             style="stroke-linecap:butt;stroke-linejoin:round;stroke-miterlimit:100000"
             inkscape:connector-curvature="0"
             id="BitstreamVeraSans-Roman-36"
             d="m 33.015625,40.375 q -6.640625,0 -10.53125,-4.546875 -3.875,-4.53125 -3.875,-12.4375 0,-7.859375 3.875,-12.4375 3.890625,-4.5625 10.53125,-4.5625 6.640625,0 10.515625,4.5625 3.875,4.578125 3.875,12.4375 0,7.90625 -3.875,12.4375 Q 39.65625,40.375 33.015625,40.375 M 52.59375,71.296875 V 62.3125 q -3.71875,1.75 -7.5,2.671875 -3.78125,0.9375 -7.5,0.9375 -9.765625,0 -14.921875,-6.59375 -5.140625,-6.59375 -5.875,-19.921875 2.875,4.25 7.21875,6.515625 4.359375,2.265625 9.578125,2.265625 10.984375,0 17.359375,-6.671875 6.375,-6.65625 6.375,-18.125 0,-11.234375 -6.640625,-18.03125 -6.640625,-6.78125 -17.671875,-6.78125 -12.65625,0 -19.34375,9.6875 -6.6875,9.703125 -6.6875,28.109375 0,17.28125 8.203125,27.5625 8.203125,10.28125 22.015625,10.28125 3.71875,0 7.5,-0.734375 3.78125,-0.734375 7.890625,-2.1875" />
        </defs>
        <g
           style="stroke-linecap:butt;stroke-linejoin:round;stroke-miterlimit:100000"
           id="g116"
           transform="matrix(0.12,0,0,-0.12,877.47989,491.4212)">
          <use
             height="100%"
             width="100%"
             y="0"
             x="0"
             style="stroke-linecap:butt;stroke-linejoin:round;stroke-miterlimit:100000"
             id="use114"
             xlink:href="#BitstreamVeraSans-Roman-36" />
        </g>
      </g>
    </g>
    <g
       style="stroke-linecap:butt;stroke-linejoin:round;stroke-miterlimit:100000"
       id="xtick_6">
      <g
         style="stroke-linecap:butt;stroke-linejoin:round;stroke-miterlimit:100000"
         id="line2d_7">
        <path
           inkscape:connector-curvature="0"
           id="path120"
           style="fill:none;stroke:#000000;stroke-linecap:square;stroke-linejoin:round;stroke-miterlimit:100000"
           d="m 926.77152,457.55009 8.52851,2.12576" />
      </g>
      <g
         style="stroke-linecap:butt;stroke-linejoin:round;stroke-miterlimit:100000"
         id="text_7">
        <!-- 8 -->
        <defs
           id="defs124">
          <path
             style="stroke-linecap:butt;stroke-linejoin:round;stroke-miterlimit:100000"
             inkscape:connector-curvature="0"
             id="BitstreamVeraSans-Roman-38"
             d="m 31.78125,34.625 q -7.03125,0 -11.0625,-3.765625 -4.015625,-3.765625 -4.015625,-10.34375 0,-6.59375 4.015625,-10.359375 4.03125,-3.765625 11.0625,-3.765625 7.03125,0 11.078125,3.78125 4.0625,3.796875 4.0625,10.34375 0,6.578125 -4.03125,10.34375 Q 38.875,34.625 31.78125,34.625 m -9.859375,4.1875 Q 15.578125,40.375 12.03125,44.71875 8.5,49.078125 8.5,55.328125 q 0,8.734375 6.21875,13.8125 6.234375,5.078125 17.0625,5.078125 10.890625,0 17.09375,-5.078125 6.203125,-5.078125 6.203125,-13.8125 0,-6.25 -3.546875,-10.609375 Q 48,40.375 41.703125,38.8125 q 7.125,-1.65625 11.09375,-6.5 3.984375,-4.828125 3.984375,-11.796875 0,-10.609375 -6.46875,-16.28125 -6.46875,-5.65625 -18.53125,-5.65625 -12.046875,0 -18.53125,5.65625 -6.46875,5.671875 -6.46875,16.28125 0,6.96875 4,11.796875 4.015625,4.84375 11.140625,6.5 M 18.3125,54.390625 q 0,-5.65625 3.53125,-8.828125 3.546875,-3.171875 9.9375,-3.171875 6.359375,0 9.9375,3.171875 3.59375,3.171875 3.59375,8.828125 0,5.671875 -3.59375,8.84375 -3.578125,3.171875 -9.9375,3.171875 -6.390625,0 -9.9375,-3.171875 Q 18.3125,60.0625 18.3125,54.390625" />
        </defs>
        <g
           style="stroke-linecap:butt;stroke-linejoin:round;stroke-miterlimit:100000"
           id="g128"
           transform="matrix(0.12,0,0,-0.12,936.95806,478.74757)">
          <use
             height="100%"
             width="100%"
             y="0"
             x="0"
             style="stroke-linecap:butt;stroke-linejoin:round;stroke-miterlimit:100000"
             id="use126"
             xlink:href="#BitstreamVeraSans-Roman-38" />
        </g>
      </g>
    </g>
  </g>
  <g
     style="stroke-linecap:butt;stroke-linejoin:round;stroke-miterlimit:100000"
     id="axis3d_2"
     transform="translate(-146.3625,-63.9)">
    <g
       style="stroke-linecap:butt;stroke-linejoin:round;stroke-miterlimit:100000"
       id="line2d_8">
      <path
         inkscape:connector-curvature="0"
         id="path133"
         style="fill:none;stroke:#000000;stroke-width:0.75;stroke-linecap:square;stroke-linejoin:round;stroke-miterlimit:100000"
         d="m 260.33781,438.57073 324.65165,92.29641" />
    </g>
    <g
       style="stroke-linecap:butt;stroke-linejoin:round;stroke-miterlimit:100000"
       id="text_8">
      <!-- y (m) -->
      <defs
         id="defs137">
        <path
           style="stroke-linecap:butt;stroke-linejoin:round;stroke-miterlimit:100000"
           inkscape:connector-curvature="0"
           id="BitstreamVeraSans-Roman-79"
           d="M 32.171875,-5.078125 Q 28.375,-14.84375 24.75,-17.8125 q -3.609375,-2.984375 -9.65625,-2.984375 h -7.1875 v 7.515625 h 5.28125 q 3.703125,0 5.75,1.765625 2.0625,1.75 4.546875,8.296875 L 25.09375,0.875 2.984375,54.6875 H 12.5 L 29.59375,11.921875 46.6875,54.6875 h 9.515625 z" />
      </defs>
      <g
         style="stroke-linecap:butt;stroke-linejoin:round;stroke-miterlimit:100000"
         id="g149"
         transform="matrix(0.11542609,0.03281491,0.03281491,-0.11542609,372.37649,506.16263)">
        <use
           height="100%"
           width="100%"
           y="0"
           x="0"
           style="stroke-linecap:butt;stroke-linejoin:round;stroke-miterlimit:100000"
           id="use139"
           xlink:href="#BitstreamVeraSans-Roman-79" />
        <use
           height="100%"
           width="100%"
           y="0"
           style="stroke-linecap:butt;stroke-linejoin:round;stroke-miterlimit:100000"
           id="use141"
           xlink:href="#BitstreamVeraSans-Roman-20"
           x="59.179688" />
        <use
           height="100%"
           width="100%"
           y="0"
           style="stroke-linecap:butt;stroke-linejoin:round;stroke-miterlimit:100000"
           id="use143"
           xlink:href="#BitstreamVeraSans-Roman-28"
           x="90.966797" />
        <use
           height="100%"
           width="100%"
           y="0"
           style="stroke-linecap:butt;stroke-linejoin:round;stroke-miterlimit:100000"
           id="use145"
           xlink:href="#BitstreamVeraSans-Roman-6d"
           x="129.98047" />
        <use
           height="100%"
           width="100%"
           y="0"
           style="stroke-linecap:butt;stroke-linejoin:round;stroke-miterlimit:100000"
           id="use147"
           xlink:href="#BitstreamVeraSans-Roman-29"
           x="227.39258" />
      </g>
    </g>
    <g
       style="stroke-linecap:butt;stroke-linejoin:round;stroke-miterlimit:100000"
       id="Line3DCollection_2">
      <path
         inkscape:connector-curvature="0"
         id="path152"
         style="fill:none;stroke:#e6e6e6;stroke-linecap:butt;stroke-linejoin:round;stroke-miterlimit:100000"
         d="M 944.8656,173.53266 932.63977,441.57674 550.42638,521.04107" />
      <path
         inkscape:connector-curvature="0"
         id="path154"
         style="fill:none;stroke:#e6e6e6;stroke-linecap:butt;stroke-linejoin:round;stroke-miterlimit:100000"
         d="M 886.46731,162.42709 876.50479,427.78587 495.30318,505.3699" />
      <path
         inkscape:connector-curvature="0"
         id="path156"
         style="fill:none;stroke:#e6e6e6;stroke-linecap:butt;stroke-linejoin:round;stroke-miterlimit:100000"
         d="m 829.44924,151.58399 -7.80038,262.72523 -380.1315,75.76971" />
      <path
         inkscape:connector-curvature="0"
         id="path158"
         style="fill:none;stroke:#e6e6e6;stroke-linecap:butt;stroke-linejoin:round;stroke-miterlimit:100000"
         d="m 773.76301,140.99418 -5.73424,260.142 -379.00794,74.01832" />
      <path
         inkscape:connector-curvature="0"
         id="path160"
         style="fill:none;stroke:#e6e6e6;stroke-linecap:butt;stroke-linejoin:round;stroke-miterlimit:100000"
         d="M 719.36252,130.64886 715.6032,388.25661 337.76778,460.58358" />
      <path
         inkscape:connector-curvature="0"
         id="path162"
         style="fill:none;stroke:#e6e6e6;stroke-linecap:butt;stroke-linejoin:round;stroke-miterlimit:100000"
         d="m 666.20373,120.53969 -1.87104,255.12112 -376.61814,70.69295" />
    </g>
    <g
       style="stroke-linecap:butt;stroke-linejoin:round;stroke-miterlimit:100000"
       id="xtick_7">
      <g
         style="stroke-linecap:butt;stroke-linejoin:round;stroke-miterlimit:100000"
         id="line2d_9">
        <path
           inkscape:connector-curvature="0"
           id="path165"
           style="fill:none;stroke:#000000;stroke-linecap:square;stroke-linejoin:round;stroke-miterlimit:100000"
           d="m 553.68539,520.36351 -9.78744,2.03486" />
      </g>
      <g
         style="stroke-linecap:butt;stroke-linejoin:round;stroke-miterlimit:100000"
         id="text_9">
        <!-- −6 -->
        <g
           style="stroke-linecap:butt;stroke-linejoin:round;stroke-miterlimit:100000"
           id="g172"
           transform="matrix(0.12,0,0,-0.12,528.409,541.76404)">
          <use
             height="100%"
             width="100%"
             y="0"
             x="0"
             style="stroke-linecap:butt;stroke-linejoin:round;stroke-miterlimit:100000"
             id="use168"
             xlink:href="#BitstreamVeraSans-Roman-2212" />
          <use
             height="100%"
             width="100%"
             y="0"
             style="stroke-linecap:butt;stroke-linejoin:round;stroke-miterlimit:100000"
             id="use170"
             xlink:href="#BitstreamVeraSans-Roman-36"
             x="83.789062" />
        </g>
      </g>
    </g>
    <g
       style="stroke-linecap:butt;stroke-linejoin:round;stroke-miterlimit:100000"
       id="xtick_8">
      <g
         style="stroke-linecap:butt;stroke-linejoin:round;stroke-miterlimit:100000"
         id="line2d_10">
        <path
           inkscape:connector-curvature="0"
           id="path176"
           style="fill:none;stroke:#000000;stroke-linecap:square;stroke-linejoin:round;stroke-miterlimit:100000"
           d="m 498.5511,504.70886 -9.754,1.98519" />
      </g>
      <g
         style="stroke-linecap:butt;stroke-linejoin:round;stroke-miterlimit:100000"
         id="text_10">
        <!-- −4 -->
        <g
           style="stroke-linecap:butt;stroke-linejoin:round;stroke-miterlimit:100000"
           id="g183"
           transform="matrix(0.12,0,0,-0.12,473.39956,525.93655)">
          <use
             height="100%"
             width="100%"
             y="0"
             x="0"
             style="stroke-linecap:butt;stroke-linejoin:round;stroke-miterlimit:100000"
             id="use179"
             xlink:href="#BitstreamVeraSans-Roman-2212" />
          <use
             height="100%"
             width="100%"
             y="0"
             style="stroke-linecap:butt;stroke-linejoin:round;stroke-miterlimit:100000"
             id="use181"
             xlink:href="#BitstreamVeraSans-Roman-34"
             x="83.789062" />
        </g>
      </g>
    </g>
    <g
       style="stroke-linecap:butt;stroke-linejoin:round;stroke-miterlimit:100000"
       id="xtick_9">
      <g
         style="stroke-linecap:butt;stroke-linejoin:round;stroke-miterlimit:100000"
         id="line2d_11">
        <path
           inkscape:connector-curvature="0"
           id="path187"
           style="fill:none;stroke:#000000;stroke-linecap:square;stroke-linejoin:round;stroke-miterlimit:100000"
           d="m 444.75377,489.43383 -9.7193,1.9373" />
      </g>
      <g
         style="stroke-linecap:butt;stroke-linejoin:round;stroke-miterlimit:100000"
         id="text_11">
        <!-- −2 -->
        <g
           style="stroke-linecap:butt;stroke-linejoin:round;stroke-miterlimit:100000"
           id="g194"
           transform="matrix(0.12,0,0,-0.12,419.72589,510.49339)">
          <use
             height="100%"
             width="100%"
             y="0"
             x="0"
             style="stroke-linecap:butt;stroke-linejoin:round;stroke-miterlimit:100000"
             id="use190"
             xlink:href="#BitstreamVeraSans-Roman-2212" />
          <use
             height="100%"
             width="100%"
             y="0"
             style="stroke-linecap:butt;stroke-linejoin:round;stroke-miterlimit:100000"
             id="use192"
             xlink:href="#BitstreamVeraSans-Roman-32"
             x="83.789062" />
        </g>
      </g>
    </g>
    <g
       style="stroke-linecap:butt;stroke-linejoin:round;stroke-miterlimit:100000"
       id="xtick_10">
      <g
         style="stroke-linecap:butt;stroke-linejoin:round;stroke-miterlimit:100000"
         id="line2d_12">
        <path
           inkscape:connector-curvature="0"
           id="path198"
           style="fill:none;stroke:#000000;stroke-linecap:square;stroke-linejoin:round;stroke-miterlimit:100000"
           d="m 392.24534,474.52477 -9.68344,1.89112" />
      </g>
      <g
         style="stroke-linecap:butt;stroke-linejoin:round;stroke-miterlimit:100000"
         id="text_12">
        <!-- 0 -->
        <g
           style="stroke-linecap:butt;stroke-linejoin:round;stroke-miterlimit:100000"
           id="g203"
           transform="matrix(0.12,0,0,-0.12,372.36773,495.42073)">
          <use
             height="100%"
             width="100%"
             y="0"
             x="0"
             style="stroke-linecap:butt;stroke-linejoin:round;stroke-miterlimit:100000"
             id="use201"
             xlink:href="#BitstreamVeraSans-Roman-30" />
        </g>
      </g>
    </g>
    <g
       style="stroke-linecap:butt;stroke-linejoin:round;stroke-miterlimit:100000"
       id="xtick_11">
      <g
         style="stroke-linecap:butt;stroke-linejoin:round;stroke-miterlimit:100000"
         id="line2d_13">
        <path
           inkscape:connector-curvature="0"
           id="path207"
           style="fill:none;stroke:#000000;stroke-linecap:square;stroke-linejoin:round;stroke-miterlimit:100000"
           d="m 340.98004,459.96867 -9.64654,1.84659" />
      </g>
      <g
         style="stroke-linecap:butt;stroke-linejoin:round;stroke-miterlimit:100000"
         id="text_13">
        <!-- 2 -->
        <g
           style="stroke-linecap:butt;stroke-linejoin:round;stroke-miterlimit:100000"
           id="g212"
           transform="matrix(0.12,0,0,-0.12,321.22366,480.7054)">
          <use
             height="100%"
             width="100%"
             y="0"
             x="0"
             style="stroke-linecap:butt;stroke-linejoin:round;stroke-miterlimit:100000"
             id="use210"
             xlink:href="#BitstreamVeraSans-Roman-32" />
        </g>
      </g>
    </g>
    <g
       style="stroke-linecap:butt;stroke-linejoin:round;stroke-miterlimit:100000"
       id="xtick_12">
      <g
         style="stroke-linecap:butt;stroke-linejoin:round;stroke-miterlimit:100000"
         id="line2d_14">
        <path
           inkscape:connector-curvature="0"
           id="path216"
           style="fill:none;stroke:#000000;stroke-linecap:square;stroke-linejoin:round;stroke-miterlimit:100000"
           d="m 290.91425,445.75316 -9.60872,1.8036" />
      </g>
      <g
         style="stroke-linecap:butt;stroke-linejoin:round;stroke-miterlimit:100000"
         id="text_14">
        <!-- 4 -->
        <g
           style="stroke-linecap:butt;stroke-linejoin:round;stroke-miterlimit:100000"
           id="g221"
           transform="matrix(0.12,0,0,-0.12,271.27786,466.33484)">
          <use
             height="100%"
             width="100%"
             y="0"
             x="0"
             style="stroke-linecap:butt;stroke-linejoin:round;stroke-miterlimit:100000"
             id="use219"
             xlink:href="#BitstreamVeraSans-Roman-34" />
        </g>
      </g>
    </g>
  </g>
  <g
     style="stroke-linecap:butt;stroke-linejoin:round;stroke-miterlimit:100000"
     id="axis3d_3"
     transform="translate(-146.3625,-63.9)">
    <g
       style="stroke-linecap:butt;stroke-linejoin:round;stroke-miterlimit:100000"
       id="line2d_15">
      <path
         inkscape:connector-curvature="0"
         id="path226"
         style="fill:none;stroke:#000000;stroke-width:0.75;stroke-linecap:square;stroke-linejoin:round;stroke-miterlimit:100000"
         d="m 260.33781,438.57073 -13.4016,-267.4596" />
    </g>
    <g
       style="stroke-linecap:butt;stroke-linejoin:round;stroke-miterlimit:100000"
       id="text_15">
      <!-- z (m) -->
      <defs
         id="defs230">
        <path
           style="stroke-linecap:butt;stroke-linejoin:round;stroke-miterlimit:100000"
           inkscape:connector-curvature="0"
           id="BitstreamVeraSans-Roman-7a"
           d="M 5.515625,54.6875 H 48.1875 V 46.484375 L 14.40625,7.171875 H 48.1875 V 0 H 4.296875 v 8.203125 l 33.796875,39.3125 H 5.515625 Z" />
      </defs>
      <g
         style="stroke-linecap:butt;stroke-linejoin:round;stroke-miterlimit:100000"
         id="g242"
         transform="matrix(0.00600531,0.11984964,0.11984964,-0.00600531,199.48589,291.20686)">
        <use
           height="100%"
           width="100%"
           y="0"
           x="0"
           style="stroke-linecap:butt;stroke-linejoin:round;stroke-miterlimit:100000"
           id="use232"
           xlink:href="#BitstreamVeraSans-Roman-7a" />
        <use
           height="100%"
           width="100%"
           y="0"
           style="stroke-linecap:butt;stroke-linejoin:round;stroke-miterlimit:100000"
           id="use234"
           xlink:href="#BitstreamVeraSans-Roman-20"
           x="52.490234" />
        <use
           height="100%"
           width="100%"
           y="0"
           style="stroke-linecap:butt;stroke-linejoin:round;stroke-miterlimit:100000"
           id="use236"
           xlink:href="#BitstreamVeraSans-Roman-28"
           x="84.277344" />
        <use
           height="100%"
           width="100%"
           y="0"
           style="stroke-linecap:butt;stroke-linejoin:round;stroke-miterlimit:100000"
           id="use238"
           xlink:href="#BitstreamVeraSans-Roman-6d"
           x="123.29102" />
        <use
           height="100%"
           width="100%"
           y="0"
           style="stroke-linecap:butt;stroke-linejoin:round;stroke-miterlimit:100000"
           id="use240"
           xlink:href="#BitstreamVeraSans-Roman-29"
           x="220.70312" />
      </g>
    </g>
    <g
       style="stroke-linecap:butt;stroke-linejoin:round;stroke-miterlimit:100000"
       id="Line3DCollection_3">
      <path
         inkscape:connector-curvature="0"
         id="path245"
         style="fill:none;stroke:#e6e6e6;stroke-linecap:butt;stroke-linejoin:round;stroke-miterlimit:100000"
         d="M 259.38901,419.63514 636.3206,350.7615 968.76092,431.12399" />
      <path
         inkscape:connector-curvature="0"
         id="path247"
         style="fill:none;stroke:#e6e6e6;stroke-linecap:butt;stroke-linejoin:round;stroke-miterlimit:100000"
         d="M 257.27326,377.41058 636.45582,310.6379 970.91838,388.55354" />
      <path
         inkscape:connector-curvature="0"
         id="path249"
         style="fill:none;stroke:#e6e6e6;stroke-linecap:butt;stroke-linejoin:round;stroke-miterlimit:100000"
         d="m 255.132,334.67676 381.46057,-64.61769 336.50955,75.4055" />
      <path
         inkscape:connector-curvature="0"
         id="path251"
         style="fill:none;stroke:#e6e6e6;stroke-linecap:butt;stroke-linejoin:round;stroke-miterlimit:100000"
         d="m 252.96475,291.42439 383.76614,-62.40717 338.58173,72.83032" />
      <path
         inkscape:connector-curvature="0"
         id="path253"
         style="fill:none;stroke:#e6e6e6;stroke-linecap:butt;stroke-linejoin:round;stroke-miterlimit:100000"
         d="M 250.77104,247.644 636.87079,187.50437 977.55037,257.6927" />
      <path
         inkscape:connector-curvature="0"
         id="path255"
         style="fill:none;stroke:#e6e6e6;stroke-linecap:butt;stroke-linejoin:round;stroke-miterlimit:100000"
         d="m 248.55039,203.32585 388.46192,-57.81348 342.80358,67.47765" />
    </g>
    <g
       style="stroke-linecap:butt;stroke-linejoin:round;stroke-miterlimit:100000"
       id="xtick_13">
      <g
         style="stroke-linecap:butt;stroke-linejoin:round;stroke-miterlimit:100000"
         id="line2d_16">
        <path
           inkscape:connector-curvature="0"
           id="path258"
           style="fill:none;stroke:#000000;stroke-linecap:square;stroke-linejoin:round;stroke-miterlimit:100000"
           d="m 262.59066,419.05013 -9.61454,1.75678" />
      </g>
      <g
         style="stroke-linecap:butt;stroke-linejoin:round;stroke-miterlimit:100000"
         id="text_16">
        <!-- −6 -->
        <g
           style="stroke-linecap:butt;stroke-linejoin:round;stroke-miterlimit:100000"
           id="g265"
           transform="matrix(0.12,0,0,-0.12,227.73246,428.38382)">
          <use
             height="100%"
             width="100%"
             y="0"
             x="0"
             style="stroke-linecap:butt;stroke-linejoin:round;stroke-miterlimit:100000"
             id="use261"
             xlink:href="#BitstreamVeraSans-Roman-2212" />
          <use
             height="100%"
             width="100%"
             y="0"
             style="stroke-linecap:butt;stroke-linejoin:round;stroke-miterlimit:100000"
             id="use263"
             xlink:href="#BitstreamVeraSans-Roman-36"
             x="83.789062" />
        </g>
      </g>
    </g>
    <g
       style="stroke-linecap:butt;stroke-linejoin:round;stroke-miterlimit:100000"
       id="xtick_14">
      <g
         style="stroke-linecap:butt;stroke-linejoin:round;stroke-miterlimit:100000"
         id="line2d_17">
        <path
           inkscape:connector-curvature="0"
           id="path269"
           style="fill:none;stroke:#000000;stroke-linecap:square;stroke-linejoin:round;stroke-miterlimit:100000"
           d="m 260.49516,376.84321 -9.67539,1.70381" />
      </g>
      <g
         style="stroke-linecap:butt;stroke-linejoin:round;stroke-miterlimit:100000"
         id="text_17">
        <!-- −4 -->
        <g
           style="stroke-linecap:butt;stroke-linejoin:round;stroke-miterlimit:100000"
           id="g276"
           transform="matrix(0.12,0,0,-0.12,225.48069,386.1704)">
          <use
             height="100%"
             width="100%"
             y="0"
             x="0"
             style="stroke-linecap:butt;stroke-linejoin:round;stroke-miterlimit:100000"
             id="use272"
             xlink:href="#BitstreamVeraSans-Roman-2212" />
          <use
             height="100%"
             width="100%"
             y="0"
             style="stroke-linecap:butt;stroke-linejoin:round;stroke-miterlimit:100000"
             id="use274"
             xlink:href="#BitstreamVeraSans-Roman-34"
             x="83.789062" />
        </g>
      </g>
    </g>
    <g
       style="stroke-linecap:butt;stroke-linejoin:round;stroke-miterlimit:100000"
       id="xtick_15">
      <g
         style="stroke-linecap:butt;stroke-linejoin:round;stroke-miterlimit:100000"
         id="line2d_18">
        <path
           inkscape:connector-curvature="0"
           id="path280"
           style="fill:none;stroke:#000000;stroke-linecap:square;stroke-linejoin:round;stroke-miterlimit:100000"
           d="m 258.37439,334.12751 -9.73701,1.6494" />
      </g>
      <g
         style="stroke-linecap:butt;stroke-linejoin:round;stroke-miterlimit:100000"
         id="text_18">
        <!-- −2 -->
        <g
           style="stroke-linecap:butt;stroke-linejoin:round;stroke-miterlimit:100000"
           id="g287"
           transform="matrix(0.12,0,0,-0.12,223.20177,343.44802)">
          <use
             height="100%"
             width="100%"
             y="0"
             x="0"
             style="stroke-linecap:butt;stroke-linejoin:round;stroke-miterlimit:100000"
             id="use283"
             xlink:href="#BitstreamVeraSans-Roman-2212" />
          <use
             height="100%"
             width="100%"
             y="0"
             style="stroke-linecap:butt;stroke-linejoin:round;stroke-miterlimit:100000"
             id="use285"
             xlink:href="#BitstreamVeraSans-Roman-32"
             x="83.789062" />
        </g>
      </g>
    </g>
    <g
       style="stroke-linecap:butt;stroke-linejoin:round;stroke-miterlimit:100000"
       id="xtick_16">
      <g
         style="stroke-linecap:butt;stroke-linejoin:round;stroke-miterlimit:100000"
         id="line2d_19">
        <path
           inkscape:connector-curvature="0"
           id="path291"
           style="fill:none;stroke:#000000;stroke-linecap:square;stroke-linejoin:round;stroke-miterlimit:100000"
           d="m 256.22791,290.89375 -9.79942,1.59356" />
      </g>
      <g
         style="stroke-linecap:butt;stroke-linejoin:round;stroke-miterlimit:100000"
         id="text_19">
        <!-- 0 -->
        <g
           style="stroke-linecap:butt;stroke-linejoin:round;stroke-miterlimit:100000"
           id="g296"
           transform="matrix(0.12,0,0,-0.12,225.92302,300.2074)">
          <use
             height="100%"
             width="100%"
             y="0"
             x="0"
             style="stroke-linecap:butt;stroke-linejoin:round;stroke-miterlimit:100000"
             id="use294"
             xlink:href="#BitstreamVeraSans-Roman-30" />
        </g>
      </g>
    </g>
    <g
       style="stroke-linecap:butt;stroke-linejoin:round;stroke-miterlimit:100000"
       id="xtick_17">
      <g
         style="stroke-linecap:butt;stroke-linejoin:round;stroke-miterlimit:100000"
         id="line2d_20">
        <path
           inkscape:connector-curvature="0"
           id="path300"
           style="fill:none;stroke:#000000;stroke-linecap:square;stroke-linejoin:round;stroke-miterlimit:100000"
           d="m 254.05523,247.13245 -9.86262,1.53622" />
      </g>
      <g
         style="stroke-linecap:butt;stroke-linejoin:round;stroke-miterlimit:100000"
         id="text_20">
        <!-- 2 -->
        <g
           style="stroke-linecap:butt;stroke-linejoin:round;stroke-miterlimit:100000"
           id="g305"
           transform="matrix(0.12,0,0,-0.12,223.5883,256.43907)">
          <use
             height="100%"
             width="100%"
             y="0"
             x="0"
             style="stroke-linecap:butt;stroke-linejoin:round;stroke-miterlimit:100000"
             id="use303"
             xlink:href="#BitstreamVeraSans-Roman-32" />
        </g>
      </g>
    </g>
    <g
       style="stroke-linecap:butt;stroke-linejoin:round;stroke-miterlimit:100000"
       id="xtick_18">
      <g
         style="stroke-linecap:butt;stroke-linejoin:round;stroke-miterlimit:100000"
         id="line2d_21">
        <path
           inkscape:connector-curvature="0"
           id="path309"
           style="fill:none;stroke:#000000;stroke-linecap:square;stroke-linejoin:round;stroke-miterlimit:100000"
           d="m 251.85588,202.83391 -9.92665,1.47735" />
      </g>
      <g
         style="stroke-linecap:butt;stroke-linejoin:round;stroke-miterlimit:100000"
         id="text_21">
        <!-- 4 -->
        <g
           style="stroke-linecap:butt;stroke-linejoin:round;stroke-miterlimit:100000"
           id="g314"
           transform="matrix(0.12,0,0,-0.12,221.22492,212.13331)">
          <use
             height="100%"
             width="100%"
             y="0"
             x="0"
             style="stroke-linecap:butt;stroke-linejoin:round;stroke-miterlimit:100000"
             id="use312"
             xlink:href="#BitstreamVeraSans-Roman-34" />
        </g>
      </g>
    </g>
  </g>
  <g
     style="stroke-linecap:butt;stroke-linejoin:round;stroke-miterlimit:100000"
     id="axes_1"
     transform="translate(-146.3625,-63.9)">
    <g
       style="stroke-linecap:butt;stroke-linejoin:round;stroke-miterlimit:100000"
       id="line2d_22">
      <path
         inkscape:connector-curvature="0"
         id="path319"
         style="fill:none;stroke:#ff0000;stroke-linecap:square;stroke-linejoin:round;stroke-miterlimit:100000"
         d="m 402.71858,312.1268 0.16044,-2.53383 0.12329,-3.48996 -0.006,-0.83493 -0.008,-0.063 0.002,0.0542 v 0 l -0.0401,2.59781 -0.0352,1.76024 -0.13401,1.19742 0.21935,0.22478 -0.52341,3.39879 -0.0621,0.0589 -0.0275,-0.11044 -0.0428,-1.34873 0.13558,-2.09132 0.48188,-3.50122 0.35818,-1.9592 0.12765,-0.8627 0.0361,0.44476 0.0583,1.67532 0.0185,3.57147 -0.10886,0.90634 0.16151,0.21286 -0.35288,3.04327 -0.22924,0.4128 -0.0689,-0.0247 -0.0148,-0.0549 0.008,-0.61401 0.221,-1.99714 0.65074,-3.7107 0.20116,-1.80408 -0.0161,-0.51395 -0.0304,-1.37175 -0.10393,-0.7111 0.054,0.7136 v 0 l 0.33719,3.50225 -0.0668,0.58186 0.15624,0.21312 -0.34008,1.13004 -0.4939,0.78418 -0.41995,0.24501 -0.37759,0.009 -0.56778,-0.091 -0.53631,0.0806 0.51807,-0.0892 v 0 l 1.34168,-0.0211 3.67186,0.32203 4.50015,0.46464 2.6446,0.66812 0.39396,0.13672 -0.40616,-0.0511 v 0 l -1.51945,-0.26587 -3.4183,-0.4656 -8.75539,-1.39376 -4.71577,-0.4759 -4.01826,-0.32161 3.76821,0.41372 9.16796,1.38044 2.07771,0.49581 1.81881,0.38979 1.24488,-0.0855 3.1301,-0.17457 0.81386,-0.25721 0.51237,-0.37929 0.0988,-0.29383 -0.17539,-0.23156 -0.58711,-0.2751 -1.11406,-0.24387 -2.63136,-0.31039 -4.46179,-0.28094 -3.39235,-0.0813 -2.28132,0.13586 -1.67474,0.29772 -1.30579,0.45505 -0.59815,0.42749 -0.15706,0.36597 0.0962,0.27826 0.34412,0.33523 0.59801,0.28937 1.23464,0.36974 2.00858,0.35706 3.34146,0.35238 3.7503,0.12775 3.45187,-0.0811 2.5316,-0.28731 0.91544,-0.29987 0.0885,-0.19386 -0.17329,-0.17208 -0.72107,-0.2945 -1.72123,-0.39103 -2.96713,-0.40962 -3.84541,-0.31512 -2.92054,-0.0173 -1.31505,0.16487 -0.47155,0.23127 -0.0682,0.24244 0.15991,0.28046 0.50095,0.37154 1.39408,0.76222 2.11721,1.20202 -0.0571,0.16732 -0.29047,0.0989 -0.91863,0.0158 -3.65621,-0.32034 -5.01612,-0.36767 0.91204,-0.10597 4.57459,-0.51687 2.82005,-0.58037 3.59522,-0.972 0.92765,-0.41542 0.026,-0.14109 -0.0257,-0.0201 -0.36174,-0.0983 -1.13175,-0.0194 -1.71737,0.22706 -1.86562,0.46262 -1.1301,0.46496 -0.66924,0.4846 -0.23404,0.39691 0.0832,0.303 0.3196,0.24618 0.61293,0.17075 1.43619,0.13808 1.7274,0.27195 1.37045,0.44625 1.37622,0.49436 0.76725,0.20523 0.42413,0.3567 0.22824,0.18724 -0.005,-0.0202 6e-4,-4.6e-4 v 0 0 l -0.0179,0.007 0.0207,-0.004 v 0 l 0.008,6.7e-4 -0.007,-0.002 v 0 l -0.0232,6.5e-4 0.021,-0.006 v 0 l 0.0294,-0.01 -0.0305,0.003 v 0 l -0.0256,0.0193 0.0297,-0.0113 v 0 l 0.0239,-0.003 -0.0172,0.0139 v 0 l -0.009,0.004 0.008,-0.006 v 0 l 0.27648,0.17003 0.7642,0.42585 0.18061,-0.0972 0.0164,-0.32718 -0.12832,-1.22027 0.12048,0.22973 0.0813,-0.14326 0.12889,-0.61618 0.1842,-2.11855 0.27088,-3.62758 0.27726,-0.26923 0.57783,-0.18319 0.55083,0.0752 0.3636,0.34707 0.30912,0.6597 0.24554,0.33459 0.15047,-0.15101 0.62876,-1.16398 0.20768,0.19594 0.58705,0.58583 0.46894,0.2239 0.45461,-0.0422 0.64729,-0.35432 0.82533,-0.67549 1.19089,-0.97129 0.91528,-0.41628 1.0207,-0.16938 1.06938,0.0639 2.04278,0.15585 1.20562,-0.17155 2.20325,-0.40158 2.22745,-0.17928 1.76748,0.0448 1.6769,0.26116 2.90797,0.72518 3.84961,0.94548 2.37863,0.36339 2.06008,0.10698 3.14875,-0.10304 4.33324,-0.41968 2.55117,-0.43741 5.72533,-1.02017 3.48373,-0.3496 3.98934,-0.12362 5.72039,0.0522 2.97696,0.24013 6.9481,0.72664 2.39847,-0.0837 3.50637,-0.30797 4.94253,-0.4033 2.08158,0.16264 5.09765,0.55641 2.08272,-0.16353 7.44372,-0.80257 3.52082,0.0999 2.73021,0.043 2.38688,-0.18427 2.84125,-0.46984 3.36333,-0.51759 4.47613,-0.66972 9.77855,-1.72841 4.39478,-0.3483 3.33675,-0.34728 2.94379,-0.51987 4.60983,-0.94083 9.09554,-1.45365 4.61808,-1.25847 3.65101,-1.32485 3.59735,-1.28114 4.16813,-1.23511 3.70545,-1.20493 4.78415,-1.80862 3.19755,-1.09832 3.81609,-1.03903 3.44776,-0.68417 3.07044,-0.36565 2.11887,-0.0974 3.57753,0.0296 1.26329,-0.40616 1.50865,-0.69133 1.92136,-1.27065 1.51646,-1.2794 1.04346,-0.69638 0.90586,-0.36056 1.40362,-0.25058 1.15362,-0.0222 1.47975,0.25136 1.5334,0.12976 1.29197,-0.13274 1.79964,-0.39493 2.9523,-0.99304 3.27837,-1.17048 1.65694,-0.33361 1.7759,-0.12518 3.11857,0.10339 5.05334,0.40284 4.36267,0.35896 3.91966,0.054 3.5563,-0.22832 2.98199,-0.47824 6.64565,-1.33912 2.56248,-0.16437 2.24031,0.022 2.61862,-0.0462 2.06439,-0.29255 2.20676,-0.21017 2.00819,0.0391 2.65651,0.36339 1.93632,0.2 1.89178,-0.2579 1.54128,-0.50106 3.65786,-1.3312 1.0646,-0.0508 0.871,0.14773 1.37299,0.67005 0.75664,0.29163 0.81479,0.0799 0.92771,-0.15096 1.24475,-0.1891 1.11234,0.0566 1.34783,0.047 1.39179,-0.24946 1.53925,-0.48471 3.17913,-1.15206 2.21173,-0.49498 4.26548,-0.64896 1.94943,-0.1154 2.29909,0.0771 2.46493,0.32223 2.37484,0.51584 3.05816,0.90386 4.68561,1.45779 2.49019,0.5798 1.65685,0.23409 2.47294,0.0683 4.29138,-0.16643 5.01816,-0.0571 4.82128,-0.10568 3.15791,-0.33373 2.86688,-0.53912 3.87896,-0.95219 7.03389,-1.73215 4.45757,-0.80107 11.85433,-1.68342 3.78195,-0.90786 6.95033,-1.72092 4.21421,-0.72332 4.00784,-0.49397 3.75305,-0.23734 6.28085,-0.37439 3.80172,-0.20837 2.3498,0.0947 2.42485,0.33056 3.33671,0.69937 2.70673,0.79182 2.6401,0.9958 3.74462,1.39629 2.80031,0.78675 1.78349,0.21403 1.63172,-0.0284 1.96451,-0.24435 2.21761,-0.46858 2.42446,-0.72265 1.85827,-0.7822 5.58503,-2.71326 1.25775,-0.28922 1.00211,-0.0236 0.72642,0.18013 0.67503,0.38512 0.59498,0.57882 0.2625,0.62778 0.21374,1.08926 0.0502,1.24995 -0.30399,-0.0216 -1.55678,-0.35865 -0.86597,0.16477 -1.35594,0.48929 -1.9609,0.96232 -8.72684,4.83175 -2.29669,0.94334 -1.56951,0.38734 -0.57917,0.209 -0.25762,0.34157 -0.98951,1.63702 -0.43259,0.0452 -0.61106,0.0614 -0.93019,0.39796 -3.24352,1.55333 -1.30194,0.1895 -1.33961,-0.0282 -4.63813,-0.2381 -1.75797,0.29633 -3.11464,0.81527 -2.97854,0.67073 -1.73718,0.15243 -4.47576,0.35342 -1.86507,0.43751 -3.0374,1.00682 -2.66556,0.75943 -2.38249,0.47152 -2.18818,0.21094 -2.48588,0.0397 -3.14874,-0.19426 -4.54202,-0.27392 -1.95541,0.0712 -2.88916,0.31457 -3.56033,0.60105 -2.86946,0.40726 -4.39686,0.30357 -4.5541,0.33489 -4.7011,0.59017 -4.63874,0.81464 -5.04666,0.86289 -3.99559,0.44329 -9.52599,0.98252 -5.17385,0.86363 -4.8715,1.03266 -3.8946,1.05398 -3.58175,1.18183 -3.41912,1.36906 -3.43503,1.36418 -3.40027,0.99414 -3.88015,0.93567 -2.17868,0.79543 -2.05575,0.97374 -1.98983,1.17875 -1.40353,1.05613 -1.57511,1.4758 -0.42215,0.58962 -0.13131,0.57219 0.0691,0.79818 0.34906,1.21558 0.54207,1.11549 1.04904,1.46996 1.32309,1.49977 1.1932,1.02181 0.95269,0.56603 1.14716,0.41277 1.08972,0.14085 0.98566,-0.0919 0.87732,-0.29224 0.65344,-0.46111 0.48382,-0.61748 0.94985,-1.28439 0.69672,-0.19476 0.64796,0.0135 0.31101,0.19485 0.37752,0.59561 -0.1363,0.26684 -0.15705,0.54833 0.0664,0.55225 0.32877,0.68282 0.68537,0.82007 0.85582,0.70133 1.04137,0.56625 1.36788,0.4834 2.02046,0.45724 2.54299,0.30821 2.70223,0.11748 4.39342,0.19642 2.69977,0.40728 9.42455,1.63448 4.16432,0.3783 4.54579,0.0809 3.07198,-0.13366 3.71041,-0.38052 16.5659,-2.16167 6.42671,-1.10376 4.68364,-0.74169 4.12937,-0.41155 4.16631,-0.21751 4.58276,-0.27084 2.23078,-0.37509 2.92629,-0.71747 2.59696,-0.604 2.179,-0.31804 2.40868,-0.13735 2.98947,0.0928 7.61732,0.51442 3.41686,-0.28118 2.34529,-0.14178 1.77351,0.0815 2.33976,0.35311 3.12701,0.69423 11.59838,2.76371 2.70212,0.23664 3.10869,-3.7e-4 1.7528,-0.0884 5.4885,-0.1266 5.62534,0.16658 4.17606,0.0828 2.45898,-0.17824 1.94842,-0.3628 2.16343,-0.64678 1.18374,-0.55966 0.85753,-0.64284 0.49279,-0.62429 0.11796,-0.46269 -0.13873,-0.29068 -0.39664,-0.27514 -1.10675,-0.42912 -2.19767,-0.59989 -3.3964,-0.74167 -3.53768,-0.55045 -4.88205,-0.49594 -15.36282,-1.24987 -7.18652,-0.39703 -12.10673,-0.43042 -11.1727,-0.20368 -10.06968,0.0387 -13.17591,0.0796 -5.37017,-0.23039 -4.23959,-0.4622 -5.68286,-0.66302 -1.2099,0.0394 -0.86781,0.28261 -0.81662,0.50989 -3.5735,2.54459 -0.4119,0.14384 0.41423,-0.11119 v 0 l 1.47798,-0.006 3.59023,0.11795 2.68827,-0.1219 3.51458,-0.2624 3.29254,-0.0254 2.87294,0.19005 2.14625,0.32483 2.31939,0.60079 1.8778,0.67643 2.58991,0.97511 1.95146,0.50977 2.75988,0.41893 2.83334,0.2091 3.50853,0.0424 3.35668,-0.18935 6.4695,-0.35409 9.64972,-0.2687 3.94184,0.12604 3.76144,0.38777 10.11216,1.29512 2.54885,-0.0608 2.77416,-0.31884 3.78321,-0.69805 5.64279,-1.20462 2.23824,-0.13931 2.6378,0.0784 4.65302,0.16913 2.01856,-0.16405 2.07959,-0.37041 1.81861,-0.57334 1.41576,-0.71514 2.43959,-1.41051 1.24633,-0.35699 4.08047,-0.91616 1.393,-0.6303 1.89834,-0.85342 1.54881,-0.46691 0.80073,-0.31192 0.002,-0.0545 -0.0645,-0.0312 -0.90477,-0.47201 -0.50644,-0.6038 -0.28807,-0.66105 -0.1796,-1.01436 -0.23056,-1.29651 -0.31362,-0.82508 -0.46816,-0.58053 -0.74751,-0.55733 -0.88404,-0.36068 -1.36392,-0.30701 -2.07778,-0.22353 -2.70859,-0.10004 -5.79183,0.0481 -3.16691,0.24927 -9.43834,0.9704 -3.59519,-0.009 -8.15552,-0.0818 -7.44235,0.14719 -4.19882,-0.26109 -5.28974,-0.31616 -6.07466,0.0143 -4.78025,0.18602 -4.68012,0.17488 -4.66389,-0.0426 -6.01984,-0.0928 -4.52834,0.2321 -4.96358,0.47732 -5.09114,0.71685 -8.89569,1.4707 -4.12378,0.35834 -2.9391,0.0194 -4.87998,-0.23213 -4.75996,-0.31348 -3.47525,0.0132 -3.35271,0.2129 -3.20057,0.43364 -2.66282,0.57777 -6.48002,1.56689 -4.23516,0.54693 -7.07952,0.63452 -3.32918,0.58074 -4.91211,1.1309 -6.50513,1.5183 -3.71204,0.5229 -3.19991,0.2618 -4.63869,0.32979 -3.15375,0.44663 -5.76611,0.87233 -3.1325,0.15247 -8.02478,0.11687 -2.65664,0.43523 -2.40463,0.65084 -2.21014,0.85369 -2.09267,1.03884 -2.07797,1.24202 -1.46584,0.90317 -1.93209,0.97651 -7.36244,3.36646 -3.28628,1.61458 -1.92922,0.72258 -2.24569,0.61592 -2.76848,0.49689 -2.52714,0.23987 -2.24212,0.003 -2.39852,-0.24962 -2.64681,-0.53052 -9.06271,-2.31993 -0.70913,-0.34237 -0.66639,-0.58113 -0.72005,-0.90048 -0.94545,-1.5072 -0.068,-0.43548 0.29971,-0.0349 2.56275,-0.23457 5.38712,-0.46721 4.46106,-0.45215 4.84417,-0.8002 4.89113,-0.88411 3.79384,-0.46875 4.06485,-0.34359 3.10746,-0.26556 3.55429,-0.53158 3.69419,-0.82293 3.16637,-0.92316 2.97476,-1.12486 3.63947,-1.19009 3.24439,-1.14528 4.5973,-1.79942 3.97009,-1.35553 0.98092,-0.44906 2.09869,-0.95069 1.30332,-0.81951 0.90472,-0.33236 0.91032,-0.0824 2.71154,0.23936 1.21275,-0.33401 3.61627,-1.20983 0.82371,0.0789 0.77053,0.30827 0.68265,0.45446 0.60606,0.74994 -0.10584,0.334 -0.28582,0.0907 -1.07881,-0.10471 -2.17479,-0.55251 -4.36424,-1.34621 -2.11022,-0.26873 -2.39653,-0.0784 -2.56106,0.11223 -2.76799,0.32643 -3.2714,0.575 -3.78206,0.84063 -6.98403,1.66677 -2.40123,0.17143 -2.14629,-0.0312 -4.31739,-0.25587 -0.62557,0.26114 -0.75757,0.55082 -0.63299,0.87683 -0.10816,0.29438 -0.18517,1.05524 0.0779,0.9326 0.31513,1.4727 0.6006,2.71325 0.55129,2.05927 0.44045,0.22343 0.72295,0.0873 3.33134,0.21413 1.32924,0.52944 1.1279,0.65266 1.33448,1.03025 1.96825,2.01429 4.76349,4.99653 1.36024,0.89566 1.26261,0.61393 1.74357,0.5964 3.87831,0.94749 2.09606,0.32676 1.90047,0.0808 2.72592,0.23196 2.06474,0.39448 1.54354,0.48663 4.3352,1.54938 1.73613,0.24914 4.67665,0.42138 4.73872,0.81732 3.87875,0.64868 4.05384,0.45928 4.01918,0.19702 12.01042,0.43984 6.36571,0.30567 3.85504,-0.0505 7.72006,-0.23396 3.51773,0.21013 5.80489,0.64717 3.3599,0.25603 3.67815,0.0954 3.74993,-0.1466 4.46568,-0.33062 5.31892,-0.58055 7.60504,-1.00194 3.53365,-0.71917 3.58477,-0.9386 8.53231,-2.35317 3.41355,-0.57516 3.26043,-0.34429 3.89421,-0.18354 5.31403,0.0234 6.98446,0.27287 9.17477,0.32462 4.80736,0.14938 4.64125,0.33201 5.67213,0.44199 3.84128,0.0353 2.89664,-0.17964 3.56521,-0.49895 3.79114,-0.46969 3.86479,-0.20587 2.94703,-0.25143 1.92161,-0.38924 2.90132,-0.87398 2.1334,-0.48481 2.32121,-0.32475 1.76978,-0.012 1.5263,0.20963 1.96381,0.22096 1.28265,-0.0852 1.47784,-0.40659 0.76078,-0.40632 0.58149,-0.60552 0.27766,-0.64331 0.0321,-0.47095 -0.21504,-0.49823 -0.49486,-0.52427 -1.11737,-0.79889 -6.86211,-4.24987 -4.32623,-2.49828 -2.08914,-0.9082 -2.11437,-0.70266 -2.91306,-0.70609 -10.06363,-2.06942 -2.54118,-0.69783 -9.62672,-2.89991 -3.95721,-0.90876 -3.8693,-0.67162 -3.46158,-0.38849 -4.53902,-0.27062 -4.36601,-0.0366 -3.33818,0.19312 -5.03467,0.52139 -3.32304,0.23877 -2.4644,-0.047 -2.14851,-0.27973 -1.94244,-0.47955 -5.46942,-1.5661 -1.17841,-0.0168 -1.12829,0.20095 -1.20069,0.14545 -3.21171,-0.14113 -1.69365,-0.0234 -1.5299,0.20629 -1.51466,0.41998 -1.96149,0.74766 -2.80526,1.0681 -1.99299,0.46655 -2.31716,0.27595 -5.3414,0.6117 -3.10244,0.69954 -2.92767,0.57891 -2.44558,0.24089 -2.98442,0.0547 -5.08144,0.12551 -3.8992,0.40975 -3.48985,0.52049 -5.07278,0.99579 -2.94677,0.81352 -3.58214,0.96331 -2.79508,0.44188 -2.58985,0.155 -2.95937,0.26041 -2.61256,0.47165 -2.33601,0.62714 -3.34065,0.833 -2.46161,0.36188 -4.57241,0.52109 -2.54051,0.61835 -2.54754,0.83976 -3.42604,1.17499 -1.66894,0.28511 -2.28214,0.33029 -0.93419,0.40791 -1.64072,0.87762 -1.25305,0.42883 -0.72992,0.60741 -1.71614,1.47878 -0.78712,0.20921 -1.47102,0.35883 -1.36035,0.65572 -2.12767,1.03123 -1.13966,0.20357 -1.10653,0.0199 -2.03542,0.0918 -1.75153,0.37134 -1.31061,0.23689 -3.5173,0.11855 -1.72039,0.19207 -1.94826,0.47083 -1.68186,0.63261 -2.22865,0.92354 -1.32315,0.2239 -1.1081,-0.0613 -1.1631,-0.26943 -1.1541,-0.44794 -1.39501,-0.77642 -1.5215,-1.15067 -2.55495,-1.93924 -1.22992,-0.61956 -0.87869,-0.25546 -1.15043,-0.0572 -0.96053,0.20195 -0.90478,0.47246 -0.7997,0.33811 -0.58132,-0.007 -0.62696,-0.21831 -0.62849,-0.40554 -0.40841,-0.63085 -0.5779,-1.08974 -0.53562,-0.73725 -0.71035,-0.49052 -1.49137,-0.64752 -1.64692,-0.82546 -3.74716,-2.22483 -1.84617,-0.68144 -1.90285,-0.46599 -2.22415,-0.29711 -2.03261,-0.0923 -5.25189,0.11513 -5.02764,-0.27495 -2.7425,0.19265 -6.88169,0.63328 -3.02124,-0.11449 -4.3066,-0.12245 -4.10404,0.20404 -3.71726,0.40274 -3.51759,0.60376 -2.55103,0.38751 -2.18425,0.09 -1.34389,-0.13753 -2.2326,-0.54218 -5.12414,-1.40463 -0.84473,0.0652 -1.12668,0.35017 -0.48173,0.34952 -0.44094,0.61935 -0.58401,1.30283 -0.30749,1.11999 -0.44327,1.22357 -0.33841,0.34965 -0.51474,0.17921 -0.87604,0.0461 -4.48074,0.0147 -1.88828,0.11065 -2.54305,-0.12602 -3.92971,-0.46225 -5.24762,-0.77076 -3.10378,-0.14318 -4.04111,0.0986 -5.29161,0.17426 -3.30942,-0.19907 -7.07138,-0.68294 -3.08388,0.0191 -2.86695,0.22052 -4.50862,0.57258 -1.50647,0.0969 -1.58722,-0.0842 -1.29663,-0.29787 -1.29686,-0.42324 -4.8772,-1.86753 -2.65266,-0.83686 -4.18542,-1.91455 -1.54447,-0.24444 -1.87134,-0.0885 -2.59812,0.0527 -3.46227,0.24417 -5.54773,0.57913 -1.91623,-0.14802 -2.13387,-0.37022 -1.31591,-0.42314 -1.19508,-0.61773 -1.00447,-0.8323 -1.31747,-1.48345 -1.35317,-1.61793 0.0215,-0.011 0.22213,0.034 0.62467,0.34913 1.91257,1.3459 2.7921,1.9765 1.20244,0.43906 1.37981,0.43427 1.227,0.6902 1.15993,0.93315 1.17256,1.25306 3.25539,5.25824 0.39465,1.21133 0.15092,1.30041 -0.0879,1.3928 -0.23968,2.94743 0.18643,0.545 0.86865,2.09102 0.43516,0.88164 0.46643,0.41479 0.42861,0.1802 0.93875,0.10623 1.17487,0.14966 0.70063,0.40536 0.55452,0.61616 0.65059,1.06548 0.60062,0.87444 0.55373,0.50711 0.82898,0.3937 1.19856,0.23895 2.20454,0.39144 3.3447,0.8525 2.78794,0.91644 2.78045,1.14957 2.41413,1.20499 2.06395,1.31156 1.83658,1.42748 1.93082,1.78553 1.98272,2.11181 1.81143,2.24083 3.39002,4.45782 1.19136,1.14466 1.24788,0.97562 0.76538,0.4206 1.50051,0.64542 1.69492,0.50604 1.28065,0.10461 1.13111,-0.19998 0.55657,-0.34667 0.31829,-0.43908 0.15862,-0.668 0.008,-0.77747 -0.24268,-0.53428 -0.42725,-0.33794 -0.73751,-0.27917 -2.08088,-0.62494 0.0796,-0.28052 0.18861,-0.34519 0.71047,-1.14101 1.2048,-2.97909 1.08516,-3.94231 0.49029,-0.95943 0.60896,-0.62611 1.2393,-1.14874 0.83514,-1.27151 0.89066,-1.23627 0.75525,-0.68696 1.12549,-0.7098 1.39115,-0.76671 0.93914,-0.89659 1.62461,-1.99773 -0.0418,-0.18127 -0.39423,-0.1425 -1.20057,-0.56007 -1.13289,-0.95232 -1.57443,-1.73211 -4.56688,-5.64824 -2.76871,-3.09501 -1.59568,-2.30779 -1.45034,-2.24794 -0.11671,-0.59947 0.12549,-0.91639 0.87733,-3.49971 0.0622,-2.16819 -0.14164,-0.56427 -0.25849,-0.16826 -0.41102,0.0183 -0.90122,0.14463 -0.75181,-0.12311 -2.72193,-0.64642 -1.67254,-0.0881 -2.72936,-0.679 -3.35451,-0.93235 -2.24869,-0.30351 -2.94874,-0.18123 -3.12581,0.0225 -9.64766,0.23271 -3.32566,-0.26403 -7.81371,-0.79785 -4.0681,-0.1146 -5.86361,-0.0771 -3.43576,-0.30341 -6.63006,-0.67834 -3.5984,-0.13044 -10.87913,-0.10821 -3.88177,-0.302 -4.59051,-0.309 -4.43845,-0.05 -3.79971,0.18685 -8.01229,0.46941 -4.21816,-0.0622 -2.60646,-0.20815 -2.88591,-0.45668 -3.78874,-0.86293 -4.90001,-1.05889 -3.25033,-0.50337 -2.91045,-0.26338 -3.35565,-0.0447 -7.95978,-0.0331 -2.50313,0.003 -2.57135,0.1941 -2.17651,0.30477 -0.86745,0.34242 -0.5633,0.47469 -0.5027,0.73229 -0.77678,1.15213 -0.69051,0.38398 -0.99827,0.77376 -0.50456,0.53764 -0.86933,1.51779 -0.60826,0.64962 -0.8222,0.55415 -1.74901,0.87228 -0.61518,0.0453 -0.80188,-0.21297 -1.56623,-0.85267 -0.24442,-0.30086 -0.56953,-0.18503 -0.75241,-9.5e-4 -0.98562,0.14943 -0.21171,0.23156 -0.0358,0.31655 v 0"
         clip-path="url(#pc22cb26773)" />
    </g>
    <g
       style="stroke-linecap:butt;stroke-linejoin:round;stroke-miterlimit:100000"
       id="line2d_23">
      <path
         inkscape:connector-curvature="0"
         id="path322"
         style="fill:none;stroke:#0072bd;stroke-linecap:square;stroke-linejoin:round;stroke-miterlimit:100000"
         d="m 482.46714,307.16375 1.00857,0.14062 3.99837,-0.31955 1.90857,-0.20124 2.67852,-0.21889 2.39282,0.0437 4.44075,0.68141 0.78678,0.0385 1.75432,-0.0275 7.6438,-0.85728 4.75036,0.06 2.0753,0.13902 2.16479,-0.0611 21.32731,-3.26895 6.81657,-0.53478 3.80899,-0.50208 4.84276,-1.00794 8.15131,-1.10304 2.45983,-0.54605 3.90736,-1.15905 7.16528,-2.44465 8.11645,-2.09327 4.73794,-1.63623 5.87913,-1.97516 3.96703,-0.73166 4.6745,-0.41227 1.55789,-0.12012 1.93339,0.12316 1.20745,-0.0524 2.06864,-0.35744 0.78,-0.60443 1.85357,-0.64644 1.28003,-0.94074 0.32133,-0.48204 1.46138,-0.54704 0.56224,-0.34606 1.09109,-0.3313 1.21048,0.0538 1.15559,-0.095 0.82719,0.20124 1.1938,0.16749 0.83494,-0.10148 1.80899,0.0461 3.69201,-1.12075 1.94127,-0.71524 1.02948,-0.55855 3.31855,-0.76059 5.41404,0.0667 4.31018,0.4089 2.86617,0.4734 4.06104,-0.0541 3.81078,-0.23223 8.76344,-1.74959 1.14576,-0.0897 2.85426,-0.48632 2.66712,-0.253 0.73634,0.1939 8.51689,-0.67753 1.25046,0.29878 0.64101,0.0316 1.21628,0.20092 3.34992,-0.26006 2.7328,-0.9609 1.94393,-0.77985 1.31613,-0.27077 1.59174,0.30247 0.64067,0.42078 1.37016,0.31478 0.86025,0.0394 0.89785,-0.17639 0.42707,-0.19974 1.03096,-0.20006 0.34557,0.19707 1.5793,-0.0473 2.78745,-0.30473 2.38302,-1.01923 2.36205,-0.54708 3.64982,-0.61293 5.17411,-0.42665 4.67687,0.50991 6.24758,1.9026 2.36012,0.91584 3.43818,0.7863 2.42395,0.2822 8.59385,-0.29389 2.94511,0.0236 3.27121,-0.20426 1.309,-0.25487 4.95587,-0.6037 7.07681,-1.70936 9.27138,-1.68727 3.57839,-0.43608 5.36053,-0.63881 6.56123,-1.42612 3.38282,-1.2341 1.47858,-0.21535 5.7882,-1.15324 2.88033,-0.13469 2.58895,0.0657 2.87123,-0.27779 2.51296,0.29361 6.64288,-0.40672 2.57273,-0.0317 3.41475,0.66767 1.10132,0.30327 2.32044,0.8569 4.58099,1.13936 5.22414,2.03177 0.84438,-0.27567 1.65608,0.42342 2.83773,-0.22568 1.9461,-0.0501 4.51864,-1.16327 -0.0922,0.0553 4.00426,-1.74963 2.63404,-1.43189 1.78748,-0.53218 2.34095,-0.32668 0.70528,-0.35154 1.40097,0.66595 0.33373,0.87744 0.05,0.31647 -0.15604,1.04386 0.18252,0.65854 -0.28037,-0.0252 -0.002,0.0813 -0.49457,0.2568 -0.52599,-0.22779 -1.10749,-0.16385 -1.02567,0.2928 -2.99469,1.22236 -1.51686,1.18266 -3.13627,1.18804 -0.94082,0.45255 -1.25226,0.89438 -1.20085,0.38254 -1.60918,0.86707 -2.33557,0.79143 -0.7953,0.13448 -0.9289,1.23687 -0.19295,0.54195 -0.64933,0.64534 -1.12868,0.31298 -0.47385,-0.0823 -1.52624,0.50571 -2.16347,1.2476 -0.90836,0.32198 -2.14846,0.13669 -1.28892,-0.0678 -1.64064,-0.36325 -1.37832,0.0836 -1.22098,0.32166 -0.72171,0.0441 -3.12061,0.61988 -3.78168,0.84731 -3.22378,0.23004 -2.30198,-0.1293 -1.12502,0.34887 -2.05328,0.34318 -4.09703,1.32473 -1.49738,0.23718 -3.37004,0.75561 -3.61304,0.0869 -1.05221,-0.20542 -2.53667,0.002 -1.05384,-0.12405 -1.18842,0.1277 -0.97761,-0.17308 -2.0636,0.14585 -0.66867,-0.1439 -2.25918,0.27506 -1.25076,0.37378 -1.51461,0.0846 -2.12625,0.52977 -1.17541,0.16758 -1.59665,0.0746 -1.24538,0.2718 -1.23399,-0.41855 -2.91911,0.62024 -1.63151,0.14217 -2.9328,0.0241 -4.20138,0.42086 -2.20079,0.91938 -1.33281,0.0792 -1.37282,0.19338 -6.92655,0.77737 -1.79007,-0.10441 -5.31809,0.65235 -3.86571,0.38356 -1.78357,0.47654 -1.69214,0.0636 -1.64956,0.21914 -7.09697,1.613 -4.99335,1.53234 -1.10722,0.34334 -1.06579,0.50028 -1.09851,0.23738 -1.1851,0.56741 -3.16837,1.04525 -0.94783,0.39217 -1.87596,0.42175 -2.85155,0.61681 -2.65649,0.7892 -0.82946,0.35455 -0.47747,0.36445 -0.8296,0.19124 -0.73103,0.44503 -1.23232,0.49742 -0.0386,0.27882 -0.90873,0.54928 -0.56915,0.51014 -1.57493,1.23646 -0.72832,0.93596 -0.25782,1.15486 0.89158,2.86912 0.72154,1.05953 0.81254,0.6721 -0.25166,0.47136 1.29117,1.36586 1.69739,1.10582 0.89045,0.25116 0.49029,0.19753 1.92041,-0.0362 0.79683,-0.23522 0.64418,-0.44134 0.16969,-0.31596 0.42461,-0.15054 0.19952,-0.35139 0.008,-0.25247 0.66381,-0.76589 0.69172,-0.28651 0.95143,0.0266 0.11511,0.085 -0.0586,0.13532 0.58627,0.53976 -0.16281,0.52043 -0.10944,0.26362 0.11214,0.90435 0.74838,1.17748 0.86765,0.86481 0.58091,0.44062 1.6048,0.59043 2.21044,0.43548 1.07385,0.25658 4.43768,0.27048 3.18795,0.18003 5.063,0.8663 1.63218,0.44463 9.94357,1.56051 1.91013,-0.0711 1.32442,0.29724 1.72621,-0.0994 1.51702,0.0951 1.80469,-0.11313 7.0387,-1.11765 1.37362,0.0738 1.82011,-0.19863 1.53946,-0.48827 2.47608,0.003 3.35765,-0.43578 2.23331,-0.54785 1.05,0.093 1.83962,-0.32659 1.33567,-0.0881 1.8325,-0.38935 1.51749,-0.14518 2.07525,-0.54042 1.29249,-0.0988 1.85236,-0.3223 1.17936,0.0346 5.94267,-0.37223 1.31474,0.0357 2.3435,-0.19826 2.15772,-0.16084 8.64368,-1.5631 0.76188,-0.0695 1.36898,0.0438 0.81367,-0.0916 3.0267,-0.0384 4.71021,0.55906 1.82178,0.0357 1.03013,0.028 0.86748,0.15913 1.05432,-0.20453 0.74611,0.19053 1.28157,-0.44173 0.97319,0.0821 1.09642,-0.19209 2.84825,0.15885 0.84777,0.28682 0.9611,0.1897 1.90234,0.24068 4.16308,1.01013 0.91574,0.49891 1.23032,0.18439 5.81317,1.48144 0.97722,-0.0664 0.99119,-1.38715 3.41069,1.52294 1.29293,-1.05564 1.94096,-0.17464 1.14708,0.12428 0.37871,-0.56703 2.44425,-0.4685 1.87457,0.1208 1.22569,0.71535 3.32967,-0.17014 0.54282,0.22658 1.49065,0.24701 1.42675,0.50066 2.64591,0.36654 1.19444,-0.33013 1.43251,-0.086 0.56718,-0.40271 1.51853,-0.13333 2.24222,-0.86215 0.23365,-0.42151 0.59114,-0.40767 0.28564,-1.00722 -0.18797,-0.32226 -0.37938,-0.0961 -1.31641,-0.48241 -1.13957,-0.23253 -1.11742,-0.35709 -2.91784,-0.66428 -5.80787,-0.87423 -10.33908,-1.14285 -6.48022,-0.49308 -7.00427,-0.63514 -7.48843,-0.2437 -3.83326,-0.40401 -14.74753,-0.35396 -22.03087,0.0429 -4.68191,-0.25955 -2.26761,-0.24 -3.73242,-0.56752 -4.56734,-0.47272 -1.25695,0.16387 -0.43712,-0.18897 -0.96304,0.0163 -1.50143,0.79095 -0.39252,0.60485 -1.26513,1.15101 -1.37452,0.79092 -0.53105,-0.0461 0.28869,0.064 v 0 l 0.24219,-0.12098 1.09052,0.14117 0.73404,-0.0819 1.49565,0.1639 0.94078,-0.0234 1.80993,0.0991 5.97072,-0.38988 2.24596,-0.0615 3.85922,0.36685 1.00157,0.14002 3.06784,0.80055 3.48475,1.43099 2.00461,0.66466 3.39015,0.54727 2.68211,0.29005 4.64331,-0.0468 9.29302,-0.17971 3.54041,-0.0739 1.78908,-0.1738 3.24901,0.0243 6.66479,0.57689 2.99686,0.0438 2.54268,0.69395 4.5342,0.48518 1.30183,0.38525 3.1287,0.2524 2.37843,-0.74909 2.84286,0.11335 2.87047,-0.97834 1.25773,-0.30382 2.86264,-0.46617 3.94541,0.13464 4.13323,0.38298 2.44726,-0.15507 3.17819,-0.44598 2.20117,-0.75893 0.86608,-0.62228 0.58023,-0.22789 1.69209,-0.86041 1.27919,-0.46144 0.77515,-0.14737 1.91257,-0.1408 2.70867,-0.74068 0.57891,-0.3299 0.7407,-0.29206 1.12045,-0.57598 0.55976,-0.0989 0.99657,-0.37799 0.46862,-0.0354 0.85905,-0.37749 -0.30986,0.009 -1.02905,-0.97069 -0.41261,-1.78198 0.0501,-0.56151 -0.11582,-0.96246 -0.84929,-0.55213 -0.72601,-0.79449 -1.32929,-0.53714 -0.15757,-0.21937 -1.76613,-0.30248 -7.27675,-0.2349 -4.67341,0.15931 -3.23603,0.52595 -1.18942,0.0287 -2.66716,0.41333 -4.41393,0.1694 -2.64162,0.004 -4.24097,-0.11939 -2.44692,0.14876 -1.45728,-0.0385 -7.37977,0.15555 -7.33906,-0.61447 -1.30915,0.0375 -7.69868,-0.0272 -1.37171,0.0824 -2.61446,0.27937 -7.74252,-0.059 -4.30789,-0.049 -3.40797,10e-4 -8.13359,0.6542 -11.28844,2.0522 -6.05396,0.38999 -5.08791,-0.10653 -3.04184,-0.27357 -3.06266,-0.15242 -7.24277,0.17057 -4.01931,0.45166 -3.6246,0.92023 -4.86341,1.21739 -5.0563,0.48277 -1.25397,-0.0185 -5.17165,0.50936 -2.71181,0.37411 -4.08699,0.8348 -2.89374,0.65873 -2.78643,0.79336 -3.07592,0.6185 -7.31989,0.59589 -2.7167,0.11958 -6.24827,0.73213 -4.82184,0.69516 -2.33115,0.11067 -6.22736,-0.0826 -3.98604,0.48549 -3.04848,0.71095 -2.62402,0.97752 -4.39502,2.47538 -3.47318,1.75126 -2.67092,1.03386 -3.55326,1.59882 -4.99605,2.36698 -4.48116,1.1621 -4.52223,0.4146 -3.46503,-0.14667 -2.11799,-0.37007 -9.38136,-2.49034 -1.30311,-0.51215 -0.76099,-0.58021 -0.11626,-0.26479 -1.30109,-1.82753 -0.28198,-0.60355 0.14163,-0.26703 0.17455,-0.0308 1.32111,-0.0264 2.55021,-0.26808 8.14417,-0.57347 4.30088,-0.63294 1.57291,-0.34639 7.41275,-1.08035 4.37552,-0.4007 4.40379,-0.25851 2.82885,-0.3564 6.54024,-1.829 2.39752,-0.93597 8.37687,-2.71422 2.48612,-1.05858 1.77108,-0.55447 4.2993,-1.46159 2.34751,-1.0928 1.40841,-0.81572 1.61746,-0.52582 0.7228,0.0632 1.50391,0.32989 1.86745,-0.25151 0.99727,-0.27271 1.71018,-0.80679 0.4316,0.012 0.6531,-0.16388 0.8853,-0.0831 1.42672,0.54036 0.2072,0.30415 0.20381,0.06 0.28471,0.36619 0.24055,0.008 -0.12521,0.37285 -0.0542,0.27752 -0.55896,0.10674 -1.36127,-0.25108 -2.78098,-0.89186 -0.58817,-0.27242 -2.98053,-0.71946 -1.7411,-0.27558 -3.54347,-0.17203 -1.98399,0.11318 -2.77292,0.42914 -2.25923,0.1887 -7.24479,1.49111 -1.86703,0.55335 -1.9568,0.37929 -3.49216,0.31462 -3.75729,-0.12686 -1.21814,-0.18647 -0.94714,0.0312 -1.00303,0.17444 -0.62113,0.23437 -0.94823,1.84108 -0.13936,0.72753 0.30181,2.50136 0.22292,1.17968 -0.007,2.41398 0.24893,1.17165 0.40909,0.32468 1.27343,0.2148 0.64923,-0.17076 0.78832,0.0375 0.76835,0.15411 0.7556,0.30751 0.78841,0.1794 1.76296,1.07294 1.75934,1.63514 1.15771,1.35814 3.48318,4.03449 1.15329,1.15679 2.17462,1.14194 4.19054,1.34948 2.2898,0.44395 4.64482,0.48115 3.05334,0.61223 2.97156,1.0881 2.1061,0.88777 2.46417,0.51258 2.70535,0.22356 6.55464,1.1178 1.41227,0.2847 4.53627,0.71303 7.715,0.54154 6.8281,0.0503 3.37339,0.36691 2.13392,0.007 9.0418,0.45272 1.78642,-0.19255 7.03408,0.026 4.04011,0.46833 3.27233,0.45245 3.31842,0.28438 8.30806,0.15931 5.06297,-0.32464 7.17155,-0.83788 7.19771,-1.01371 3.72293,-0.76401 3.69493,-0.98581 3.70493,-0.81465 3.5784,-0.97323 3.98392,-0.53576 8.03941,-0.21402 4.04389,0.63563 3.82039,-0.36216 2.34628,0.41489 3.53806,-0.56493 4.04502,0.63734 4.2614,0.11891 3.56242,-0.0459 10.13724,0.76914 4.28137,-0.0645 3.11804,-0.30526 2.5236,-0.51642 1.21604,0.20538 2.56955,-0.11071 6.79007,-1.49299 0.91892,0.46437 1.81888,-0.30605 1.85593,-0.47839 0.79043,-0.38846 0.88028,-0.023 1.5615,-0.33439 3.09558,-0.28263 3.36149,0.35906 0.38598,0.25771 2.41015,0.0877 0.61688,-0.26527 1.01742,-0.23178 1.03744,-0.98738 -0.088,-0.88698 -0.27658,-0.28204 -0.90783,-1.44999 -4.8042,-3.0524 -1.13806,-0.83616 -1.73081,-0.79858 -3.4051,-2.0192 -2.24529,-0.98066 -4.81082,-1.61084 -2.78755,-0.38882 -2.70869,-0.70018 -6.0158,-1.30642 -3.23664,-0.99474 -2.85461,-1.13282 -10.96259,-2.84022 -5.67493,-0.79622 -2.86988,-0.0274 -2.74787,-0.17749 -5.56909,0.006 -7.69513,0.68861 -2.02614,-0.12589 -2.4924,0.0166 -4.14273,-1.19594 -2.80247,-0.8104 -1.14773,-0.072 -1.14888,-0.26597 -1.70247,0.25271 -0.77193,0.14708 -0.53724,-0.0198 -1.53409,-0.21652 -4.43468,0.14326 -2.60178,0.67221 -3.48532,1.41714 -2.97919,0.74856 -4.09281,0.48273 -4.36529,0.58911 -1.86744,0.44101 -3.28026,0.64007 -2.55909,0.23478 -5.43828,0.05 -3.00033,0.13473 -2.90296,0.32557 -7.44604,1.20959 -7.32107,2.02528 -2.3311,0.47767 -5.57057,0.3792 -6.50842,1.46312 -2.19534,0.52397 -2.08218,0.36822 -5.68257,0.67949 -3.60879,0.90033 -3.81163,1.46503 -2.55986,0.46795 -1.03322,0.0786 -1.74151,0.44152 -4.2173,2.10574 -0.32451,0.42246 -0.55192,0.51522 -0.67869,0.44493 -0.23016,0.34764 -0.98022,0.19179 -0.94564,0.13187 -1.23317,0.45116 -3.51173,1.74003 -3.24632,-0.0447 -1.11599,0.11485 -0.34625,0.15117 -1.98211,0.42558 -4.27887,0.10256 -2.69845,0.56711 -2.75526,0.83252 -1.02098,0.70943 -1.5856,0.37157 -1.52115,0.008 -1.10078,-0.17589 -1.83737,-0.60236 -3.13254,-2.25751 -1.27406,-1.10948 -0.92248,-0.45106 -0.66141,-0.48821 -0.61014,-0.29904 -1.55805,-0.21404 -0.70586,-0.002 -1.86606,0.87963 -0.96258,0.11461 -0.99122,-0.52482 -0.30113,-0.23262 -0.28083,-0.36071 -0.17125,-0.49575 -1.20723,-1.647 -0.5794,-0.33443 -1.58159,-0.50159 -0.76626,-0.52344 -2.20898,-1.29196 -2.56508,-1.46997 -3.71608,-1.09854 -1.19609,-0.2472 -1.56727,-0.0796 -4.25343,0.27151 -5.26463,-0.49555 -5.71914,0.37334 -3.19255,0.39385 -4.24085,-0.0195 -8.00062,-0.30777 -7.87507,0.80566 -2.00304,0.4012 -2.15647,0.28155 -2.69304,-0.27362 -1.87313,-0.30447 -4.53209,-1.52015 -2.20635,0.0587 -0.82182,0.29375 -0.47338,0.65338 -0.424,0.5144 -1.31112,2.9266 -0.38968,0.31527 -0.21162,0.49312 -1.01436,0.20673 -1.07322,0.025 -1.4573,-0.12901 -1.56578,-0.002 -4.54064,0.29471 -1.97417,-0.30109 -2.16869,-0.17602 -2.42006,-0.46161 -5.5373,-0.60475 -2.2575,-0.15847 -9.02259,0.28779 -2.49027,-0.11917 -2.254,-0.34904 -5.83769,-0.48413 -3.28125,-0.0451 -4.17026,0.43796 -2.76723,0.35824 -2.74091,-0.10705 -1.6872,-0.25534 -2.0635,-1.00614 -11.63676,-4.24298 -6.26677,-0.003 -5.04291,0.76704 -4.25164,-0.018 -2.28279,-0.49284 -2.41436,-1.29879 -2.02115,-2.00471 -1.335,-1.67174 0.25888,-0.0521 0.22174,0.26384 4.19266,2.81707 4.0248,1.46378 1.62056,1.54333 0.90037,1.12491 1.78047,2.9249 0.88244,1.09737 0.37863,1.21062 0.49938,1.10903 0.0653,1.77541 -0.40953,1.219 -0.22095,1.5062 0.009,1.39121 0.40212,0.85752 0.13089,0.64912 0.92028,2.06327 1.27721,0.62426 1.35505,-0.10206 0.83457,0.36827 0.45599,0.49246 0.33764,0.58432 1.292,1.30364 0.45126,1.02554 1.02073,0.48996 1.21071,0.36748 1.6487,0.23434 2.93417,0.76369 3.03536,0.87272 2.47799,0.96773 1.90839,0.91199 4.44093,2.70609 2.91841,2.55909 2.12413,2.26793 1.28,1.56135 3.41181,4.76266 0.91247,1.091 2.03934,1.71337 2.56652,1.08097 0.46305,0.14866 1.98954,0.32381 0.89637,-0.16529 0.53111,-0.22323 0.46913,-0.36156 0.27806,-1.83542 -0.28144,-0.5182 -0.68526,-0.35119 -2.14578,-0.69629 -0.23656,-0.18582 0.26758,-0.79599 0.26121,-0.18566 0.32499,-0.8379 0.47223,-0.72144 0.29535,-0.67521 0.47062,-0.6867 0.75835,-2.57698 0.7513,-2.2808 0.98008,-1.3628 0.72551,-0.5458 0.41166,-0.48258 0.45926,-0.33865 1.10969,-1.70427 0.52793,-0.72444 2.37752,-1.58449 0.74987,-0.28664 0.63721,-0.44997 0.79788,-0.91384 0.64155,-0.53398 0.80216,-1.39799 -0.15613,-0.0231 -0.38429,-0.29981 -0.9613,-0.50651 -2.04297,-1.94656 -1.55733,-1.6736 -6.26948,-7.85333 -1.78258,-2.62215 -1.08687,-1.99857 -0.0615,-0.98185 0.73258,-1.95652 0.14965,-1.30268 0.30046,-0.7278 -0.004,-1.12317 -0.15936,-0.96788 -0.28947,-0.47407 -0.39401,-0.31126 -1.58291,0.33233 -1.10376,-0.50082 -0.89788,-0.27653 -3.62699,-0.53259 -4.97849,-1.49633 -1.95409,-0.32682 -3.0634,-0.0497 -3.54499,-0.36194 -6.35202,0.4143 -3.96983,-0.16901 -2.75908,-0.29423 -4.27419,-0.59179 -6.67491,-0.32073 -6.94645,-0.19231 -8.77804,-0.95293 -2.49,0.0762 -4.70846,-0.12078 -2.95177,0.0853 -4.79109,-0.12585 -4.71021,-0.46565 -5.24108,-0.29054 -4.75977,-0.0833 -10.01791,0.37886 -5.38264,-0.18945 -8.04413,-1.2419 -6.30868,-1.38506 -4.74355,-0.43649 -3.19923,-0.81726 -3.76096,0.55316 -2.61711,0.072 -3.59525,-0.0968 -1.82742,0.0311 -2.69423,0.39025 -1.78529,0.72014 -0.22556,0.34958 -0.64101,0.49721 -0.32018,0.61393 -0.39948,0.41458 -0.63303,0.15365 -1.16262,0.79024 -0.12808,0.2187 -0.34568,0.26365 -0.0306,0.30892 -0.81037,0.97098 -0.10574,0.24985 -0.71077,0.70611 -1.33169,0.85637 -0.59967,0.0474 -0.22199,0.28982 -0.82786,0.16139 -0.87941,-0.18935 -1.44055,-0.71656 -1.3e-4,-0.11385 -0.28082,-0.10955 -0.32915,-0.24847 -0.46172,-0.20649 -1.43906,0.10659 -0.22843,0.24456 v 0"
         clip-path="url(#pc22cb26773)" />
    </g>
    <g
       style="stroke-linecap:butt;stroke-linejoin:round;stroke-miterlimit:100000"
       id="legend_1">
      <g
         style="stroke-linecap:butt;stroke-linejoin:round;stroke-miterlimit:100000"
         id="patch_6">
        <path
           inkscape:connector-curvature="0"
           id="path325"
           style="fill:#ffffff;stroke:#000000;stroke-linecap:butt;stroke-linejoin:miter;stroke-miterlimit:100000"
           d="M 900.639,118.0935 H 1046.61 V 71.1 H 900.639 Z" />
      </g>
      <g
         style="stroke-linecap:butt;stroke-linejoin:round;stroke-miterlimit:100000"
         id="line2d_24">
        <path
           inkscape:connector-curvature="0"
           id="path328"
           style="fill:none;stroke:#ff0000;stroke-linecap:square;stroke-linejoin:round;stroke-miterlimit:100000"
           d="m 910.719,82.76175 h 20.16" />
      </g>
      <g
         style="stroke-linecap:butt;stroke-linejoin:round;stroke-miterlimit:100000"
         id="line2d_25" />
      <g
         style="stroke-linecap:butt;stroke-linejoin:round;stroke-miterlimit:100000"
         id="text_22">
        <!-- ground truth -->
        <defs
           id="defs340">
          <path
             style="stroke-linecap:butt;stroke-linejoin:round;stroke-miterlimit:100000"
             inkscape:connector-curvature="0"
             id="BitstreamVeraSans-Roman-6e"
             d="M 54.890625,33.015625 V 0 H 45.90625 v 32.71875 q 0,7.765625 -3.03125,11.609375 -3.03125,3.859375 -9.078125,3.859375 -7.28125,0 -11.484375,-4.640625 -4.203125,-4.625 -4.203125,-12.640625 V 0 h -9.03125 v 54.6875 h 9.03125 v -8.5 q 3.234375,4.9375 7.59375,7.375 4.375,2.4375 10.09375,2.4375 9.421875,0 14.25,-5.828125 4.84375,-5.828125 4.84375,-17.15625" />
          <path
             style="stroke-linecap:butt;stroke-linejoin:round;stroke-miterlimit:100000"
             inkscape:connector-curvature="0"
             id="BitstreamVeraSans-Roman-6f"
             d="m 30.609375,48.390625 q -7.21875,0 -11.421875,-5.640625 -4.203125,-5.640625 -4.203125,-15.453125 0,-9.8125 4.171875,-15.453125 4.1875,-5.640625 11.453125,-5.640625 7.1875,0 11.375,5.65625 4.203125,5.671875 4.203125,15.4375 0,9.71875 -4.203125,15.40625 -4.1875,5.6875 -11.375,5.6875 m 0,7.609375 q 11.71875,0 18.40625,-7.625 6.703125,-7.609375 6.703125,-21.078125 0,-13.421875 -6.703125,-21.078125 -6.6875,-7.640625 -18.40625,-7.640625 -11.765625,0 -18.4375,7.640625 -6.65625,7.65625 -6.65625,21.078125 0,13.46875 6.65625,21.078125 Q 18.84375,56 30.609375,56" />
          <path
             style="stroke-linecap:butt;stroke-linejoin:round;stroke-miterlimit:100000"
             inkscape:connector-curvature="0"
             id="BitstreamVeraSans-Roman-68"
             d="M 54.890625,33.015625 V 0 H 45.90625 v 32.71875 q 0,7.765625 -3.03125,11.609375 -3.03125,3.859375 -9.078125,3.859375 -7.28125,0 -11.484375,-4.640625 -4.203125,-4.625 -4.203125,-12.640625 V 0 h -9.03125 v 75.984375 h 9.03125 V 46.1875 q 3.234375,4.9375 7.59375,7.375 4.375,2.4375 10.09375,2.4375 9.421875,0 14.25,-5.828125 4.84375,-5.828125 4.84375,-17.15625" />
          <path
             style="stroke-linecap:butt;stroke-linejoin:round;stroke-miterlimit:100000"
             inkscape:connector-curvature="0"
             id="BitstreamVeraSans-Roman-64"
             d="m 45.40625,46.390625 v 29.59375 h 8.984375 V 0 H 45.40625 v 8.203125 q -2.828125,-4.875 -7.15625,-7.25 -4.3125,-2.375 -10.375,-2.375 -9.90625,0 -16.140625,7.90625 -6.21875,7.921875 -6.21875,20.8125 0,12.890625 6.21875,20.796875 Q 17.96875,56 27.875,56 q 6.0625,0 10.375,-2.375 4.328125,-2.359375 7.15625,-7.234375 M 14.796875,27.296875 q 0,-9.90625 4.078125,-15.546875 4.078125,-5.640625 11.203125,-5.640625 7.125,0 11.21875,5.640625 4.109375,5.640625 4.109375,15.546875 0,9.90625 -4.109375,15.546875 -4.09375,5.640625 -11.21875,5.640625 -7.125,0 -11.203125,-5.640625 -4.078125,-5.640625 -4.078125,-15.546875" />
          <path
             style="stroke-linecap:butt;stroke-linejoin:round;stroke-miterlimit:100000"
             inkscape:connector-curvature="0"
             id="BitstreamVeraSans-Roman-67"
             d="m 45.40625,27.984375 q 0,9.765625 -4.03125,15.125 -4.015625,5.375 -11.296875,5.375 -7.21875,0 -11.25,-5.375 -4.03125,-5.359375 -4.03125,-15.125 0,-9.71875 4.03125,-15.09375 4.03125,-5.375 11.25,-5.375 7.28125,0 11.296875,5.375 4.03125,5.375 4.03125,15.09375 M 54.390625,6.78125 q 0,-13.953125 -6.203125,-20.765625 -6.1875,-6.8125 -18.984375,-6.8125 -4.734375,0 -8.9375,0.703125 -4.203125,0.703125 -8.15625,2.171875 V -9.1875 q 3.953125,-2.140625 7.8125,-3.15625 3.859375,-1.03125 7.859375,-1.03125 8.84375,0 13.234375,4.609375 4.390625,4.609375 4.390625,13.9375 V 9.625 Q 42.625,4.78125 38.28125,2.390625 33.9375,0 27.875,0 17.828125,0 11.671875,7.65625 q -6.15625,7.671875 -6.15625,20.328125 0,12.6875 6.15625,20.34375 Q 17.828125,56 27.875,56 q 6.0625,0 10.40625,-2.390625 4.34375,-2.390625 7.125,-7.21875 V 54.6875 h 8.984375 z" />
          <path
             style="stroke-linecap:butt;stroke-linejoin:round;stroke-miterlimit:100000"
             inkscape:connector-curvature="0"
             id="BitstreamVeraSans-Roman-75"
             d="M 8.5,21.578125 V 54.6875 h 8.984375 V 21.921875 q 0,-7.765625 3.015625,-11.65625 3.03125,-3.875 9.09375,-3.875 7.265625,0 11.484375,4.640625 4.234375,4.640625 4.234375,12.65625 v 31 h 8.984375 V 0 H 45.3125 V 8.40625 Q 42.046875,3.421875 37.71875,1 33.40625,-1.421875 27.6875,-1.421875 18.265625,-1.421875 13.375,4.4375 8.5,10.296875 8.5,21.578125" />
          <path
             style="stroke-linecap:butt;stroke-linejoin:round;stroke-miterlimit:100000"
             inkscape:connector-curvature="0"
             id="BitstreamVeraSans-Roman-72"
             d="m 41.109375,46.296875 q -1.515625,0.875 -3.296875,1.28125 Q 36.03125,48 33.890625,48 26.265625,48 22.1875,43.046875 18.109375,38.09375 18.109375,28.8125 V 0 h -9.03125 v 54.6875 h 9.03125 v -8.5 q 2.84375,4.984375 7.375,7.390625 Q 30.03125,56 36.53125,56 q 0.921875,0 2.046875,-0.125 1.125,-0.109375 2.484375,-0.359375 z" />
          <path
             style="stroke-linecap:butt;stroke-linejoin:round;stroke-miterlimit:100000"
             inkscape:connector-curvature="0"
             id="BitstreamVeraSans-Roman-74"
             d="M 18.3125,70.21875 V 54.6875 h 18.5 v -6.984375 h -18.5 v -29.6875 q 0,-6.6875 1.828125,-8.59375 1.828125,-1.90625 7.453125,-1.90625 H 36.8125 V 0 H 27.59375 Q 17.1875,0 13.234375,3.875 9.28125,7.765625 9.28125,18.015625 v 29.6875 H 2.6875 V 54.6875 h 6.59375 v 15.53125 z" />
        </defs>
        <g
           style="stroke-linecap:butt;stroke-linejoin:round;stroke-miterlimit:100000"
           id="g366"
           transform="matrix(0.144,0,0,-0.144,946.719,87.80175)">
          <use
             height="100%"
             width="100%"
             y="0"
             x="0"
             style="stroke-linecap:butt;stroke-linejoin:round;stroke-miterlimit:100000"
             id="use342"
             xlink:href="#BitstreamVeraSans-Roman-67" />
          <use
             height="100%"
             width="100%"
             y="0"
             style="stroke-linecap:butt;stroke-linejoin:round;stroke-miterlimit:100000"
             id="use344"
             xlink:href="#BitstreamVeraSans-Roman-72"
             x="63.476562" />
          <use
             height="100%"
             width="100%"
             y="0"
             style="stroke-linecap:butt;stroke-linejoin:round;stroke-miterlimit:100000"
             id="use346"
             xlink:href="#BitstreamVeraSans-Roman-6f"
             x="104.55859" />
          <use
             height="100%"
             width="100%"
             y="0"
             style="stroke-linecap:butt;stroke-linejoin:round;stroke-miterlimit:100000"
             id="use348"
             xlink:href="#BitstreamVeraSans-Roman-75"
             x="165.74023" />
          <use
             height="100%"
             width="100%"
             y="0"
             style="stroke-linecap:butt;stroke-linejoin:round;stroke-miterlimit:100000"
             id="use350"
             xlink:href="#BitstreamVeraSans-Roman-6e"
             x="229.11914" />
          <use
             height="100%"
             width="100%"
             y="0"
             style="stroke-linecap:butt;stroke-linejoin:round;stroke-miterlimit:100000"
             id="use352"
             xlink:href="#BitstreamVeraSans-Roman-64"
             x="292.49805" />
          <use
             height="100%"
             width="100%"
             y="0"
             style="stroke-linecap:butt;stroke-linejoin:round;stroke-miterlimit:100000"
             id="use354"
             xlink:href="#BitstreamVeraSans-Roman-20"
             x="355.97461" />
          <use
             height="100%"
             width="100%"
             y="0"
             style="stroke-linecap:butt;stroke-linejoin:round;stroke-miterlimit:100000"
             id="use356"
             xlink:href="#BitstreamVeraSans-Roman-74"
             x="387.76172" />
          <use
             height="100%"
             width="100%"
             y="0"
             style="stroke-linecap:butt;stroke-linejoin:round;stroke-miterlimit:100000"
             id="use358"
             xlink:href="#BitstreamVeraSans-Roman-72"
             x="426.9707" />
          <use
             height="100%"
             width="100%"
             y="0"
             style="stroke-linecap:butt;stroke-linejoin:round;stroke-miterlimit:100000"
             id="use360"
             xlink:href="#BitstreamVeraSans-Roman-75"
             x="468.08398" />
          <use
             height="100%"
             width="100%"
             y="0"
             style="stroke-linecap:butt;stroke-linejoin:round;stroke-miterlimit:100000"
             id="use362"
             xlink:href="#BitstreamVeraSans-Roman-74"
             x="531.46289" />
          <use
             height="100%"
             width="100%"
             y="0"
             style="stroke-linecap:butt;stroke-linejoin:round;stroke-miterlimit:100000"
             id="use364"
             xlink:href="#BitstreamVeraSans-Roman-68"
             x="570.67188" />
        </g>
      </g>
      <g
         style="stroke-linecap:butt;stroke-linejoin:round;stroke-miterlimit:100000"
         id="line2d_26">
        <path
           inkscape:connector-curvature="0"
           id="path369"
           style="fill:none;stroke:#0072bd;stroke-linecap:square;stroke-linejoin:round;stroke-miterlimit:100000"
           d="m 910.719,103.89825 h 20.16" />
      </g>
      <g
         style="stroke-linecap:butt;stroke-linejoin:round;stroke-miterlimit:100000"
         id="line2d_27" />
      <g
         style="stroke-linecap:butt;stroke-linejoin:round;stroke-miterlimit:100000"
         id="text_23">
        <!-- gftt_brisk.log -->
        <defs
           id="defs381">
          <path
             style="stroke-linecap:butt;stroke-linejoin:round;stroke-miterlimit:100000"
             inkscape:connector-curvature="0"
             id="BitstreamVeraSans-Roman-5f"
             d="m 50.984375,-16.609375 v -6.96875 h -51.96875 v 6.96875 z" />
          <path
             style="stroke-linecap:butt;stroke-linejoin:round;stroke-miterlimit:100000"
             inkscape:connector-curvature="0"
             id="BitstreamVeraSans-Roman-6c"
             d="M 9.421875,75.984375 H 18.40625 V 0 H 9.421875 Z" />
          <path
             style="stroke-linecap:butt;stroke-linejoin:round;stroke-miterlimit:100000"
             inkscape:connector-curvature="0"
             id="BitstreamVeraSans-Roman-6b"
             d="m 9.078125,75.984375 h 9.03125 v -44.875 l 26.8125,23.578125 h 11.46875 l -29,-25.578125 L 57.625,0 H 45.90625 L 18.109375,26.703125 V 0 h -9.03125 z" />
          <path
             style="stroke-linecap:butt;stroke-linejoin:round;stroke-miterlimit:100000"
             inkscape:connector-curvature="0"
             id="BitstreamVeraSans-Roman-69"
             d="M 9.421875,54.6875 H 18.40625 V 0 H 9.421875 Z m 0,21.296875 H 18.40625 V 64.59375 H 9.421875 Z" />
          <path
             style="stroke-linecap:butt;stroke-linejoin:round;stroke-miterlimit:100000"
             inkscape:connector-curvature="0"
             id="BitstreamVeraSans-Roman-2e"
             d="M 10.6875,12.40625 H 21 V 0 H 10.6875 Z" />
          <path
             style="stroke-linecap:butt;stroke-linejoin:round;stroke-miterlimit:100000"
             inkscape:connector-curvature="0"
             id="BitstreamVeraSans-Roman-66"
             d="M 37.109375,75.984375 V 68.5 h -8.59375 q -4.828125,0 -6.71875,-1.953125 -1.875,-1.953125 -1.875,-7.03125 V 54.6875 H 34.71875 V 47.703125 H 19.921875 V 0 h -9.03125 V 47.703125 H 2.296875 V 54.6875 h 8.59375 V 58.5 q 0,9.125 4.25,13.296875 4.25,4.1875 13.46875,4.1875 z" />
          <path
             style="stroke-linecap:butt;stroke-linejoin:round;stroke-miterlimit:100000"
             inkscape:connector-curvature="0"
             id="BitstreamVeraSans-Roman-73"
             d="m 44.28125,53.078125 v -8.5 Q 40.484375,46.53125 36.375,47.5 q -4.09375,0.984375 -8.5,0.984375 -6.6875,0 -10.03125,-2.046875 Q 14.5,44.390625 14.5,40.28125 q 0,-3.125 2.390625,-4.90625 2.390625,-1.78125 9.625,-3.390625 l 3.078125,-0.6875 Q 39.15625,29.25 43.1875,25.515625 47.21875,21.78125 47.21875,15.09375 q 0,-7.625 -6.03125,-12.078125 -6.03125,-4.4375 -16.578125,-4.4375 -4.390625,0 -9.15625,0.859375 Q 10.6875,0.296875 5.421875,2 v 9.28125 q 4.984375,-2.59375 9.8125,-3.890625 4.828125,-1.28125 9.578125,-1.28125 6.34375,0 9.75,2.171875 3.421875,2.171875 3.421875,6.125 0,3.65625 -2.46875,5.609375 -2.453125,1.953125 -10.8125,3.765625 l -3.125,0.734375 q -8.34375,1.75 -12.0625,5.390625 -3.703125,3.640625 -3.703125,9.984375 0,7.71875 5.46875,11.90625 Q 16.75,56 26.8125,56 q 4.96875,0 9.359375,-0.734375 4.40625,-0.71875 8.109375,-2.1875" />
          <path
             style="stroke-linecap:butt;stroke-linejoin:round;stroke-miterlimit:100000"
             inkscape:connector-curvature="0"
             id="BitstreamVeraSans-Roman-62"
             d="m 48.6875,27.296875 q 0,9.90625 -4.078125,15.546875 -4.078125,5.640625 -11.203125,5.640625 -7.140625,0 -11.21875,-5.640625 -4.078125,-5.640625 -4.078125,-15.546875 0,-9.90625 4.078125,-15.546875 4.078125,-5.640625 11.21875,-5.640625 7.125,0 11.203125,5.640625 4.078125,5.640625 4.078125,15.546875 m -30.578125,19.09375 q 2.84375,4.875 7.15625,7.234375 Q 29.59375,56 35.59375,56 q 9.96875,0 16.1875,-7.90625 6.234375,-7.90625 6.234375,-20.796875 0,-12.890625 -6.234375,-20.8125 -6.21875,-7.90625 -16.1875,-7.90625 -6,0 -10.328125,2.375 -4.3125,2.375 -7.15625,7.25 V 0 h -9.03125 v 75.984375 h 9.03125 z" />
        </defs>
        <g
           style="stroke-linecap:butt;stroke-linejoin:round;stroke-miterlimit:100000"
           id="g411"
           transform="matrix(0.144,0,0,-0.144,946.719,108.93825)">
          <use
             height="100%"
             width="100%"
             y="0"
             x="0"
             style="stroke-linecap:butt;stroke-linejoin:round;stroke-miterlimit:100000"
             id="use383"
             xlink:href="#BitstreamVeraSans-Roman-67" />
          <use
             height="100%"
             width="100%"
             y="0"
             style="stroke-linecap:butt;stroke-linejoin:round;stroke-miterlimit:100000"
             id="use385"
             xlink:href="#BitstreamVeraSans-Roman-66"
             x="63.476562" />
          <use
             height="100%"
             width="100%"
             y="0"
             style="stroke-linecap:butt;stroke-linejoin:round;stroke-miterlimit:100000"
             id="use387"
             xlink:href="#BitstreamVeraSans-Roman-74"
             x="98.666016" />
          <use
             height="100%"
             width="100%"
             y="0"
             style="stroke-linecap:butt;stroke-linejoin:round;stroke-miterlimit:100000"
             id="use389"
             xlink:href="#BitstreamVeraSans-Roman-74"
             x="137.875" />
          <use
             height="100%"
             width="100%"
             y="0"
             style="stroke-linecap:butt;stroke-linejoin:round;stroke-miterlimit:100000"
             id="use391"
             xlink:href="#BitstreamVeraSans-Roman-5f"
             x="177.08398" />
          <use
             height="100%"
             width="100%"
             y="0"
             style="stroke-linecap:butt;stroke-linejoin:round;stroke-miterlimit:100000"
             id="use393"
             xlink:href="#BitstreamVeraSans-Roman-62"
             x="227.08398" />
          <use
             height="100%"
             width="100%"
             y="0"
             style="stroke-linecap:butt;stroke-linejoin:round;stroke-miterlimit:100000"
             id="use395"
             xlink:href="#BitstreamVeraSans-Roman-72"
             x="290.56055" />
          <use
             height="100%"
             width="100%"
             y="0"
             style="stroke-linecap:butt;stroke-linejoin:round;stroke-miterlimit:100000"
             id="use397"
             xlink:href="#BitstreamVeraSans-Roman-69"
             x="331.67383" />
          <use
             height="100%"
             width="100%"
             y="0"
             style="stroke-linecap:butt;stroke-linejoin:round;stroke-miterlimit:100000"
             id="use399"
             xlink:href="#BitstreamVeraSans-Roman-73"
             x="359.45703" />
          <use
             height="100%"
             width="100%"
             y="0"
             style="stroke-linecap:butt;stroke-linejoin:round;stroke-miterlimit:100000"
             id="use401"
             xlink:href="#BitstreamVeraSans-Roman-6b"
             x="411.55664" />
          <use
             height="100%"
             width="100%"
             y="0"
             style="stroke-linecap:butt;stroke-linejoin:round;stroke-miterlimit:100000"
             id="use403"
             xlink:href="#BitstreamVeraSans-Roman-2e"
             x="469.4668" />
          <use
             height="100%"
             width="100%"
             y="0"
             style="stroke-linecap:butt;stroke-linejoin:round;stroke-miterlimit:100000"
             id="use405"
             xlink:href="#BitstreamVeraSans-Roman-6c"
             x="501.25391" />
          <use
             height="100%"
             width="100%"
             y="0"
             style="stroke-linecap:butt;stroke-linejoin:round;stroke-miterlimit:100000"
             id="use407"
             xlink:href="#BitstreamVeraSans-Roman-6f"
             x="529.03711" />
          <use
             height="100%"
             width="100%"
             y="0"
             style="stroke-linecap:butt;stroke-linejoin:round;stroke-miterlimit:100000"
             id="use409"
             xlink:href="#BitstreamVeraSans-Roman-67"
             x="590.21875" />
        </g>
      </g>
    </g>
  </g>
  <defs
     id="defs420">
    <clipPath
       id="pc22cb26773"
       style="stroke-linecap:butt;stroke-linejoin:round;stroke-miterlimit:100000">
      <rect
         height="511.20001"
         width="907.44751"
         x="146.3625"
         y="63.900002"
         id="rect417"
         style="stroke-linecap:butt;stroke-linejoin:round;stroke-miterlimit:100000" />
    </clipPath>
  </defs>
</svg>
