<?xml version="1.0" encoding="UTF-8" standalone="no"?>
<svg width="60px" height="60px" viewBox="0 0 60 60" version="1.1" xmlns="http://www.w3.org/2000/svg" xmlns:xlink="http://www.w3.org/1999/xlink">
    <!-- Generator: Sketch 3.6.1 (26313) - http://www.bohemiancoding.com/sketch -->
    <title>Tree</title>
    <desc>Created with Sketch.</desc>
    <defs></defs>
    <g id="flat" stroke="none" stroke-width="1" fill="none" fill-rule="evenodd">
        <g id="Tree" transform="translate(10.000000, 2.000000)" stroke-width="2" stroke-linecap="round" stroke-linejoin="round">
            <path d="M14.8066217,31.5473916 C16.3203322,32.4690897 18.0981657,33 20,33 C22.6232691,33 25.0106182,31.9899068 26.7943269,30.3374409 C27.4266254,30.75616 28.1848367,31 29,31 C30.2525575,31 31.3706485,30.4242802 32.1040872,29.5230264 C32.6683232,29.8273085 33.3139944,30 34,30 C36.209139,30 38,28.209139 38,26 C38,25.3875485 37.8623554,24.8072456 37.6163134,24.2883385 C39.6715914,22.7368515 41,20.273559 41,17.5 C41,13.5779542 38.3436691,10.2763278 34.7319497,9.29606302 C33.9457529,7.0636322 31.8763552,5.43611828 29.4092842,5.29904871 C27.480395,2.12227683 23.9880396,0 20,0 C16.1305674,0 12.7277736,1.99791805 10.7669359,5.01843678 C10.3718805,4.91805465 9.95805339,4.86470767 9.53176644,4.86470767 C6.85158632,4.86470767 4.66394096,6.97349967 4.53753582,9.6223782 C1.80541161,11.407443 0,14.4928833 0,18 C0,22.2275143 2.62328785,25.8423268 6.33084195,27.3054161 C6.29929301,27.5324239 6.28298514,27.7643075 6.28298514,28 C6.28298514,30.7614237 8.52156139,33 11.2829851,33 C12.6576555,33 13.9027554,32.4452428 14.8066217,31.5473916 Z" id="Oval-923" stroke="#9AB040" fill="#C1DB66"></path>
            <path d="M9,18 C12.3137085,18 15,15.3137085 15,12" id="Oval-928" stroke="#9AB040" transform="translate(12.000000, 15.000000) rotate(-102.000000) translate(-12.000000, -15.000000) "></path>
            <path d="M15,21 C18.3137085,21 21,18.3137085 21,15" id="Oval-929" stroke="#9AB040" transform="translate(18.000000, 18.000000) scale(-1, 1) rotate(-102.000000) translate(-18.000000, -18.000000) "></path>
            <path d="M28,21 C31.3137085,21 34,18.3137085 34,15" id="Oval-930" stroke="#9AB040" transform="translate(31.000000, 18.000000) scale(-1, 1) rotate(-31.000000) translate(-31.000000, -18.000000) "></path>
            <rect id="Rectangle-1113" stroke="#A48659" fill="#A48659" x="17" y="33" width="6" height="22"></rect>
            <path d="M10,55.0101891 L30.231554,55.0101891" id="Line" stroke="#89714D"></path>
        </g>
        <g id="Activities_sliced" transform="translate(-120.000000, -1200.000000)"></g>
    </g>
</svg>