<?xml version="1.0" encoding="UTF-8" standalone="no"?>
<svg width="60px" height="60px" viewBox="0 0 60 60" version="1.1" xmlns="http://www.w3.org/2000/svg" xmlns:xlink="http://www.w3.org/1999/xlink">
    <!-- Generator: Sketch 3.6.1 (26313) - http://www.bohemiancoding.com/sketch -->
    <title>Ecology</title>
    <desc>Created with Sketch.</desc>
    <defs></defs>
    <g id="flat" stroke="none" stroke-width="1" fill="none" fill-rule="evenodd">
        <g id="Ecology" transform="translate(2.000000, 2.000000)" stroke-width="2" stroke-linecap="round" stroke-linejoin="round">
            <path d="M4.29681794,41.8561276 C5.44254062,43.0885231 17.1888283,51.1785593 17.5362043,51.8728543 C17.8835802,52.5671494 20.8521687,57.4846084 24.1939738,55.4165907 C27.535779,53.3485729 25.4920016,43.5964366 24.842988,42.7262823 C24.1939745,41.856128 15.5418234,34.0812212 15.5418234,34.0812212 C15.5418234,34.0812212 13.6908298,33.7150932 12.9620035,34.6172639 C12.2331772,35.5194347 12.7388048,36.8538244 12.7388048,36.8538244 L16.8922212,41.5997693 L8.87422033,37.9238517 L4.11706982,25.7693573 C4.11706982,25.7693573 3.27916002,24.6972719 1.66943104,25.2333146 C0.059702072,25.7693573 0.679444283,27.8222821 0.679444283,27.8222821 C0.679444283,27.8222821 3.15109526,40.6237321 4.29681794,41.8561276 Z" id="Path-2186" stroke="#E1AD99" fill="#FCD1C0"></path>
            <path d="M34.2968179,41.8561276 C35.4425406,43.0885231 47.1888283,51.1785593 47.5362043,51.8728543 C47.8835802,52.5671494 50.8521687,57.4846084 54.1939738,55.4165907 C57.535779,53.3485729 55.4920016,43.5964366 54.842988,42.7262823 C54.1939745,41.856128 45.5418234,34.0812212 45.5418234,34.0812212 C45.5418234,34.0812212 43.6908298,33.7150932 42.9620035,34.6172639 C42.2331772,35.5194347 42.7388048,36.8538244 42.7388048,36.8538244 L46.8922212,41.5997693 L38.8742203,37.9238517 L34.1170698,25.7693573 C34.1170698,25.7693573 33.27916,24.6972719 31.669431,25.2333146 C30.0597021,25.7693573 30.6794443,27.8222821 30.6794443,27.8222821 C30.6794443,27.8222821 33.1510953,40.6237321 34.2968179,41.8561276 Z" id="Path-2187" stroke="#E1AD99" fill="#FCD1C0" transform="translate(43.309579, 40.501986) scale(-1, 1) translate(-43.309579, -40.501986) "></path>
            <path d="M38.960643,32.9940539 C44.7706122,30.3555874 48.8110297,24.5025649 48.8110297,17.7058523 C48.8110297,10.9091398 44.7706122,5.0561173 38.960643,2.4176508 C33.1506739,5.0561173 29.1102564,10.9091398 29.1102564,17.7058523 C29.1102564,24.5025649 33.1506739,30.3555874 38.960643,32.9940539 L38.960643,32.9940539 Z" id="Oval-929" stroke="#9AB040" fill="#9AB040" transform="translate(38.960643, 17.705852) rotate(46.000000) translate(-38.960643, -17.705852) "></path>
            <path d="M16.1599346,20.67359 C19.4013408,19.2015784 21.6555067,15.9361526 21.6555067,12.1442381 C21.6555067,8.35232361 19.4013408,5.08689777 16.1599346,3.61488622 C12.9185284,5.08689777 10.6643625,8.35232361 10.6643625,12.1442381 C10.6643625,15.9361526 12.9185284,19.2015784 16.1599346,20.67359 L16.1599346,20.67359 Z" id="Oval-929" stroke="#9AB040" fill="#9AB040" transform="translate(16.159935, 12.144238) rotate(-34.000000) translate(-16.159935, -12.144238) "></path>
            <path d="M24.7136327,33.7205043 C24.7136327,33.7205043 30.0180594,22.6820363 37.6576017,17.6355259" id="Path-2189" stroke="#C1DB66"></path>
            <path d="M22.4071919,24.3915057 C22.4071919,24.3915057 21.0852098,17.2519472 17.8157576,13.4893228" id="Path-2191" stroke="#C1DB66"></path>
        </g>
        <g id="Activities_sliced" transform="translate(-240.000000, -1200.000000)"></g>
    </g>
</svg>