[2022-02-16 09:18:43] [INFO   ] Initializing ProtocolHandler ["http-nio-auto-1"] 
[2022-02-16 09:18:43] [INFO   ] Using a shared selector for servlet write/read 
[2022-02-16 09:18:44] [INFO   ] Starting service [Tomcat] 
[2022-02-16 09:18:44] [INFO   ] Starting Servlet engine: [Apache Tomcat/8.5.69] 
[2022-02-16 09:18:44] [INFO   ] Starting ProtocolHandler ["http-nio-auto-1-35747"] 
[2022-02-16 09:18:45] [INFO   ] Pausing ProtocolHandler ["http-nio-auto-1-35747"] 
[2022-02-16 09:18:45] [INFO   ] Stopping service [Tomcat] 
[2022-02-16 09:18:45] [WARNING] When running on Java 9 or later you need to add "--add-opens=java.base/java.io=null" to the JVM command line arguments to enable ObjectStream cache memory leak protection. Alternatively, you can suppress this warning by disabling ObjectStream class cache memory leak protection. 
[2022-02-16 09:18:45] [WARNING] When running on Java 9 or later you need to add "--add-opens=java.rmi/sun.rmi.transport=null" to the JVM command line arguments to enable RMI Target memory leak detection. Alternatively, you can suppress this warning by disabling RMI Target memory leak detection. 
[2022-02-16 09:18:45] [INFO   ] Stopping ProtocolHandler ["http-nio-auto-1-35747"] 
