<?xml version="1.0" encoding="UTF-8" standalone="no"?>
<!DOCTYPE log SYSTEM "logger.dtd">
<log>
<record>
  <date>2022-07-20T12:42:03.674264Z</date>
  <millis>1658320923674</millis>
  <nanos>264000</nanos>
  <sequence>1</sequence>
  <logger>org.apache.coyote.http11.Http11NioProtocol</logger>
  <level>INFO</level>
  <class>org.apache.coyote.AbstractProtocol</class>
  <method>init</method>
  <thread>14</thread>
  <message>Initializing ProtocolHandler ["http-nio-auto-1"]</message>
</record>
<record>
  <date>2022-07-20T12:42:03.696311Z</date>
  <millis>1658320923696</millis>
  <nanos>311000</nanos>
  <sequence>2</sequence>
  <logger>org.apache.tomcat.util.net.NioSelectorPool</logger>
  <level>INFO</level>
  <class>org.apache.tomcat.util.net.NioSelectorPool</class>
  <method>getSharedSelector</method>
  <thread>14</thread>
  <message>Using a shared selector for servlet write/read</message>
</record>
<record>
  <date>2022-07-20T12:42:03.709018Z</date>
  <millis>1658320923709</millis>
  <nanos>18000</nanos>
  <sequence>3</sequence>
  <logger>org.apache.catalina.core.StandardService</logger>
  <level>INFO</level>
  <class>org.apache.catalina.core.StandardService</class>
  <method>startInternal</method>
  <thread>14</thread>
  <message>Starting service [Tomcat]</message>
</record>
<record>
  <date>2022-07-20T12:42:03.709945Z</date>
  <millis>1658320923709</millis>
  <nanos>945000</nanos>
  <sequence>4</sequence>
  <logger>org.apache.catalina.core.StandardEngine</logger>
  <level>INFO</level>
  <class>org.apache.catalina.core.StandardEngine</class>
  <method>startInternal</method>
  <thread>14</thread>
  <message>Starting Servlet engine: [Apache Tomcat/8.5.69]</message>
</record>
<record>
  <date>2022-07-20T12:42:03.806049Z</date>
  <millis>1658320923806</millis>
  <nanos>49000</nanos>
  <sequence>5</sequence>
  <logger>org.apache.coyote.http11.Http11NioProtocol</logger>
  <level>INFO</level>
  <class>org.apache.coyote.AbstractProtocol</class>
  <method>start</method>
  <thread>14</thread>
  <message>Starting ProtocolHandler ["http-nio-auto-1-49441"]</message>
</record>
<record>
  <date>2022-07-20T12:42:04.066694Z</date>
  <millis>1658320924066</millis>
  <nanos>694000</nanos>
  <sequence>6</sequence>
  <logger>exercise.servlet.SessionServlet</logger>
  <level>INFO</level>
  <class>exercise.servlet.SessionServlet</class>
  <method>login</method>
  <thread>21</thread>
  <message>User incorrect@gmail.com trying to login</message>
</record>
<record>
  <date>2022-07-20T12:42:04.069109Z</date>
  <millis>1658320924069</millis>
  <nanos>109000</nanos>
  <sequence>7</sequence>
  <logger>exercise.servlet.SessionServlet</logger>
  <level>INFO</level>
  <class>exercise.servlet.SessionServlet</class>
  <method>login</method>
  <thread>21</thread>
  <message>Не уcпешный вход: incorrect@gmail.com</message>
</record>
<record>
  <date>2022-07-20T12:42:04.785210Z</date>
  <millis>1658320924785</millis>
  <nanos>210000</nanos>
  <sequence>8</sequence>
  <logger>org.apache.coyote.http11.Http11NioProtocol</logger>
  <level>INFO</level>
  <class>org.apache.coyote.AbstractProtocol</class>
  <method>pause</method>
  <thread>14</thread>
  <message>Pausing ProtocolHandler ["http-nio-auto-1-49441"]</message>
</record>
<record>
  <date>2022-07-20T12:42:04.800807Z</date>
  <millis>1658320924800</millis>
  <nanos>807000</nanos>
  <sequence>9</sequence>
  <logger>org.apache.catalina.core.StandardService</logger>
  <level>INFO</level>
  <class>org.apache.catalina.core.StandardService</class>
  <method>stopInternal</method>
  <thread>14</thread>
  <message>Stopping service [Tomcat]</message>
</record>
<record>
  <date>2022-07-20T12:42:04.811092Z</date>
  <millis>1658320924811</millis>
  <nanos>92000</nanos>
  <sequence>10</sequence>
  <logger>org.apache.catalina.loader.WebappClassLoaderBase</logger>
  <level>WARNING</level>
  <class>org.apache.catalina.loader.WebappClassLoaderBase</class>
  <method>clearReferencesObjectStreamClassCaches</method>
  <thread>19</thread>
  <message>When running on Java 9 or later you need to add "--add-opens=java.base/java.io=null" to the JVM command line arguments to enable ObjectStream cache memory leak protection. Alternatively, you can suppress this warning by disabling ObjectStream class cache memory leak protection.</message>
</record>
<record>
  <date>2022-07-20T12:42:04.813221Z</date>
  <millis>1658320924813</millis>
  <nanos>221000</nanos>
  <sequence>11</sequence>
  <logger>org.apache.catalina.loader.WebappClassLoaderBase</logger>
  <level>WARNING</level>
  <class>org.apache.catalina.loader.WebappClassLoaderBase</class>
  <method>clearReferencesRmiTargets</method>
  <thread>19</thread>
  <message>When running on Java 9 or later you need to add "--add-opens=java.rmi/sun.rmi.transport=null" to the JVM command line arguments to enable RMI Target memory leak detection. Alternatively, you can suppress this warning by disabling RMI Target memory leak detection.</message>
</record>
<record>
  <date>2022-07-20T12:42:04.817108Z</date>
  <millis>1658320924817</millis>
  <nanos>108000</nanos>
  <sequence>12</sequence>
  <logger>org.apache.coyote.http11.Http11NioProtocol</logger>
  <level>INFO</level>
  <class>org.apache.coyote.AbstractProtocol</class>
  <method>stop</method>
  <thread>14</thread>
  <message>Stopping ProtocolHandler ["http-nio-auto-1-49441"]</message>
</record>
</log>
