// Jest Snapshot v1, https://goo.gl/fbAQLP

exports[`should create tasks, finish them and activate back 1`] = `
<DocumentFragment>
  <div>
    <div
      class="mb-3"
    >
      <form
        class="todo-form form-inline mx-3"
      >
        <div
          class="form-group"
        >
          <input
            class="form-control mr-3"
            placeholder="I am going..."
            required=""
            type="text"
            value=""
          />
        </div>
        <button
          class="btn btn-primary"
          type="submit"
        >
          add
        </button>
      </form>
    </div>
    <div
      class="todo-active-tasks"
    >
      <div
        class="row"
      >
        <div
          class="col-1"
        >
          3
        </div>
        <div
          class="col"
        >
          <a
            class="todo-task"
            href="#"
          >
            third
          </a>
        </div>
      </div>
      <div
        class="row"
      >
        <div
          class="col-1"
        >
          2
        </div>
        <div
          class="col"
        >
          <a
            class="todo-task"
            href="#"
          >
            second
          </a>
        </div>
      </div>
      <div
        class="row"
      >
        <div
          class="col-1"
        >
          1
        </div>
        <div
          class="col"
        >
          <a
            class="todo-task"
            href="#"
          >
            first
          </a>
        </div>
      </div>
    </div>
  </div>
</DocumentFragment>
`;
