{
    "env": {
        "browser": true,
        "commonjs": true,
        "es2021": true,
        "jest": true
    },
    "extends": [
        "airbnb-base"
    ],
    "parserOptions": {
        "ecmaFeatures": {
            "jsx": true
        },
        "ecmaVersion": 12,
        "sourceType": "module"
    },
    "plugins": [
            "jest"
    ],
    "rules": {
        "jest/no-disabled-tests": "warn",
        "jest/no-focused-tests": "error",
        "jest/no-identical-title": "error",
        "jest/prefer-to-have-length": "warn",
        "jest/valid-expect": "error"
    }
}
