{
  "kind": "collectionType",
  "collectionName": "categories",
  "info": {
    "name": "Category"
  },
  "options": {
    "increments": true,
    "timestamps": true,
    "draftAndPublish": true
  },
  "pluginOptions": {},
  "attributes": {
    "name": {
      "type": "string",
      "unique": true,
      "required": true
    },
    "restaurants": {
      "collection": "restaurant",
      "via": "categories",
      "dominant": true
    }
  }
}
