current directory: /vagrant/blog/BUNDLE_PATH=/home/vagrant/.gem/ruby/2.7.0/gems/ruby/2.7.0/gems/racc-1.5.2/ext/racc/cparse
/usr/bin/ruby2.7 -I /usr/lib/ruby/2.7.0 -r ./siteconf20210628-11608-1aratt3.rb extconf.rb
checking for rb_ary_subseq()... *** extconf.rb failed ***
Could not create Makefile due to some reason, probably lack of necessary
libraries and/or headers.  Check the mkmf.log file for more details.  You may
need configuration options.

Provided configuration options:
	--with-opt-dir
	--without-opt-dir
	--with-opt-include
	--without-opt-include=${opt-dir}/include
	--with-opt-lib
	--without-opt-lib=${opt-dir}/lib
	--with-make-prog
	--without-make-prog
	--srcdir=.
	--curdir
	--ruby=/usr/bin/$(RUBY_BASE_NAME)2.7
/usr/lib/ruby/2.7.0/mkmf.rb:471:in `try_do': The compiler failed to generate an executable file. (RuntimeError)
You have to install development tools first.
	from /usr/lib/ruby/2.7.0/mkmf.rb:564:in `try_link0'
	from /usr/lib/ruby/2.7.0/mkmf.rb:582:in `try_link'
	from /usr/lib/ruby/2.7.0/mkmf.rb:794:in `try_func'
	from /usr/lib/ruby/2.7.0/mkmf.rb:1083:in `block in have_func'
	from /usr/lib/ruby/2.7.0/mkmf.rb:971:in `block in checking_for'
	from /usr/lib/ruby/2.7.0/mkmf.rb:361:in `block (2 levels) in postpone'
	from /usr/lib/ruby/2.7.0/mkmf.rb:331:in `open'
	from /usr/lib/ruby/2.7.0/mkmf.rb:361:in `block in postpone'
	from /usr/lib/ruby/2.7.0/mkmf.rb:331:in `open'
	from /usr/lib/ruby/2.7.0/mkmf.rb:357:in `postpone'
	from /usr/lib/ruby/2.7.0/mkmf.rb:970:in `checking_for'
	from /usr/lib/ruby/2.7.0/mkmf.rb:1082:in `have_func'
	from extconf.rb:6:in `<main>'

To see why this extension failed to compile, please check the mkmf.log which can be found here:

  /vagrant/blog/BUNDLE_PATH=/home/vagrant/.gem/ruby/2.7.0/gems/ruby/2.7.0/extensions/x86_64-linux/2.7.0/racc-1.5.2/mkmf.log

extconf failed, exit code 1
