{
    "language": "en",
    "dictionaryDefinitions": [
      {
        "name": "russian",
        "file": "./node_modules/@cspell/dict-ru_ru/ru_ru.trie.gz",
        "description": "Russian Dictionary"
      }
    ],
    "ignorePaths": ["node_modules/**"],
    "dictionaries": [
        "russian"
    ],
    "allowCompoundWords": true,
    "words": ["fastify"]
}
