{
 "files": [
  {
   "name": ".",
   "ftype": "dir",
   "chksum_type": null,
   "chksum_sha256": null,
   "format": 1
  },
  {
   "name": "scripts",
   "ftype": "dir",
   "chksum_type": null,
   "chksum_sha256": null,
   "format": 1
  },
  {
   "name": "scripts/inventory",
   "ftype": "dir",
   "chksum_type": null,
   "chksum_sha256": null,
   "format": 1
  },
  {
   "name": "scripts/inventory/digital_ocean.ini",
   "ftype": "file",
   "chksum_type": "sha256",
   "chksum_sha256": "5e4ba7e652f9e7d46868d32bf08047bd209745e72d6fd3599665c15c013c77a9",
   "format": 1
  },
  {
   "name": "scripts/inventory/digital_ocean.py",
   "ftype": "file",
   "chksum_type": "sha256",
   "chksum_sha256": "98adc67c72a55d3140362e5dc79138aaf8896fca9d83a40ee2cada6fed368e78",
   "format": 1
  },
  {
   "name": "plugins",
   "ftype": "dir",
   "chksum_type": null,
   "chksum_sha256": null,
   "format": 1
  },
  {
   "name": "plugins/module_utils",
   "ftype": "dir",
   "chksum_type": null,
   "chksum_sha256": null,
   "format": 1
  },
  {
   "name": "plugins/module_utils/digital_ocean.py",
   "ftype": "file",
   "chksum_type": "sha256",
   "chksum_sha256": "229cd6566d858fddff80a9b9383b371a2e5d04e8ea2047a355e74625f1169015",
   "format": 1
  },
  {
   "name": "plugins/inventory",
   "ftype": "dir",
   "chksum_type": null,
   "chksum_sha256": null,
   "format": 1
  },
  {
   "name": "plugins/inventory/digitalocean.py",
   "ftype": "file",
   "chksum_type": "sha256",
   "chksum_sha256": "a2d8215de4c297abb926b347a11ea6c98acce780e992216bea38525bccff8f2c",
   "format": 1
  },
  {
   "name": "plugins/modules",
   "ftype": "dir",
   "chksum_type": null,
   "chksum_sha256": null,
   "format": 1
  },
  {
   "name": "plugins/modules/digital_ocean_firewall.py",
   "ftype": "file",
   "chksum_type": "sha256",
   "chksum_sha256": "171864a6fdffe5775bbdb05587017f003529f8aa0927121dc656f90535316bb6",
   "format": 1
  },
  {
   "name": "plugins/modules/digital_ocean_tag.py",
   "ftype": "file",
   "chksum_type": "sha256",
   "chksum_sha256": "83131aaa2cb0861adf5ce09b04b655316aa46f389f863eca96678700a5c4ca17",
   "format": 1
  },
  {
   "name": "plugins/modules/digital_ocean_region_facts.py",
   "ftype": "file",
   "chksum_type": "sha256",
   "chksum_sha256": "4f1bf200afa6042f2ec72ba3e6189e45058814de91e982c9a2700051878ea198",
   "format": 1
  },
  {
   "name": "plugins/modules/digital_ocean_kubernetes.py",
   "ftype": "file",
   "chksum_type": "sha256",
   "chksum_sha256": "f25c9c38292097c942e740ec8a83c0eb8286078fc75193f3c97ed342118424c6",
   "format": 1
  },
  {
   "name": "plugins/modules/digital_ocean_domain_record.py",
   "ftype": "file",
   "chksum_type": "sha256",
   "chksum_sha256": "ead80d69d2e08b283740519dab84aa32a7d8fb48ec549fe4eeef1d05fe32ce84",
   "format": 1
  },
  {
   "name": "plugins/modules/digital_ocean_certificate_info.py",
   "ftype": "file",
   "chksum_type": "sha256",
   "chksum_sha256": "e8ad56f262d4129afc15e860d150e69375317bfd283805cd0e2c2b93522c6235",
   "format": 1
  },
  {
   "name": "plugins/modules/digital_ocean_snapshot_facts.py",
   "ftype": "file",
   "chksum_type": "sha256",
   "chksum_sha256": "9735106e2afe8fd4328c1d7b992758e163166e69135c866d2bc8b54f3df52d81",
   "format": 1
  },
  {
   "name": "plugins/modules/digital_ocean_volume_info.py",
   "ftype": "file",
   "chksum_type": "sha256",
   "chksum_sha256": "e9f2572886efbcc448afad524b07e3e781dbd925d69f7e4bf21498b85c9f321c",
   "format": 1
  },
  {
   "name": "plugins/modules/digital_ocean_region_info.py",
   "ftype": "file",
   "chksum_type": "sha256",
   "chksum_sha256": "4f1bf200afa6042f2ec72ba3e6189e45058814de91e982c9a2700051878ea198",
   "format": 1
  },
  {
   "name": "plugins/modules/digital_ocean_domain_facts.py",
   "ftype": "file",
   "chksum_type": "sha256",
   "chksum_sha256": "88021b90576d008843c33d6c497f3c98330a2ea74150442b08e8934827e9a5fe",
   "format": 1
  },
  {
   "name": "plugins/modules/digital_ocean_droplet_info.py",
   "ftype": "file",
   "chksum_type": "sha256",
   "chksum_sha256": "7ffe450f924bdcc661d18a973230f7954a3fc9436dcfe2c712c38dcd83447212",
   "format": 1
  },
  {
   "name": "plugins/modules/digital_ocean_project_info.py",
   "ftype": "file",
   "chksum_type": "sha256",
   "chksum_sha256": "0fee06df134a5a15725f9835ca2c746a41f453836b7ec3bd15f46ecf12e02bce",
   "format": 1
  },
  {
   "name": "plugins/modules/digital_ocean_domain.py",
   "ftype": "file",
   "chksum_type": "sha256",
   "chksum_sha256": "1a7af88d25ba9603d5b7cc8305dd809fa603068d2aa96775af34481624836246",
   "format": 1
  },
  {
   "name": "plugins/modules/digital_ocean_floating_ip_info.py",
   "ftype": "file",
   "chksum_type": "sha256",
   "chksum_sha256": "17fc8149b4af64cd980a28a14d2b9b40a4e2bfd824d95d447fc1230b6acf15fd",
   "format": 1
  },
  {
   "name": "plugins/modules/digital_ocean.py",
   "ftype": "file",
   "chksum_type": "sha256",
   "chksum_sha256": "677cc32ef4373121f643b4da20ea71dac0d133555fae657efafbf6d019c7d79f",
   "format": 1
  },
  {
   "name": "plugins/modules/digital_ocean_image_facts.py",
   "ftype": "file",
   "chksum_type": "sha256",
   "chksum_sha256": "46a97a794030823a528e2ca0e6a8a196a08b8cb6b1eddee1d8efbd7f5c5b70f9",
   "format": 1
  },
  {
   "name": "plugins/modules/digital_ocean_floating_ip.py",
   "ftype": "file",
   "chksum_type": "sha256",
   "chksum_sha256": "f617b94f81c894f922ceadf2176062dd312ca73299561ab6cd972e5ba347016d",
   "format": 1
  },
  {
   "name": "plugins/modules/digital_ocean_firewall_facts.py",
   "ftype": "file",
   "chksum_type": "sha256",
   "chksum_sha256": "9ebb51f0df000d586ae7ae44e18d18128ee516a85671b6fb35c23a33ce54031a",
   "format": 1
  },
  {
   "name": "plugins/modules/digital_ocean_floating_ip_facts.py",
   "ftype": "file",
   "chksum_type": "sha256",
   "chksum_sha256": "17fc8149b4af64cd980a28a14d2b9b40a4e2bfd824d95d447fc1230b6acf15fd",
   "format": 1
  },
  {
   "name": "plugins/modules/digital_ocean_droplet.py",
   "ftype": "file",
   "chksum_type": "sha256",
   "chksum_sha256": "773b8c8b5d394b5c4ccbcf2b6163b5159984a7f3aea61b7cd4d4d243f6f825b2",
   "format": 1
  },
  {
   "name": "plugins/modules/digital_ocean_sshkey_facts.py",
   "ftype": "file",
   "chksum_type": "sha256",
   "chksum_sha256": "8db210297724542d3659935b046ddb0cf32f6ecdec25562969f04bddb13ac71a",
   "format": 1
  },
  {
   "name": "plugins/modules/digital_ocean_database_info.py",
   "ftype": "file",
   "chksum_type": "sha256",
   "chksum_sha256": "232619cec7d94e0e31cb37d7f741cfa264952324d8e551165960fba933b5d907",
   "format": 1
  },
  {
   "name": "plugins/modules/digital_ocean_tag_facts.py",
   "ftype": "file",
   "chksum_type": "sha256",
   "chksum_sha256": "27aacc7dc4082e446d95c628d8e19d30a2f56cc11a525af92a4be44809a89123",
   "format": 1
  },
  {
   "name": "plugins/modules/digital_ocean_image_info.py",
   "ftype": "file",
   "chksum_type": "sha256",
   "chksum_sha256": "46a97a794030823a528e2ca0e6a8a196a08b8cb6b1eddee1d8efbd7f5c5b70f9",
   "format": 1
  },
  {
   "name": "plugins/modules/digital_ocean_vpc.py",
   "ftype": "file",
   "chksum_type": "sha256",
   "chksum_sha256": "139ddc9a7e420a344f285ae8dd5a279248ea0c0efdd5fe2e0d2aceacff1d77f1",
   "format": 1
  },
  {
   "name": "plugins/modules/digital_ocean_snapshot.py",
   "ftype": "file",
   "chksum_type": "sha256",
   "chksum_sha256": "3bee602b4d1f1832025a5bb7aae77d6293c23bb88a58ad557f0caa38265bf368",
   "format": 1
  },
  {
   "name": "plugins/modules/digital_ocean_account_info.py",
   "ftype": "file",
   "chksum_type": "sha256",
   "chksum_sha256": "3a28feecfd9c51ae219d5ce7d9834cc83f66effcb2203609fcab2eab20dd348a",
   "format": 1
  },
  {
   "name": "plugins/modules/digital_ocean_firewall_info.py",
   "ftype": "file",
   "chksum_type": "sha256",
   "chksum_sha256": "9ebb51f0df000d586ae7ae44e18d18128ee516a85671b6fb35c23a33ce54031a",
   "format": 1
  },
  {
   "name": "plugins/modules/digital_ocean_certificate.py",
   "ftype": "file",
   "chksum_type": "sha256",
   "chksum_sha256": "9a5c491f07aacc64f2ff4111f3549dbe43619ee6edf9c51a0414f9f34046e719",
   "format": 1
  },
  {
   "name": "plugins/modules/digital_ocean_volume_facts.py",
   "ftype": "file",
   "chksum_type": "sha256",
   "chksum_sha256": "e9f2572886efbcc448afad524b07e3e781dbd925d69f7e4bf21498b85c9f321c",
   "format": 1
  },
  {
   "name": "plugins/modules/digital_ocean_size_facts.py",
   "ftype": "file",
   "chksum_type": "sha256",
   "chksum_sha256": "157c196ea523abd6374e22bf8825e30ede51b9d55c4175d0be02475fe6aa91cb",
   "format": 1
  },
  {
   "name": "plugins/modules/digital_ocean_balance_info.py",
   "ftype": "file",
   "chksum_type": "sha256",
   "chksum_sha256": "cd8f32c0601999af0495592645d2551692740dc7f0693dd08777df7a599eab04",
   "format": 1
  },
  {
   "name": "plugins/modules/digital_ocean_kubernetes_info.py",
   "ftype": "file",
   "chksum_type": "sha256",
   "chksum_sha256": "6e9d559e9b5485f6b3cefb53b31d14c808f13e2530a3503c9c703ee50d5a5a3b",
   "format": 1
  },
  {
   "name": "plugins/modules/digital_ocean_snapshot_info.py",
   "ftype": "file",
   "chksum_type": "sha256",
   "chksum_sha256": "9735106e2afe8fd4328c1d7b992758e163166e69135c866d2bc8b54f3df52d81",
   "format": 1
  },
  {
   "name": "plugins/modules/digital_ocean_domain_info.py",
   "ftype": "file",
   "chksum_type": "sha256",
   "chksum_sha256": "88021b90576d008843c33d6c497f3c98330a2ea74150442b08e8934827e9a5fe",
   "format": 1
  },
  {
   "name": "plugins/modules/digital_ocean_certificate_facts.py",
   "ftype": "file",
   "chksum_type": "sha256",
   "chksum_sha256": "e8ad56f262d4129afc15e860d150e69375317bfd283805cd0e2c2b93522c6235",
   "format": 1
  },
  {
   "name": "plugins/modules/digital_ocean_block_storage.py",
   "ftype": "file",
   "chksum_type": "sha256",
   "chksum_sha256": "4f05235f42c134b5ebea2c02e95dc5f673f05fb767bd912e4ef83825ac771011",
   "format": 1
  },
  {
   "name": "plugins/modules/digital_ocean_tag_info.py",
   "ftype": "file",
   "chksum_type": "sha256",
   "chksum_sha256": "27aacc7dc4082e446d95c628d8e19d30a2f56cc11a525af92a4be44809a89123",
   "format": 1
  },
  {
   "name": "plugins/modules/digital_ocean_load_balancer_info.py",
   "ftype": "file",
   "chksum_type": "sha256",
   "chksum_sha256": "e4ccb5958c9e32c8fed8bd4dcf11ed5e0e65c24003ead5a0826356c78bccaad9",
   "format": 1
  },
  {
   "name": "plugins/modules/digital_ocean_size_info.py",
   "ftype": "file",
   "chksum_type": "sha256",
   "chksum_sha256": "157c196ea523abd6374e22bf8825e30ede51b9d55c4175d0be02475fe6aa91cb",
   "format": 1
  },
  {
   "name": "plugins/modules/digital_ocean_vpc_info.py",
   "ftype": "file",
   "chksum_type": "sha256",
   "chksum_sha256": "2b185323f8bf8ab21df5e40e1a93a323fbc1b5886a7f98edac41726b564e582f",
   "format": 1
  },
  {
   "name": "plugins/modules/digital_ocean_database.py",
   "ftype": "file",
   "chksum_type": "sha256",
   "chksum_sha256": "08af50c308fc9b6e903680e3dfef86507df99ca8010f88a65373aa2b1b94b167",
   "format": 1
  },
  {
   "name": "plugins/modules/digital_ocean_project.py",
   "ftype": "file",
   "chksum_type": "sha256",
   "chksum_sha256": "5affe206bfa330e5a366f8bc9596ae8a6fe6f3fe5069ddad4adc1356b89f3221",
   "format": 1
  },
  {
   "name": "plugins/modules/digital_ocean_sshkey_info.py",
   "ftype": "file",
   "chksum_type": "sha256",
   "chksum_sha256": "8db210297724542d3659935b046ddb0cf32f6ecdec25562969f04bddb13ac71a",
   "format": 1
  },
  {
   "name": "plugins/modules/digital_ocean_account_facts.py",
   "ftype": "file",
   "chksum_type": "sha256",
   "chksum_sha256": "3a28feecfd9c51ae219d5ce7d9834cc83f66effcb2203609fcab2eab20dd348a",
   "format": 1
  },
  {
   "name": "plugins/modules/digital_ocean_load_balancer_facts.py",
   "ftype": "file",
   "chksum_type": "sha256",
   "chksum_sha256": "e4ccb5958c9e32c8fed8bd4dcf11ed5e0e65c24003ead5a0826356c78bccaad9",
   "format": 1
  },
  {
   "name": "plugins/modules/digital_ocean_sshkey.py",
   "ftype": "file",
   "chksum_type": "sha256",
   "chksum_sha256": "4328cc4ebdaabb39b1961bbc68c04c17bd77de44ecfb2b2af9a0449c09fa69a8",
   "format": 1
  },
  {
   "name": "plugins/doc_fragments",
   "ftype": "dir",
   "chksum_type": null,
   "chksum_sha256": null,
   "format": 1
  },
  {
   "name": "plugins/doc_fragments/digital_ocean.py",
   "ftype": "file",
   "chksum_type": "sha256",
   "chksum_sha256": "2ce6b55875cc23194814dd177753d63599c29e1fa8717163c12716de0a576e99",
   "format": 1
  },
  {
   "name": "meta",
   "ftype": "dir",
   "chksum_type": null,
   "chksum_sha256": null,
   "format": 1
  },
  {
   "name": "meta/runtime.yml",
   "ftype": "file",
   "chksum_type": "sha256",
   "chksum_sha256": "2c5f058e0f2c076af1779da80f87ee78dc02cdeb776d4361604803f6203e60c4",
   "format": 1
  },
  {
   "name": ".github",
   "ftype": "dir",
   "chksum_type": null,
   "chksum_sha256": null,
   "format": 1
  },
  {
   "name": ".github/workflows",
   "ftype": "dir",
   "chksum_type": null,
   "chksum_sha256": null,
   "format": 1
  },
  {
   "name": ".github/workflows/ansible-test-unit.yml",
   "ftype": "file",
   "chksum_type": "sha256",
   "chksum_sha256": "f3f2b0535ddb5f7b48200c15312bb3ee37b0d99be398e9db79572cdd4f436f15",
   "format": 1
  },
  {
   "name": ".github/workflows/ansible-test-sanity.yml",
   "ftype": "file",
   "chksum_type": "sha256",
   "chksum_sha256": "2bd819cde89b7abc2a8f825a9dbcf842f666bcf662b6b8a9ab64ff24f51848a7",
   "format": 1
  },
  {
   "name": ".github/workflows/ansible-test-integration.yml",
   "ftype": "file",
   "chksum_type": "sha256",
   "chksum_sha256": "1558e98f2bc51ade8c8159ef264dc3a22725dfc9088f7d5654f3bee8cc404965",
   "format": 1
  },
  {
   "name": "tests",
   "ftype": "dir",
   "chksum_type": null,
   "chksum_sha256": null,
   "format": 1
  },
  {
   "name": "tests/utils",
   "ftype": "dir",
   "chksum_type": null,
   "chksum_sha256": null,
   "format": 1
  },
  {
   "name": "tests/utils/render.sh",
   "ftype": "file",
   "chksum_type": "sha256",
   "chksum_sha256": "28ff6a30a12bbe965b5258aaa33c8d96d5210b3e9f062d38433167ecc6252dca",
   "format": 1
  },
  {
   "name": "tests/integration",
   "ftype": "dir",
   "chksum_type": null,
   "chksum_sha256": null,
   "format": 1
  },
  {
   "name": "tests/integration/integration_config.yml.template",
   "ftype": "file",
   "chksum_type": "sha256",
   "chksum_sha256": "4a3f70e255cfdb1b5464be22b170c96c8b974c9bf6f5ab676afcb4577f25d245",
   "format": 1
  },
  {
   "name": "tests/integration/targets",
   "ftype": "dir",
   "chksum_type": null,
   "chksum_sha256": null,
   "format": 1
  },
  {
   "name": "tests/integration/targets/digital_ocean_droplet",
   "ftype": "dir",
   "chksum_type": null,
   "chksum_sha256": null,
   "format": 1
  },
  {
   "name": "tests/integration/targets/digital_ocean_droplet/aliases",
   "ftype": "file",
   "chksum_type": "sha256",
   "chksum_sha256": "e3b0c44298fc1c149afbf4c8996fb92427ae41e4649b934ca495991b7852b855",
   "format": 1
  },
  {
   "name": "tests/integration/targets/digital_ocean_droplet/defaults",
   "ftype": "dir",
   "chksum_type": null,
   "chksum_sha256": null,
   "format": 1
  },
  {
   "name": "tests/integration/targets/digital_ocean_droplet/defaults/main.yml",
   "ftype": "file",
   "chksum_type": "sha256",
   "chksum_sha256": "c1241ed1c4c938b47adffc4ae65ad79736d4911549a6722fdd972996756da6b5",
   "format": 1
  },
  {
   "name": "tests/integration/targets/digital_ocean_droplet/tasks",
   "ftype": "dir",
   "chksum_type": null,
   "chksum_sha256": null,
   "format": 1
  },
  {
   "name": "tests/integration/targets/digital_ocean_droplet/tasks/main.yml",
   "ftype": "file",
   "chksum_type": "sha256",
   "chksum_sha256": "0658c49dff8192bf993d7ff6ec471c239fcddb2937d5688b4a6f1374bd56996b",
   "format": 1
  },
  {
   "name": "tests/integration/targets/digital_ocean_domain",
   "ftype": "dir",
   "chksum_type": null,
   "chksum_sha256": null,
   "format": 1
  },
  {
   "name": "tests/integration/targets/digital_ocean_domain/aliases",
   "ftype": "file",
   "chksum_type": "sha256",
   "chksum_sha256": "e3b0c44298fc1c149afbf4c8996fb92427ae41e4649b934ca495991b7852b855",
   "format": 1
  },
  {
   "name": "tests/integration/targets/digital_ocean_domain/defaults",
   "ftype": "dir",
   "chksum_type": null,
   "chksum_sha256": null,
   "format": 1
  },
  {
   "name": "tests/integration/targets/digital_ocean_domain/defaults/main.yml",
   "ftype": "file",
   "chksum_type": "sha256",
   "chksum_sha256": "2bf461031dfd7d1fc433ef95a37f6244f1a806d741e607a6c2dc391de29d8a7b",
   "format": 1
  },
  {
   "name": "tests/integration/targets/digital_ocean_domain/tasks",
   "ftype": "dir",
   "chksum_type": null,
   "chksum_sha256": null,
   "format": 1
  },
  {
   "name": "tests/integration/targets/digital_ocean_domain/tasks/main.yml",
   "ftype": "file",
   "chksum_type": "sha256",
   "chksum_sha256": "8bc38995d021352323617389f724023368de090ff1658a0e17804a38597d462a",
   "format": 1
  },
  {
   "name": "tests/integration/targets/digital_ocean_droplet_info",
   "ftype": "dir",
   "chksum_type": null,
   "chksum_sha256": null,
   "format": 1
  },
  {
   "name": "tests/integration/targets/digital_ocean_droplet_info/aliases",
   "ftype": "file",
   "chksum_type": "sha256",
   "chksum_sha256": "e3b0c44298fc1c149afbf4c8996fb92427ae41e4649b934ca495991b7852b855",
   "format": 1
  },
  {
   "name": "tests/integration/targets/digital_ocean_droplet_info/defaults",
   "ftype": "dir",
   "chksum_type": null,
   "chksum_sha256": null,
   "format": 1
  },
  {
   "name": "tests/integration/targets/digital_ocean_droplet_info/defaults/main.yml",
   "ftype": "file",
   "chksum_type": "sha256",
   "chksum_sha256": "f52d711103d50a437830c6fbcd04fb4bab49a0f82f6d26d1c791c6e8488dd090",
   "format": 1
  },
  {
   "name": "tests/integration/targets/digital_ocean_droplet_info/tasks",
   "ftype": "dir",
   "chksum_type": null,
   "chksum_sha256": null,
   "format": 1
  },
  {
   "name": "tests/integration/targets/digital_ocean_droplet_info/tasks/main.yml",
   "ftype": "file",
   "chksum_type": "sha256",
   "chksum_sha256": "7e782ba54577d1e3b4bf63e5a7faa98c7aa058162b0c5acaaaf5449d746e1cde",
   "format": 1
  },
  {
   "name": "tests/integration/targets/digital_ocean_size_info",
   "ftype": "dir",
   "chksum_type": null,
   "chksum_sha256": null,
   "format": 1
  },
  {
   "name": "tests/integration/targets/digital_ocean_size_info/aliases",
   "ftype": "file",
   "chksum_type": "sha256",
   "chksum_sha256": "e3b0c44298fc1c149afbf4c8996fb92427ae41e4649b934ca495991b7852b855",
   "format": 1
  },
  {
   "name": "tests/integration/targets/digital_ocean_size_info/defaults",
   "ftype": "dir",
   "chksum_type": null,
   "chksum_sha256": null,
   "format": 1
  },
  {
   "name": "tests/integration/targets/digital_ocean_size_info/defaults/main.yml",
   "ftype": "file",
   "chksum_type": "sha256",
   "chksum_sha256": "e3b0c44298fc1c149afbf4c8996fb92427ae41e4649b934ca495991b7852b855",
   "format": 1
  },
  {
   "name": "tests/integration/targets/digital_ocean_size_info/tasks",
   "ftype": "dir",
   "chksum_type": null,
   "chksum_sha256": null,
   "format": 1
  },
  {
   "name": "tests/integration/targets/digital_ocean_size_info/tasks/main.yml",
   "ftype": "file",
   "chksum_type": "sha256",
   "chksum_sha256": "086aa0838e94e34ba45b8703a84312621445a48c9d69cd9eac36e645a657221e",
   "format": 1
  },
  {
   "name": "tests/integration/targets/digital_ocean_sshkey_info",
   "ftype": "dir",
   "chksum_type": null,
   "chksum_sha256": null,
   "format": 1
  },
  {
   "name": "tests/integration/targets/digital_ocean_sshkey_info/aliases",
   "ftype": "file",
   "chksum_type": "sha256",
   "chksum_sha256": "e3b0c44298fc1c149afbf4c8996fb92427ae41e4649b934ca495991b7852b855",
   "format": 1
  },
  {
   "name": "tests/integration/targets/digital_ocean_sshkey_info/defaults",
   "ftype": "dir",
   "chksum_type": null,
   "chksum_sha256": null,
   "format": 1
  },
  {
   "name": "tests/integration/targets/digital_ocean_sshkey_info/defaults/main.yml",
   "ftype": "file",
   "chksum_type": "sha256",
   "chksum_sha256": "f52d711103d50a437830c6fbcd04fb4bab49a0f82f6d26d1c791c6e8488dd090",
   "format": 1
  },
  {
   "name": "tests/integration/targets/digital_ocean_sshkey_info/tasks",
   "ftype": "dir",
   "chksum_type": null,
   "chksum_sha256": null,
   "format": 1
  },
  {
   "name": "tests/integration/targets/digital_ocean_sshkey_info/tasks/main.yml",
   "ftype": "file",
   "chksum_type": "sha256",
   "chksum_sha256": "7be10e969f96b28985d4cb0ac34d81edf2cd0d6dad11dae44099148e6d1a0748",
   "format": 1
  },
  {
   "name": "tests/integration/targets/digital_ocean_firewall",
   "ftype": "dir",
   "chksum_type": null,
   "chksum_sha256": null,
   "format": 1
  },
  {
   "name": "tests/integration/targets/digital_ocean_firewall/aliases",
   "ftype": "file",
   "chksum_type": "sha256",
   "chksum_sha256": "e3b0c44298fc1c149afbf4c8996fb92427ae41e4649b934ca495991b7852b855",
   "format": 1
  },
  {
   "name": "tests/integration/targets/digital_ocean_firewall/defaults",
   "ftype": "dir",
   "chksum_type": null,
   "chksum_sha256": null,
   "format": 1
  },
  {
   "name": "tests/integration/targets/digital_ocean_firewall/defaults/main.yml",
   "ftype": "file",
   "chksum_type": "sha256",
   "chksum_sha256": "d4aa47098d194c8ec9a33ebc422fac18e95f6b344a60eefc7c0e7a412130fc67",
   "format": 1
  },
  {
   "name": "tests/integration/targets/digital_ocean_firewall/tasks",
   "ftype": "dir",
   "chksum_type": null,
   "chksum_sha256": null,
   "format": 1
  },
  {
   "name": "tests/integration/targets/digital_ocean_firewall/tasks/main.yml",
   "ftype": "file",
   "chksum_type": "sha256",
   "chksum_sha256": "9d95a5f2800c91f3e5f6c26b533fd80308e836172f0e3b8edb768b9d42245520",
   "format": 1
  },
  {
   "name": "tests/integration/targets/digital_ocean_domain_info",
   "ftype": "dir",
   "chksum_type": null,
   "chksum_sha256": null,
   "format": 1
  },
  {
   "name": "tests/integration/targets/digital_ocean_domain_info/aliases",
   "ftype": "file",
   "chksum_type": "sha256",
   "chksum_sha256": "e3b0c44298fc1c149afbf4c8996fb92427ae41e4649b934ca495991b7852b855",
   "format": 1
  },
  {
   "name": "tests/integration/targets/digital_ocean_domain_info/defaults",
   "ftype": "dir",
   "chksum_type": null,
   "chksum_sha256": null,
   "format": 1
  },
  {
   "name": "tests/integration/targets/digital_ocean_domain_info/defaults/main.yml",
   "ftype": "file",
   "chksum_type": "sha256",
   "chksum_sha256": "e3b0c44298fc1c149afbf4c8996fb92427ae41e4649b934ca495991b7852b855",
   "format": 1
  },
  {
   "name": "tests/integration/targets/digital_ocean_domain_info/tasks",
   "ftype": "dir",
   "chksum_type": null,
   "chksum_sha256": null,
   "format": 1
  },
  {
   "name": "tests/integration/targets/digital_ocean_domain_info/tasks/main.yml",
   "ftype": "file",
   "chksum_type": "sha256",
   "chksum_sha256": "f8a0736065ff0da261f1a04ff12759f1d66019259356606ef5247c2eadf1ba25",
   "format": 1
  },
  {
   "name": "tests/integration/targets/digital_ocean_firewall_info",
   "ftype": "dir",
   "chksum_type": null,
   "chksum_sha256": null,
   "format": 1
  },
  {
   "name": "tests/integration/targets/digital_ocean_firewall_info/aliases",
   "ftype": "file",
   "chksum_type": "sha256",
   "chksum_sha256": "e3b0c44298fc1c149afbf4c8996fb92427ae41e4649b934ca495991b7852b855",
   "format": 1
  },
  {
   "name": "tests/integration/targets/digital_ocean_firewall_info/defaults",
   "ftype": "dir",
   "chksum_type": null,
   "chksum_sha256": null,
   "format": 1
  },
  {
   "name": "tests/integration/targets/digital_ocean_firewall_info/defaults/main.yml",
   "ftype": "file",
   "chksum_type": "sha256",
   "chksum_sha256": "f52d711103d50a437830c6fbcd04fb4bab49a0f82f6d26d1c791c6e8488dd090",
   "format": 1
  },
  {
   "name": "tests/integration/targets/digital_ocean_firewall_info/tasks",
   "ftype": "dir",
   "chksum_type": null,
   "chksum_sha256": null,
   "format": 1
  },
  {
   "name": "tests/integration/targets/digital_ocean_firewall_info/tasks/main.yml",
   "ftype": "file",
   "chksum_type": "sha256",
   "chksum_sha256": "563fa59e2f6b1e9efa8fc599b61cee6cf7043b64ad80423e86c5ee2b734a71ee",
   "format": 1
  },
  {
   "name": "tests/integration/targets/digital_ocean_certificate_info",
   "ftype": "dir",
   "chksum_type": null,
   "chksum_sha256": null,
   "format": 1
  },
  {
   "name": "tests/integration/targets/digital_ocean_certificate_info/aliases",
   "ftype": "file",
   "chksum_type": "sha256",
   "chksum_sha256": "e3b0c44298fc1c149afbf4c8996fb92427ae41e4649b934ca495991b7852b855",
   "format": 1
  },
  {
   "name": "tests/integration/targets/digital_ocean_certificate_info/defaults",
   "ftype": "dir",
   "chksum_type": null,
   "chksum_sha256": null,
   "format": 1
  },
  {
   "name": "tests/integration/targets/digital_ocean_certificate_info/defaults/main.yml",
   "ftype": "file",
   "chksum_type": "sha256",
   "chksum_sha256": "f52d711103d50a437830c6fbcd04fb4bab49a0f82f6d26d1c791c6e8488dd090",
   "format": 1
  },
  {
   "name": "tests/integration/targets/digital_ocean_certificate_info/tasks",
   "ftype": "dir",
   "chksum_type": null,
   "chksum_sha256": null,
   "format": 1
  },
  {
   "name": "tests/integration/targets/digital_ocean_certificate_info/tasks/main.yml",
   "ftype": "file",
   "chksum_type": "sha256",
   "chksum_sha256": "87a4c9a04a4809f0b9f7140757a43268dea56dcefae761bf3dd30408e408bd28",
   "format": 1
  },
  {
   "name": "tests/integration/targets/digital_ocean_snapshot_info",
   "ftype": "dir",
   "chksum_type": null,
   "chksum_sha256": null,
   "format": 1
  },
  {
   "name": "tests/integration/targets/digital_ocean_snapshot_info/aliases",
   "ftype": "file",
   "chksum_type": "sha256",
   "chksum_sha256": "e3b0c44298fc1c149afbf4c8996fb92427ae41e4649b934ca495991b7852b855",
   "format": 1
  },
  {
   "name": "tests/integration/targets/digital_ocean_snapshot_info/defaults",
   "ftype": "dir",
   "chksum_type": null,
   "chksum_sha256": null,
   "format": 1
  },
  {
   "name": "tests/integration/targets/digital_ocean_snapshot_info/defaults/main.yml",
   "ftype": "file",
   "chksum_type": "sha256",
   "chksum_sha256": "08606337f8cd8591eebdb9ea243ee267a302f2547c68fa6b4cdd05a86d3dd359",
   "format": 1
  },
  {
   "name": "tests/integration/targets/digital_ocean_snapshot_info/tasks",
   "ftype": "dir",
   "chksum_type": null,
   "chksum_sha256": null,
   "format": 1
  },
  {
   "name": "tests/integration/targets/digital_ocean_snapshot_info/tasks/main.yml",
   "ftype": "file",
   "chksum_type": "sha256",
   "chksum_sha256": "dcf01fb7eca3dc2d724cee5dac70b600230259f6b9ff1e06e6206bf19704bd1f",
   "format": 1
  },
  {
   "name": "tests/integration/targets/digital_ocean_certificate",
   "ftype": "dir",
   "chksum_type": null,
   "chksum_sha256": null,
   "format": 1
  },
  {
   "name": "tests/integration/targets/digital_ocean_certificate/aliases",
   "ftype": "file",
   "chksum_type": "sha256",
   "chksum_sha256": "e3b0c44298fc1c149afbf4c8996fb92427ae41e4649b934ca495991b7852b855",
   "format": 1
  },
  {
   "name": "tests/integration/targets/digital_ocean_certificate/defaults",
   "ftype": "dir",
   "chksum_type": null,
   "chksum_sha256": null,
   "format": 1
  },
  {
   "name": "tests/integration/targets/digital_ocean_certificate/defaults/main.yml",
   "ftype": "file",
   "chksum_type": "sha256",
   "chksum_sha256": "764affaa42ccb4279b28791b95e4ff79392ac25ea27fd0d57a44e9e8f25507a6",
   "format": 1
  },
  {
   "name": "tests/integration/targets/digital_ocean_certificate/tasks",
   "ftype": "dir",
   "chksum_type": null,
   "chksum_sha256": null,
   "format": 1
  },
  {
   "name": "tests/integration/targets/digital_ocean_certificate/tasks/main.yml",
   "ftype": "file",
   "chksum_type": "sha256",
   "chksum_sha256": "9ddf38ed40555131b321f7fb6b1c76d6ce0624b9a7a3adb6051641ce2f40e7a7",
   "format": 1
  },
  {
   "name": "tests/integration/targets/digital_ocean_vpc_info",
   "ftype": "dir",
   "chksum_type": null,
   "chksum_sha256": null,
   "format": 1
  },
  {
   "name": "tests/integration/targets/digital_ocean_vpc_info/aliases",
   "ftype": "file",
   "chksum_type": "sha256",
   "chksum_sha256": "e3b0c44298fc1c149afbf4c8996fb92427ae41e4649b934ca495991b7852b855",
   "format": 1
  },
  {
   "name": "tests/integration/targets/digital_ocean_vpc_info/defaults",
   "ftype": "dir",
   "chksum_type": null,
   "chksum_sha256": null,
   "format": 1
  },
  {
   "name": "tests/integration/targets/digital_ocean_vpc_info/defaults/main.yml",
   "ftype": "file",
   "chksum_type": "sha256",
   "chksum_sha256": "e3b0c44298fc1c149afbf4c8996fb92427ae41e4649b934ca495991b7852b855",
   "format": 1
  },
  {
   "name": "tests/integration/targets/digital_ocean_vpc_info/tasks",
   "ftype": "dir",
   "chksum_type": null,
   "chksum_sha256": null,
   "format": 1
  },
  {
   "name": "tests/integration/targets/digital_ocean_vpc_info/tasks/main.yml",
   "ftype": "file",
   "chksum_type": "sha256",
   "chksum_sha256": "f644054f10f0ca5259aca9e8a8064fa8db0312ab1f4ce55688e1cadc3a81fe1b",
   "format": 1
  },
  {
   "name": "tests/integration/targets/digital_ocean_account_info",
   "ftype": "dir",
   "chksum_type": null,
   "chksum_sha256": null,
   "format": 1
  },
  {
   "name": "tests/integration/targets/digital_ocean_account_info/aliases",
   "ftype": "file",
   "chksum_type": "sha256",
   "chksum_sha256": "e3b0c44298fc1c149afbf4c8996fb92427ae41e4649b934ca495991b7852b855",
   "format": 1
  },
  {
   "name": "tests/integration/targets/digital_ocean_account_info/tasks",
   "ftype": "dir",
   "chksum_type": null,
   "chksum_sha256": null,
   "format": 1
  },
  {
   "name": "tests/integration/targets/digital_ocean_account_info/tasks/main.yml",
   "ftype": "file",
   "chksum_type": "sha256",
   "chksum_sha256": "2fbc3c7fa048c45c1959fa9e21442762b395dd787674e3dcf0239b3ec3eee957",
   "format": 1
  },
  {
   "name": "tests/integration/targets/digital_ocean_sshkey",
   "ftype": "dir",
   "chksum_type": null,
   "chksum_sha256": null,
   "format": 1
  },
  {
   "name": "tests/integration/targets/digital_ocean_sshkey/aliases",
   "ftype": "file",
   "chksum_type": "sha256",
   "chksum_sha256": "e3b0c44298fc1c149afbf4c8996fb92427ae41e4649b934ca495991b7852b855",
   "format": 1
  },
  {
   "name": "tests/integration/targets/digital_ocean_sshkey/defaults",
   "ftype": "dir",
   "chksum_type": null,
   "chksum_sha256": null,
   "format": 1
  },
  {
   "name": "tests/integration/targets/digital_ocean_sshkey/defaults/main.yml",
   "ftype": "file",
   "chksum_type": "sha256",
   "chksum_sha256": "ae8a0fffccfac884a13a92d7873dba516f78889b3cb3c6824b63b3bea7770f0e",
   "format": 1
  },
  {
   "name": "tests/integration/targets/digital_ocean_sshkey/tasks",
   "ftype": "dir",
   "chksum_type": null,
   "chksum_sha256": null,
   "format": 1
  },
  {
   "name": "tests/integration/targets/digital_ocean_sshkey/tasks/main.yml",
   "ftype": "file",
   "chksum_type": "sha256",
   "chksum_sha256": "04dc648f008243f1f525352208fe76079f88c2687d4e832625339e95be42f03c",
   "format": 1
  },
  {
   "name": "tests/integration/targets/digital_ocean_floating_ip",
   "ftype": "dir",
   "chksum_type": null,
   "chksum_sha256": null,
   "format": 1
  },
  {
   "name": "tests/integration/targets/digital_ocean_floating_ip/aliases",
   "ftype": "file",
   "chksum_type": "sha256",
   "chksum_sha256": "e3b0c44298fc1c149afbf4c8996fb92427ae41e4649b934ca495991b7852b855",
   "format": 1
  },
  {
   "name": "tests/integration/targets/digital_ocean_floating_ip/defaults",
   "ftype": "dir",
   "chksum_type": null,
   "chksum_sha256": null,
   "format": 1
  },
  {
   "name": "tests/integration/targets/digital_ocean_floating_ip/defaults/main.yml",
   "ftype": "file",
   "chksum_type": "sha256",
   "chksum_sha256": "cf5a05fb83861c99fb28a46b3cbc5b50079a00262c6ea8a4b1b2e3bd405d4828",
   "format": 1
  },
  {
   "name": "tests/integration/targets/digital_ocean_floating_ip/tasks",
   "ftype": "dir",
   "chksum_type": null,
   "chksum_sha256": null,
   "format": 1
  },
  {
   "name": "tests/integration/targets/digital_ocean_floating_ip/tasks/main.yml",
   "ftype": "file",
   "chksum_type": "sha256",
   "chksum_sha256": "0774fe0b400627e091d669ce8f7a3b4527a612edcb8133e80ddca92a3bc322e5",
   "format": 1
  },
  {
   "name": "tests/integration/targets/digital_ocean_database",
   "ftype": "dir",
   "chksum_type": null,
   "chksum_sha256": null,
   "format": 1
  },
  {
   "name": "tests/integration/targets/digital_ocean_database/aliases",
   "ftype": "file",
   "chksum_type": "sha256",
   "chksum_sha256": "e3b0c44298fc1c149afbf4c8996fb92427ae41e4649b934ca495991b7852b855",
   "format": 1
  },
  {
   "name": "tests/integration/targets/digital_ocean_database/defaults",
   "ftype": "dir",
   "chksum_type": null,
   "chksum_sha256": null,
   "format": 1
  },
  {
   "name": "tests/integration/targets/digital_ocean_database/defaults/main.yml",
   "ftype": "file",
   "chksum_type": "sha256",
   "chksum_sha256": "4043a443e36ca1ea56a41934c4374edbbb21af47e5917fdc23fc3f6193528b62",
   "format": 1
  },
  {
   "name": "tests/integration/targets/digital_ocean_database/tasks",
   "ftype": "dir",
   "chksum_type": null,
   "chksum_sha256": null,
   "format": 1
  },
  {
   "name": "tests/integration/targets/digital_ocean_database/tasks/main.yml",
   "ftype": "file",
   "chksum_type": "sha256",
   "chksum_sha256": "3a026a87bf7fff1ee5a57eda0facda28547a1c71d9df69b7ba26e2ea6c336242",
   "format": 1
  },
  {
   "name": "tests/integration/targets/digital_ocean_load_balancer_info",
   "ftype": "dir",
   "chksum_type": null,
   "chksum_sha256": null,
   "format": 1
  },
  {
   "name": "tests/integration/targets/digital_ocean_load_balancer_info/aliases",
   "ftype": "file",
   "chksum_type": "sha256",
   "chksum_sha256": "e3b0c44298fc1c149afbf4c8996fb92427ae41e4649b934ca495991b7852b855",
   "format": 1
  },
  {
   "name": "tests/integration/targets/digital_ocean_load_balancer_info/defaults",
   "ftype": "dir",
   "chksum_type": null,
   "chksum_sha256": null,
   "format": 1
  },
  {
   "name": "tests/integration/targets/digital_ocean_load_balancer_info/defaults/main.yml",
   "ftype": "file",
   "chksum_type": "sha256",
   "chksum_sha256": "e3b0c44298fc1c149afbf4c8996fb92427ae41e4649b934ca495991b7852b855",
   "format": 1
  },
  {
   "name": "tests/integration/targets/digital_ocean_load_balancer_info/tasks",
   "ftype": "dir",
   "chksum_type": null,
   "chksum_sha256": null,
   "format": 1
  },
  {
   "name": "tests/integration/targets/digital_ocean_load_balancer_info/tasks/main.yml",
   "ftype": "file",
   "chksum_type": "sha256",
   "chksum_sha256": "2bab35f1ac0bd8ffaab9c7376a71c3c5b0f5a40ef276bf0ec9b6adc3555282b8",
   "format": 1
  },
  {
   "name": "tests/integration/targets/digital_ocean_project",
   "ftype": "dir",
   "chksum_type": null,
   "chksum_sha256": null,
   "format": 1
  },
  {
   "name": "tests/integration/targets/digital_ocean_project/aliases",
   "ftype": "file",
   "chksum_type": "sha256",
   "chksum_sha256": "e3b0c44298fc1c149afbf4c8996fb92427ae41e4649b934ca495991b7852b855",
   "format": 1
  },
  {
   "name": "tests/integration/targets/digital_ocean_project/defaults",
   "ftype": "dir",
   "chksum_type": null,
   "chksum_sha256": null,
   "format": 1
  },
  {
   "name": "tests/integration/targets/digital_ocean_project/defaults/main.yml",
   "ftype": "file",
   "chksum_type": "sha256",
   "chksum_sha256": "e3b0c44298fc1c149afbf4c8996fb92427ae41e4649b934ca495991b7852b855",
   "format": 1
  },
  {
   "name": "tests/integration/targets/digital_ocean_project/tasks",
   "ftype": "dir",
   "chksum_type": null,
   "chksum_sha256": null,
   "format": 1
  },
  {
   "name": "tests/integration/targets/digital_ocean_project/tasks/main.yml",
   "ftype": "file",
   "chksum_type": "sha256",
   "chksum_sha256": "d342733152f6b4bccf5c6540d8c13d3b90b2b8733eaa17ca932a9005e6749e19",
   "format": 1
  },
  {
   "name": "tests/integration/targets/digital_ocean_vpc",
   "ftype": "dir",
   "chksum_type": null,
   "chksum_sha256": null,
   "format": 1
  },
  {
   "name": "tests/integration/targets/digital_ocean_vpc/aliases",
   "ftype": "file",
   "chksum_type": "sha256",
   "chksum_sha256": "e3b0c44298fc1c149afbf4c8996fb92427ae41e4649b934ca495991b7852b855",
   "format": 1
  },
  {
   "name": "tests/integration/targets/digital_ocean_vpc/defaults",
   "ftype": "dir",
   "chksum_type": null,
   "chksum_sha256": null,
   "format": 1
  },
  {
   "name": "tests/integration/targets/digital_ocean_vpc/defaults/main.yml",
   "ftype": "file",
   "chksum_type": "sha256",
   "chksum_sha256": "f9d79dfcc23af0cac86e6a8831faea8cf820838804c4d36c34959ec9bf9c0751",
   "format": 1
  },
  {
   "name": "tests/integration/targets/digital_ocean_vpc/tasks",
   "ftype": "dir",
   "chksum_type": null,
   "chksum_sha256": null,
   "format": 1
  },
  {
   "name": "tests/integration/targets/digital_ocean_vpc/tasks/main.yml",
   "ftype": "file",
   "chksum_type": "sha256",
   "chksum_sha256": "313a0b2d9a7f37e4e0af4b67a0a68ca4a28716dd7f0d5d5d045afb54552ac6aa",
   "format": 1
  },
  {
   "name": "tests/integration/targets/digital_ocean_kubernetes",
   "ftype": "dir",
   "chksum_type": null,
   "chksum_sha256": null,
   "format": 1
  },
  {
   "name": "tests/integration/targets/digital_ocean_kubernetes/aliases",
   "ftype": "file",
   "chksum_type": "sha256",
   "chksum_sha256": "e3b0c44298fc1c149afbf4c8996fb92427ae41e4649b934ca495991b7852b855",
   "format": 1
  },
  {
   "name": "tests/integration/targets/digital_ocean_kubernetes/defaults",
   "ftype": "dir",
   "chksum_type": null,
   "chksum_sha256": null,
   "format": 1
  },
  {
   "name": "tests/integration/targets/digital_ocean_kubernetes/defaults/main.yml",
   "ftype": "file",
   "chksum_type": "sha256",
   "chksum_sha256": "bc482f5b45faf57ad500f8713c232f3d29fc925f8f60c3631d27e7367866ba0a",
   "format": 1
  },
  {
   "name": "tests/integration/targets/digital_ocean_kubernetes/tasks",
   "ftype": "dir",
   "chksum_type": null,
   "chksum_sha256": null,
   "format": 1
  },
  {
   "name": "tests/integration/targets/digital_ocean_kubernetes/tasks/main.yml",
   "ftype": "file",
   "chksum_type": "sha256",
   "chksum_sha256": "17d1d2b67366f279f4065648ce1c3ce5c87485f367c6acc106c8b47ac424073e",
   "format": 1
  },
  {
   "name": "tests/integration/targets/digital_ocean_snapshot",
   "ftype": "dir",
   "chksum_type": null,
   "chksum_sha256": null,
   "format": 1
  },
  {
   "name": "tests/integration/targets/digital_ocean_snapshot/aliases",
   "ftype": "file",
   "chksum_type": "sha256",
   "chksum_sha256": "e3b0c44298fc1c149afbf4c8996fb92427ae41e4649b934ca495991b7852b855",
   "format": 1
  },
  {
   "name": "tests/integration/targets/digital_ocean_snapshot/defaults",
   "ftype": "dir",
   "chksum_type": null,
   "chksum_sha256": null,
   "format": 1
  },
  {
   "name": "tests/integration/targets/digital_ocean_snapshot/defaults/main.yml",
   "ftype": "file",
   "chksum_type": "sha256",
   "chksum_sha256": "44603460d09ae29c96ecbfac932b961f8183ce677dec478b2ff89843acbd29ff",
   "format": 1
  },
  {
   "name": "tests/integration/targets/digital_ocean_snapshot/tasks",
   "ftype": "dir",
   "chksum_type": null,
   "chksum_sha256": null,
   "format": 1
  },
  {
   "name": "tests/integration/targets/digital_ocean_snapshot/tasks/main.yml",
   "ftype": "file",
   "chksum_type": "sha256",
   "chksum_sha256": "ca03b9aece82504a35369347290c1804d8b27bc0a99f68424dd69c831bd2858c",
   "format": 1
  },
  {
   "name": "tests/integration/targets/digital_ocean_balance_info",
   "ftype": "dir",
   "chksum_type": null,
   "chksum_sha256": null,
   "format": 1
  },
  {
   "name": "tests/integration/targets/digital_ocean_balance_info/aliases",
   "ftype": "file",
   "chksum_type": "sha256",
   "chksum_sha256": "e3b0c44298fc1c149afbf4c8996fb92427ae41e4649b934ca495991b7852b855",
   "format": 1
  },
  {
   "name": "tests/integration/targets/digital_ocean_balance_info/defaults",
   "ftype": "dir",
   "chksum_type": null,
   "chksum_sha256": null,
   "format": 1
  },
  {
   "name": "tests/integration/targets/digital_ocean_balance_info/defaults/main.yml",
   "ftype": "file",
   "chksum_type": "sha256",
   "chksum_sha256": "e3b0c44298fc1c149afbf4c8996fb92427ae41e4649b934ca495991b7852b855",
   "format": 1
  },
  {
   "name": "tests/integration/targets/digital_ocean_balance_info/tasks",
   "ftype": "dir",
   "chksum_type": null,
   "chksum_sha256": null,
   "format": 1
  },
  {
   "name": "tests/integration/targets/digital_ocean_balance_info/tasks/main.yml",
   "ftype": "file",
   "chksum_type": "sha256",
   "chksum_sha256": "8a886b6634b7c7c08e9cd83bf6a113800ea8b27c9edc4df47c9d9ce5630430da",
   "format": 1
  },
  {
   "name": "tests/integration/targets/digital_ocean_image_info",
   "ftype": "dir",
   "chksum_type": null,
   "chksum_sha256": null,
   "format": 1
  },
  {
   "name": "tests/integration/targets/digital_ocean_image_info/aliases",
   "ftype": "file",
   "chksum_type": "sha256",
   "chksum_sha256": "e3b0c44298fc1c149afbf4c8996fb92427ae41e4649b934ca495991b7852b855",
   "format": 1
  },
  {
   "name": "tests/integration/targets/digital_ocean_image_info/defaults",
   "ftype": "dir",
   "chksum_type": null,
   "chksum_sha256": null,
   "format": 1
  },
  {
   "name": "tests/integration/targets/digital_ocean_image_info/defaults/main.yml",
   "ftype": "file",
   "chksum_type": "sha256",
   "chksum_sha256": "3d908407f540095fdc373b16c250678e7de8055c8b4e7171d64d40aff5aa69df",
   "format": 1
  },
  {
   "name": "tests/integration/targets/digital_ocean_image_info/tasks",
   "ftype": "dir",
   "chksum_type": null,
   "chksum_sha256": null,
   "format": 1
  },
  {
   "name": "tests/integration/targets/digital_ocean_image_info/tasks/main.yml",
   "ftype": "file",
   "chksum_type": "sha256",
   "chksum_sha256": "c94255fc4ecd3d190bb2af934588a565cd307f0b932305342a267e17ef2a2391",
   "format": 1
  },
  {
   "name": "tests/integration/targets/digital_ocean_tag_info",
   "ftype": "dir",
   "chksum_type": null,
   "chksum_sha256": null,
   "format": 1
  },
  {
   "name": "tests/integration/targets/digital_ocean_tag_info/aliases",
   "ftype": "file",
   "chksum_type": "sha256",
   "chksum_sha256": "e3b0c44298fc1c149afbf4c8996fb92427ae41e4649b934ca495991b7852b855",
   "format": 1
  },
  {
   "name": "tests/integration/targets/digital_ocean_tag_info/defaults",
   "ftype": "dir",
   "chksum_type": null,
   "chksum_sha256": null,
   "format": 1
  },
  {
   "name": "tests/integration/targets/digital_ocean_tag_info/defaults/main.yml",
   "ftype": "file",
   "chksum_type": "sha256",
   "chksum_sha256": "f52d711103d50a437830c6fbcd04fb4bab49a0f82f6d26d1c791c6e8488dd090",
   "format": 1
  },
  {
   "name": "tests/integration/targets/digital_ocean_tag_info/tasks",
   "ftype": "dir",
   "chksum_type": null,
   "chksum_sha256": null,
   "format": 1
  },
  {
   "name": "tests/integration/targets/digital_ocean_tag_info/tasks/main.yml",
   "ftype": "file",
   "chksum_type": "sha256",
   "chksum_sha256": "8124154b3251fb1fbbd0ea84068a774048c02116dcdf1ae34565cbe16f5bd53c",
   "format": 1
  },
  {
   "name": "tests/integration/targets/digital_ocean_block_storage",
   "ftype": "dir",
   "chksum_type": null,
   "chksum_sha256": null,
   "format": 1
  },
  {
   "name": "tests/integration/targets/digital_ocean_block_storage/aliases",
   "ftype": "file",
   "chksum_type": "sha256",
   "chksum_sha256": "e3b0c44298fc1c149afbf4c8996fb92427ae41e4649b934ca495991b7852b855",
   "format": 1
  },
  {
   "name": "tests/integration/targets/digital_ocean_block_storage/defaults",
   "ftype": "dir",
   "chksum_type": null,
   "chksum_sha256": null,
   "format": 1
  },
  {
   "name": "tests/integration/targets/digital_ocean_block_storage/defaults/main.yml",
   "ftype": "file",
   "chksum_type": "sha256",
   "chksum_sha256": "03d541a19ec67ea73337398909a33ea3220edfca37a67fe9487ff88c58a2655d",
   "format": 1
  },
  {
   "name": "tests/integration/targets/digital_ocean_block_storage/tasks",
   "ftype": "dir",
   "chksum_type": null,
   "chksum_sha256": null,
   "format": 1
  },
  {
   "name": "tests/integration/targets/digital_ocean_block_storage/tasks/main.yml",
   "ftype": "file",
   "chksum_type": "sha256",
   "chksum_sha256": "5a89f7ffb4ca9ba55c78df11ffbbc8a864a9ef09aed9a6c70d042ccd96209676",
   "format": 1
  },
  {
   "name": "tests/integration/targets/digital_ocean_tag",
   "ftype": "dir",
   "chksum_type": null,
   "chksum_sha256": null,
   "format": 1
  },
  {
   "name": "tests/integration/targets/digital_ocean_tag/aliases",
   "ftype": "file",
   "chksum_type": "sha256",
   "chksum_sha256": "e3b0c44298fc1c149afbf4c8996fb92427ae41e4649b934ca495991b7852b855",
   "format": 1
  },
  {
   "name": "tests/integration/targets/digital_ocean_tag/defaults",
   "ftype": "dir",
   "chksum_type": null,
   "chksum_sha256": null,
   "format": 1
  },
  {
   "name": "tests/integration/targets/digital_ocean_tag/defaults/main.yml",
   "ftype": "file",
   "chksum_type": "sha256",
   "chksum_sha256": "b51bf22b8e164227935585dd7abf7d3d69615b730d9dd2cf03246fa6548501af",
   "format": 1
  },
  {
   "name": "tests/integration/targets/digital_ocean_tag/tasks",
   "ftype": "dir",
   "chksum_type": null,
   "chksum_sha256": null,
   "format": 1
  },
  {
   "name": "tests/integration/targets/digital_ocean_tag/tasks/main.yml",
   "ftype": "file",
   "chksum_type": "sha256",
   "chksum_sha256": "67aa9979516a71f3abe31937cb557d81c836800292bb9cba086dfbb78b298bc4",
   "format": 1
  },
  {
   "name": "tests/integration/targets/digital_ocean_volume_info",
   "ftype": "dir",
   "chksum_type": null,
   "chksum_sha256": null,
   "format": 1
  },
  {
   "name": "tests/integration/targets/digital_ocean_volume_info/aliases",
   "ftype": "file",
   "chksum_type": "sha256",
   "chksum_sha256": "e3b0c44298fc1c149afbf4c8996fb92427ae41e4649b934ca495991b7852b855",
   "format": 1
  },
  {
   "name": "tests/integration/targets/digital_ocean_volume_info/defaults",
   "ftype": "dir",
   "chksum_type": null,
   "chksum_sha256": null,
   "format": 1
  },
  {
   "name": "tests/integration/targets/digital_ocean_volume_info/defaults/main.yml",
   "ftype": "file",
   "chksum_type": "sha256",
   "chksum_sha256": "e3b0c44298fc1c149afbf4c8996fb92427ae41e4649b934ca495991b7852b855",
   "format": 1
  },
  {
   "name": "tests/integration/targets/digital_ocean_volume_info/tasks",
   "ftype": "dir",
   "chksum_type": null,
   "chksum_sha256": null,
   "format": 1
  },
  {
   "name": "tests/integration/targets/digital_ocean_volume_info/tasks/main.yml",
   "ftype": "file",
   "chksum_type": "sha256",
   "chksum_sha256": "7ae21aa9bb287bacf4e5e04edf8821b7d3d9398a038224be8127e434da068598",
   "format": 1
  },
  {
   "name": "tests/integration/targets/digital_ocean_region_info",
   "ftype": "dir",
   "chksum_type": null,
   "chksum_sha256": null,
   "format": 1
  },
  {
   "name": "tests/integration/targets/digital_ocean_region_info/aliases",
   "ftype": "file",
   "chksum_type": "sha256",
   "chksum_sha256": "e3b0c44298fc1c149afbf4c8996fb92427ae41e4649b934ca495991b7852b855",
   "format": 1
  },
  {
   "name": "tests/integration/targets/digital_ocean_region_info/defaults",
   "ftype": "dir",
   "chksum_type": null,
   "chksum_sha256": null,
   "format": 1
  },
  {
   "name": "tests/integration/targets/digital_ocean_region_info/defaults/main.yml",
   "ftype": "file",
   "chksum_type": "sha256",
   "chksum_sha256": "e3b0c44298fc1c149afbf4c8996fb92427ae41e4649b934ca495991b7852b855",
   "format": 1
  },
  {
   "name": "tests/integration/targets/digital_ocean_region_info/tasks",
   "ftype": "dir",
   "chksum_type": null,
   "chksum_sha256": null,
   "format": 1
  },
  {
   "name": "tests/integration/targets/digital_ocean_region_info/tasks/main.yml",
   "ftype": "file",
   "chksum_type": "sha256",
   "chksum_sha256": "a6d660d72bea0b1a4831c820769f9dd8285a1b329c900d7f9cbc1774f6d70480",
   "format": 1
  },
  {
   "name": "tests/integration/targets/digital_ocean_project_info",
   "ftype": "dir",
   "chksum_type": null,
   "chksum_sha256": null,
   "format": 1
  },
  {
   "name": "tests/integration/targets/digital_ocean_project_info/aliases",
   "ftype": "file",
   "chksum_type": "sha256",
   "chksum_sha256": "e3b0c44298fc1c149afbf4c8996fb92427ae41e4649b934ca495991b7852b855",
   "format": 1
  },
  {
   "name": "tests/integration/targets/digital_ocean_project_info/defaults",
   "ftype": "dir",
   "chksum_type": null,
   "chksum_sha256": null,
   "format": 1
  },
  {
   "name": "tests/integration/targets/digital_ocean_project_info/defaults/main.yml",
   "ftype": "file",
   "chksum_type": "sha256",
   "chksum_sha256": "f52d711103d50a437830c6fbcd04fb4bab49a0f82f6d26d1c791c6e8488dd090",
   "format": 1
  },
  {
   "name": "tests/integration/targets/digital_ocean_project_info/tasks",
   "ftype": "dir",
   "chksum_type": null,
   "chksum_sha256": null,
   "format": 1
  },
  {
   "name": "tests/integration/targets/digital_ocean_project_info/tasks/main.yml",
   "ftype": "file",
   "chksum_type": "sha256",
   "chksum_sha256": "a6920b07f4dea085ead73d0c26d06f50102104500a5478f658b725a7efcf9ab2",
   "format": 1
  },
  {
   "name": "tests/integration/requirements.txt",
   "ftype": "file",
   "chksum_type": "sha256",
   "chksum_sha256": "beecbfa19d5c92979236b022f092bcfb22063ba6ddb8edeabd6d9c08c4263c7f",
   "format": 1
  },
  {
   "name": "tests/unit",
   "ftype": "dir",
   "chksum_type": null,
   "chksum_sha256": null,
   "format": 1
  },
  {
   "name": "tests/unit/plugins",
   "ftype": "dir",
   "chksum_type": null,
   "chksum_sha256": null,
   "format": 1
  },
  {
   "name": "tests/unit/plugins/inventory",
   "ftype": "dir",
   "chksum_type": null,
   "chksum_sha256": null,
   "format": 1
  },
  {
   "name": "tests/unit/plugins/inventory/test_digitalocean.py",
   "ftype": "file",
   "chksum_type": "sha256",
   "chksum_sha256": "5c530f60286135000d5e34dd7455e75607bd3948962fa74109680e0b32e4b338",
   "format": 1
  },
  {
   "name": "tests/sanity",
   "ftype": "dir",
   "chksum_type": null,
   "chksum_sha256": null,
   "format": 1
  },
  {
   "name": "tests/sanity/ignore-2.9.txt",
   "ftype": "file",
   "chksum_type": "sha256",
   "chksum_sha256": "798cff6c8c2b0cf6db97c96e06a8dafd21396145a1a56e50549a3d7705481be1",
   "format": 1
  },
  {
   "name": "COPYING",
   "ftype": "file",
   "chksum_type": "sha256",
   "chksum_sha256": "3972dc9744f6499f0f9b2dbf76696f2ae7ad8af9b23dde66d6af86c9dfb36986",
   "format": 1
  },
  {
   "name": ".gitignore",
   "ftype": "file",
   "chksum_type": "sha256",
   "chksum_sha256": "f59a2bf97befc68fb5a72a0aae195a9a95e1633d28fb595fec3a559ec04761ca",
   "format": 1
  },
  {
   "name": "codecov.yml",
   "ftype": "file",
   "chksum_type": "sha256",
   "chksum_sha256": "08263e731c1a39f4d143b80830250fa028ec6eeca4bdb9763bb3d3aed70cf076",
   "format": 1
  },
  {
   "name": "README.md",
   "ftype": "file",
   "chksum_type": "sha256",
   "chksum_sha256": "38c449440faf0941e5f02171d66f69aeb95152dd1da075522e0aabe6dc494c45",
   "format": 1
  },
  {
   "name": "CHANGELOG.rst",
   "ftype": "file",
   "chksum_type": "sha256",
   "chksum_sha256": "f4806930ae1b4db3c5766c9a805748a5897c8dbe800aff95fb110c5ec1ee7613",
   "format": 1
  },
  {
   "name": "changelogs",
   "ftype": "dir",
   "chksum_type": null,
   "chksum_sha256": null,
   "format": 1
  },
  {
   "name": "changelogs/config.yaml",
   "ftype": "file",
   "chksum_type": "sha256",
   "chksum_sha256": "2b07ba10f6c28a1fb05c5b0e7193bf5dfcb778dc2c003a98595d73e64fc7f916",
   "format": 1
  },
  {
   "name": "changelogs/changelog.yaml",
   "ftype": "file",
   "chksum_type": "sha256",
   "chksum_sha256": "37b49629c44c606b381d88dd85843731aaaf861937cb1666b08e54525c67796e",
   "format": 1
  },
  {
   "name": "changelogs/.gitignore",
   "ftype": "file",
   "chksum_type": "sha256",
   "chksum_sha256": "919ef00776e7d2ff349950ac4b806132aa9faf006e214d5285de54533e443b33",
   "format": 1
  },
  {
   "name": "changelogs/fragments",
   "ftype": "dir",
   "chksum_type": null,
   "chksum_sha256": null,
   "format": 1
  },
  {
   "name": "changelogs/fragments/.keep",
   "ftype": "file",
   "chksum_type": "sha256",
   "chksum_sha256": "e3b0c44298fc1c149afbf4c8996fb92427ae41e4649b934ca495991b7852b855",
   "format": 1
  }
 ],
 "format": 1
}