<?xml version="1.0" encoding="UTF-8" standalone="no"?>
<svg
   xmlns:dc="http://purl.org/dc/elements/1.1/"
   xmlns:cc="http://creativecommons.org/ns#"
   xmlns:rdf="http://www.w3.org/1999/02/22-rdf-syntax-ns#"
   xmlns:svg="http://www.w3.org/2000/svg"
   xmlns="http://www.w3.org/2000/svg"
   xmlns:xlink="http://www.w3.org/1999/xlink"
   version="1.1"
   id="svg2"
   viewBox="0 0 800.00003 600"
   height="600"
   width="800">
  <defs
     id="defs4">
    <linearGradient
       id="linearGradient4353">
      <stop
         id="stop4355"
         offset="0"
         style="stop-color:#333333;stop-opacity:1;" />
      <stop
         id="stop4357"
         offset="1"
         style="stop-color:#1a1a1a;stop-opacity:1" />
    </linearGradient>
    <linearGradient
       id="linearGradient4150">
      <stop
         id="stop4152"
         offset="0"
         style="stop-color:#666666;stop-opacity:1" />
      <stop
         id="stop4154"
         offset="1"
         style="stop-color:#cccccc;stop-opacity:1" />
    </linearGradient>
    <filter
       height="1.2945796"
       y="-0.14728981"
       width="1.041012"
       x="-0.020505998"
       id="filter4197"
       style="color-interpolation-filters:sRGB">
      <feGaussianBlur
         id="feGaussianBlur4199"
         stdDeviation="3.2929248" />
    </filter>
    <linearGradient
       spreadMethod="reflect"
       gradientUnits="userSpaceOnUse"
       y2="312.89536"
       x2="220.29738"
       y1="294.78656"
       x1="220.29738"
       id="linearGradient4156"
       xlink:href="#linearGradient4150" />
    <filter
       height="1.1611161"
       y="-0.080558039"
       width="1.0129657"
       x="-0.0064828452"
       id="filter4305"
       style="color-interpolation-filters:sRGB">
      <feGaussianBlur
         id="feGaussianBlur4307"
         stdDeviation="0.88110352" />
    </filter>
    <filter
       height="1.0700941"
       y="-0.035047028"
       width="1.0740125"
       x="-0.037006248"
       id="filter4337"
       style="color-interpolation-filters:sRGB">
      <feGaussianBlur
         id="feGaussianBlur4339"
         stdDeviation="3.4478027" />
    </filter>
    <linearGradient
       spreadMethod="reflect"
       gradientUnits="userSpaceOnUse"
       y2="610.75714"
       x2="177.58249"
       y1="613.31415"
       x1="176.0488"
       id="linearGradient4345"
       xlink:href="#linearGradient4150" />
    <linearGradient
       spreadMethod="reflect"
       gradientUnits="userSpaceOnUse"
       y2="614.64972"
       x2="177.73424"
       y1="613.30835"
       x1="176.09943"
       id="linearGradient4359"
       xlink:href="#linearGradient4353" />
    <linearGradient
       spreadMethod="reflect"
       gradientUnits="userSpaceOnUse"
       y2="614.64972"
       x2="177.73424"
       y1="613.30835"
       x1="176.09943"
       id="linearGradient4359-2"
       xlink:href="#linearGradient4353"
       gradientTransform="translate(5.1313998,2.5511918)" />
    <linearGradient
       spreadMethod="reflect"
       gradientUnits="userSpaceOnUse"
       y2="610.75714"
       x2="177.58249"
       y1="613.31415"
       x1="176.0488"
       id="linearGradient4345-4"
       xlink:href="#linearGradient4150"
       gradientTransform="translate(5.1313998,2.5511918)" />
    <filter
       height="1.4909661"
       y="-0.24548304"
       width="1.0683533"
       x="-0.034176663"
       id="filter4445"
       style="color-interpolation-filters:sRGB">
      <feGaussianBlur
         id="feGaussianBlur4447"
         stdDeviation="5.488208" />
    </filter>
    <linearGradient
       y2="312.89536"
       x2="220.29738"
       y1="294.78656"
       x1="220.29738"
       spreadMethod="reflect"
       gradientUnits="userSpaceOnUse"
       id="linearGradient4453"
       xlink:href="#linearGradient4150" />
  </defs>
  <metadata
     id="metadata7">
    <rdf:RDF>
      <cc:Work
         rdf:about="">
        <dc:format>image/svg+xml</dc:format>
        <dc:type
           rdf:resource="http://purl.org/dc/dcmitype/StillImage" />
        <dc:title></dc:title>
      </cc:Work>
    </rdf:RDF>
  </metadata>
  <g
     transform="translate(-157.17791,-118.59174)"
     id="layer1">
    <g
       transform="matrix(1.9429559,0,0,1.9429559,-148.21184,-732.15353)"
       id="g4455">
      <path
         id="path4319"
         d="M 352.78516,474.21349 A 122.06654,122.06654 0 0 0 251.24805,528.64709 118.04237,118.04237 0 0 1 339.37109,488.96935 118.04237,118.04237 0 0 1 457.41406,607.01232 118.04237,118.04237 0 0 1 396.21875,710.31701 122.06654,122.06654 0 0 0 474.85156,596.2799 122.06654,122.06654 0 0 0 352.78516,474.21349 Z"
         style="fill:#000000;fill-opacity:1;stroke:none;stroke-width:10;stroke-miterlimit:4;stroke-dasharray:none;stroke-opacity:1;filter:url(#filter4337)" />
      <path
         style="fill:#d24400;fill-opacity:1;stroke:none;stroke-width:10;stroke-miterlimit:4;stroke-dasharray:none;stroke-opacity:1"
         d="M 352.78516,474.21349 A 122.06654,122.06654 0 0 0 251.24805,528.64709 118.04237,118.04237 0 0 1 339.37109,488.96935 118.04237,118.04237 0 0 1 457.41406,607.01232 118.04237,118.04237 0 0 1 396.21875,710.31701 122.06654,122.06654 0 0 0 474.85156,596.2799 122.06654,122.06654 0 0 0 352.78516,474.21349 Z"
         id="circle4148" />
      <path
         id="path4187"
         d="m 189.9043,565.4375 -19.55469,20.03711 0,33.61914 365.77148,0 19.62891,-20.11328 0,-33.54297 -365.8457,0 z"
         style="fill:#000000;fill-opacity:1;stroke:none;stroke-width:10;stroke-miterlimit:4;stroke-dasharray:none;stroke-opacity:1;filter:url(#filter4197)" />
      <path
         style="fill:#000000;fill-opacity:1;stroke:none;stroke-width:10;stroke-miterlimit:4;stroke-dasharray:none;stroke-opacity:1"
         d="m 189.9043,565.4375 -19.55469,20.03711 0,33.61914 365.77148,0 19.62891,-20.11328 0,-33.54297 -365.8457,0 z"
         id="rect4165" />
      <path
         id="path4427"
         d="m 189.9043,565.4375 -19.55469,20.03711 0,33.61914 365.77148,0 19.62891,-20.11328 0,-33.54297 -365.8457,0 z"
         style="fill:#101010;fill-opacity:1;stroke:none;stroke-width:10;stroke-miterlimit:4;stroke-dasharray:none;stroke-opacity:1;filter:url(#filter4445)" />
      <g
         id="flowRoot4136"
         style="font-style:normal;font-variant:normal;font-weight:500;font-stretch:normal;font-size:40px;line-height:125%;font-family:Bandal;-inkscape-font-specification:'Bandal, Medium';text-align:start;letter-spacing:0px;word-spacing:0px;writing-mode:lr-tb;text-anchor:start;fill:#000000;fill-opacity:1;stroke:none;stroke-width:1px;stroke-linecap:butt;stroke-linejoin:miter;stroke-opacity:1"
         transform="translate(151.93848,282.72339)">
        <path
           id="path3508"
           style="font-style:normal;font-variant:normal;font-weight:500;font-stretch:normal;font-size:45px;line-height:125%;font-family:Bandal;-inkscape-font-specification:'Bandal, Medium';text-align:start;writing-mode:lr-tb;text-anchor:start"
           d="m 48.015625,296.41723 18.75,0 0,3.75 -15,0 0,7.5 15,0 0,15 -18.75,0 0,-3.75 15,0 0,-7.5 -15,0 0,-15 z" />
        <path
           id="path3510"
           style="font-style:normal;font-variant:normal;font-weight:500;font-stretch:normal;font-size:45px;line-height:125%;font-family:Bandal;-inkscape-font-specification:'Bandal, Medium';text-align:start;writing-mode:lr-tb;text-anchor:start"
           d="m 70.515625,303.91723 18.75,0 0,11.25 -15,0 0,3.75 15,0 0,3.75 -18.75,0 0,-18.75 z m 3.75,3.75 0,3.75 11.25,0 0,-3.75 -11.25,0 z" />
        <path
           id="path3512"
           style="font-style:normal;font-variant:normal;font-weight:500;font-stretch:normal;font-size:45px;line-height:125%;font-family:Bandal;-inkscape-font-specification:'Bandal, Medium';text-align:start;writing-mode:lr-tb;text-anchor:start"
           d="m 93.015625,303.91723 3.75,0 0,8.55 5.625005,5.625 5.625,-5.625 0,-8.55 3.75,0 0,10.2 -8.55,8.55 -1.65001,0 -8.549995,-8.55 0,-10.2 z" />
        <path
           id="path3514"
           style="font-style:normal;font-variant:normal;font-weight:500;font-stretch:normal;font-size:45px;line-height:125%;font-family:Bandal;-inkscape-font-specification:'Bandal, Medium';text-align:start;writing-mode:lr-tb;text-anchor:start"
           d="m 115.51563,303.91723 18.74999,0 0,11.25 -14.99999,0 0,3.75 14.99999,0 0,3.75 -18.74999,0 0,-18.75 z m 3.75,3.75 0,3.75 11.24999,0 0,-3.75 -11.24999,0 z" />
        <path
           id="path3516"
           style="font-style:normal;font-variant:normal;font-weight:500;font-stretch:normal;font-size:45px;line-height:125%;font-family:Bandal;-inkscape-font-specification:'Bandal, Medium';text-align:start;writing-mode:lr-tb;text-anchor:start"
           d="m 138.01562,303.91723 13.95,0 4.8,4.8 0,13.95 -3.75,0 0,-12.3 -2.7,-2.7 -8.55,0 0,15 -3.75,0 0,-18.75 z" />
        <path
           id="path3518"
           style="font-style:normal;font-variant:normal;font-weight:500;font-stretch:normal;font-size:45px;line-height:125%;font-family:Bandal;-inkscape-font-specification:'Bandal, Medium';text-align:start;writing-mode:lr-tb;text-anchor:start"
           d="m 179.23633,296.41723 18.75,0 0,3.75 -15,0 0,7.5 15,0 0,15 -18.75,0 0,-3.75 15,0 0,-7.5 -15,0 0,-15 z" />
        <path
           id="path3520"
           style="font-style:normal;font-variant:normal;font-weight:500;font-stretch:normal;font-size:45px;line-height:125%;font-family:Bandal;-inkscape-font-specification:'Bandal, Medium';text-align:start;writing-mode:lr-tb;text-anchor:start"
           d="m 201.73633,303.91723 3.75,0 0,12.3 2.7,2.7 8.55,0 0,-15 3.75,0 0,18.75 -13.95,0 -4.8,-4.8 0,-13.95 z" />
        <path
           id="path3522"
           style="font-style:normal;font-variant:normal;font-weight:500;font-stretch:normal;font-size:45px;line-height:125%;font-family:Bandal;-inkscape-font-specification:'Bandal, Medium';text-align:start;writing-mode:lr-tb;text-anchor:start"
           d="m 224.23633,303.91723 13.95,0 4.8,4.8 0,13.95 -3.75,0 0,-12.3 -2.7,-2.7 -8.55,0 0,15 -3.75,0 0,-18.75 z" />
        <path
           id="path3524"
           style="font-style:normal;font-variant:normal;font-weight:500;font-stretch:normal;font-size:45px;line-height:125%;font-family:Bandal;-inkscape-font-specification:'Bandal, Medium';text-align:start;writing-mode:lr-tb;text-anchor:start"
           d="m 269.20703,300.16723 0,18.75 8.55,0 2.7,-2.7 0,-13.35 -2.7,-2.7 -8.55,0 z m -3.75,-3.75 13.95,0 4.8,4.8 0,16.65 -4.8,4.8 -13.95,0 0,-26.25 z" />
        <path
           id="path3526"
           style="font-style:normal;font-variant:normal;font-weight:500;font-stretch:normal;font-size:45px;line-height:125%;font-family:Bandal;-inkscape-font-specification:'Bandal, Medium';text-align:start;writing-mode:lr-tb;text-anchor:start"
           d="m 287.95703,303.91723 18.75,0 0,18.75 -18.75,0 0,-18.75 z m 3.75,3.75 0,11.25 11.25,0 0,-11.25 -11.25,0 z" />
        <path
           id="path3528"
           style="font-style:normal;font-variant:normal;font-weight:500;font-stretch:normal;font-size:45px;line-height:125%;font-family:Bandal;-inkscape-font-specification:'Bandal, Medium';text-align:start;writing-mode:lr-tb;text-anchor:start"
           d="m 310.45703,303.91723 3.75,0 0,12.3 2.7,2.7 1.05,-1.05 0,-13.95 3.75,0 0,13.95 1.05,1.05 2.7,-2.7 0,-12.3 3.75,0 0,13.95 -4.8,4.8 -3.75,0 -0.825,-0.825 -0.825,0.825 -3.75,0 -4.8,-4.8 0,-13.95 z" />
        <path
           id="path3530"
           style="font-style:normal;font-variant:normal;font-weight:500;font-stretch:normal;font-size:45px;line-height:125%;font-family:Bandal;-inkscape-font-specification:'Bandal, Medium';text-align:start;writing-mode:lr-tb;text-anchor:start"
           d="m 332.95703,303.91723 13.95,0 4.8,4.8 0,13.95 -3.75,0 0,-12.3 -2.7,-2.7 -8.55,0 0,15 -3.75,0 0,-18.75 z" />
        <path
           id="path3532"
           style="font-style:normal;font-variant:normal;font-weight:500;font-stretch:normal;font-size:45px;line-height:125%;font-family:Bandal;-inkscape-font-specification:'Bandal, Medium';text-align:start;writing-mode:lr-tb;text-anchor:start"
           d="m 355.45703,303.91723 18.75,0 0,3.75 -15,0 0,3.75 15,0 0,11.25 -18.75,0 0,-3.75 15,0 0,-3.75 -15,0 0,-11.25 z" />
      </g>
      <g
         id="flowRoot4236"
         style="font-style:normal;font-variant:normal;font-weight:500;font-stretch:normal;font-size:40px;line-height:125%;font-family:Bandal;-inkscape-font-specification:'Bandal, Medium';text-align:start;letter-spacing:0px;word-spacing:0px;writing-mode:lr-tb;text-anchor:start;fill:#000000;fill-opacity:1;stroke:none;stroke-width:1px;stroke-linecap:butt;stroke-linejoin:miter;stroke-opacity:1;filter:url(#filter4305)"
         transform="translate(151.93848,280.72339)">
        <path
           id="path3535"
           style="font-style:normal;font-variant:normal;font-weight:500;font-stretch:normal;font-size:45px;line-height:125%;font-family:Bandal;-inkscape-font-specification:'Bandal, Medium';text-align:start;writing-mode:lr-tb;text-anchor:start;fill:#000000;fill-opacity:1"
           d="m 48.015625,296.41723 18.75,0 0,3.75 -15,0 0,7.5 15,0 0,15 -18.75,0 0,-3.75 15,0 0,-7.5 -15,0 0,-15 z" />
        <path
           id="path3537"
           style="font-style:normal;font-variant:normal;font-weight:500;font-stretch:normal;font-size:45px;line-height:125%;font-family:Bandal;-inkscape-font-specification:'Bandal, Medium';text-align:start;writing-mode:lr-tb;text-anchor:start;fill:#000000;fill-opacity:1"
           d="m 70.515625,303.91723 18.75,0 0,11.25 -15,0 0,3.75 15,0 0,3.75 -18.75,0 0,-18.75 z m 3.75,3.75 0,3.75 11.25,0 0,-3.75 -11.25,0 z" />
        <path
           id="path3539"
           style="font-style:normal;font-variant:normal;font-weight:500;font-stretch:normal;font-size:45px;line-height:125%;font-family:Bandal;-inkscape-font-specification:'Bandal, Medium';text-align:start;writing-mode:lr-tb;text-anchor:start;fill:#000000;fill-opacity:1"
           d="m 93.015625,303.91723 3.75,0 0,8.55 5.625005,5.625 5.625,-5.625 0,-8.55 3.75,0 0,10.2 -8.55,8.55 -1.65001,0 -8.549995,-8.55 0,-10.2 z" />
        <path
           id="path3541"
           style="font-style:normal;font-variant:normal;font-weight:500;font-stretch:normal;font-size:45px;line-height:125%;font-family:Bandal;-inkscape-font-specification:'Bandal, Medium';text-align:start;writing-mode:lr-tb;text-anchor:start;fill:#000000;fill-opacity:1"
           d="m 115.51563,303.91723 18.74999,0 0,11.25 -14.99999,0 0,3.75 14.99999,0 0,3.75 -18.74999,0 0,-18.75 z m 3.75,3.75 0,3.75 11.24999,0 0,-3.75 -11.24999,0 z" />
        <path
           id="path3543"
           style="font-style:normal;font-variant:normal;font-weight:500;font-stretch:normal;font-size:45px;line-height:125%;font-family:Bandal;-inkscape-font-specification:'Bandal, Medium';text-align:start;writing-mode:lr-tb;text-anchor:start;fill:#000000;fill-opacity:1"
           d="m 138.01562,303.91723 13.95,0 4.8,4.8 0,13.95 -3.75,0 0,-12.3 -2.7,-2.7 -8.55,0 0,15 -3.75,0 0,-18.75 z" />
        <path
           id="path3545"
           style="font-style:normal;font-variant:normal;font-weight:500;font-stretch:normal;font-size:45px;line-height:125%;font-family:Bandal;-inkscape-font-specification:'Bandal, Medium';text-align:start;writing-mode:lr-tb;text-anchor:start;fill:#000000;fill-opacity:1"
           d="m 179.23633,296.41723 18.75,0 0,3.75 -15,0 0,7.5 15,0 0,15 -18.75,0 0,-3.75 15,0 0,-7.5 -15,0 0,-15 z" />
        <path
           id="path3547"
           style="font-style:normal;font-variant:normal;font-weight:500;font-stretch:normal;font-size:45px;line-height:125%;font-family:Bandal;-inkscape-font-specification:'Bandal, Medium';text-align:start;writing-mode:lr-tb;text-anchor:start;fill:#000000;fill-opacity:1"
           d="m 201.73633,303.91723 3.75,0 0,12.3 2.7,2.7 8.55,0 0,-15 3.75,0 0,18.75 -13.95,0 -4.8,-4.8 0,-13.95 z" />
        <path
           id="path3549"
           style="font-style:normal;font-variant:normal;font-weight:500;font-stretch:normal;font-size:45px;line-height:125%;font-family:Bandal;-inkscape-font-specification:'Bandal, Medium';text-align:start;writing-mode:lr-tb;text-anchor:start;fill:#000000;fill-opacity:1"
           d="m 224.23633,303.91723 13.95,0 4.8,4.8 0,13.95 -3.75,0 0,-12.3 -2.7,-2.7 -8.55,0 0,15 -3.75,0 0,-18.75 z" />
        <path
           id="path3551"
           style="font-style:normal;font-variant:normal;font-weight:500;font-stretch:normal;font-size:45px;line-height:125%;font-family:Bandal;-inkscape-font-specification:'Bandal, Medium';text-align:start;writing-mode:lr-tb;text-anchor:start;fill:#000000;fill-opacity:1"
           d="m 269.20703,300.16723 0,18.75 8.55,0 2.7,-2.7 0,-13.35 -2.7,-2.7 -8.55,0 z m -3.75,-3.75 13.95,0 4.8,4.8 0,16.65 -4.8,4.8 -13.95,0 0,-26.25 z" />
        <path
           id="path3553"
           style="font-style:normal;font-variant:normal;font-weight:500;font-stretch:normal;font-size:45px;line-height:125%;font-family:Bandal;-inkscape-font-specification:'Bandal, Medium';text-align:start;writing-mode:lr-tb;text-anchor:start;fill:#000000;fill-opacity:1"
           d="m 287.95703,303.91723 18.75,0 0,18.75 -18.75,0 0,-18.75 z m 3.75,3.75 0,11.25 11.25,0 0,-11.25 -11.25,0 z" />
        <path
           id="path3555"
           style="font-style:normal;font-variant:normal;font-weight:500;font-stretch:normal;font-size:45px;line-height:125%;font-family:Bandal;-inkscape-font-specification:'Bandal, Medium';text-align:start;writing-mode:lr-tb;text-anchor:start;fill:#000000;fill-opacity:1"
           d="m 310.45703,303.91723 3.75,0 0,12.3 2.7,2.7 1.05,-1.05 0,-13.95 3.75,0 0,13.95 1.05,1.05 2.7,-2.7 0,-12.3 3.75,0 0,13.95 -4.8,4.8 -3.75,0 -0.825,-0.825 -0.825,0.825 -3.75,0 -4.8,-4.8 0,-13.95 z" />
        <path
           id="path3557"
           style="font-style:normal;font-variant:normal;font-weight:500;font-stretch:normal;font-size:45px;line-height:125%;font-family:Bandal;-inkscape-font-specification:'Bandal, Medium';text-align:start;writing-mode:lr-tb;text-anchor:start;fill:#000000;fill-opacity:1"
           d="m 332.95703,303.91723 13.95,0 4.8,4.8 0,13.95 -3.75,0 0,-12.3 -2.7,-2.7 -8.55,0 0,15 -3.75,0 0,-18.75 z" />
        <path
           id="path3559"
           style="font-style:normal;font-variant:normal;font-weight:500;font-stretch:normal;font-size:45px;line-height:125%;font-family:Bandal;-inkscape-font-specification:'Bandal, Medium';text-align:start;writing-mode:lr-tb;text-anchor:start;fill:#000000;fill-opacity:1"
           d="m 355.45703,303.91723 18.75,0 0,3.75 -15,0 0,3.75 15,0 0,11.25 -18.75,0 0,-3.75 15,0 0,-3.75 -15,0 0,-11.25 z" />
      </g>
      <g
         id="flowRoot4142"
         style="font-style:normal;font-variant:normal;font-weight:500;font-stretch:normal;font-size:40px;line-height:125%;font-family:Bandal;-inkscape-font-specification:'Bandal, Medium';text-align:start;letter-spacing:0px;word-spacing:0px;writing-mode:lr-tb;text-anchor:start;fill:url(#linearGradient4156);fill-opacity:1;stroke:none;stroke-width:1px;stroke-linecap:butt;stroke-linejoin:miter;stroke-opacity:1"
         transform="translate(151.93848,282.72339)">
        <path
           id="path3562"
           style="font-style:normal;font-variant:normal;font-weight:500;font-stretch:normal;font-size:45px;line-height:125%;font-family:Bandal;-inkscape-font-specification:'Bandal, Medium';text-align:start;writing-mode:lr-tb;text-anchor:start;fill:url(#linearGradient4453);fill-opacity:1"
           d="m 48.015625,296.41723 18.75,0 0,3.75 -15,0 0,7.5 15,0 0,15 -18.75,0 0,-3.75 15,0 0,-7.5 -15,0 0,-15 z" />
        <path
           id="path3564"
           style="font-style:normal;font-variant:normal;font-weight:500;font-stretch:normal;font-size:45px;line-height:125%;font-family:Bandal;-inkscape-font-specification:'Bandal, Medium';text-align:start;writing-mode:lr-tb;text-anchor:start;fill:url(#linearGradient4453);fill-opacity:1"
           d="m 70.515625,303.91723 18.75,0 0,11.25 -15,0 0,3.75 15,0 0,3.75 -18.75,0 0,-18.75 z m 3.75,3.75 0,3.75 11.25,0 0,-3.75 -11.25,0 z" />
        <path
           id="path3566"
           style="font-style:normal;font-variant:normal;font-weight:500;font-stretch:normal;font-size:45px;line-height:125%;font-family:Bandal;-inkscape-font-specification:'Bandal, Medium';text-align:start;writing-mode:lr-tb;text-anchor:start;fill:url(#linearGradient4453);fill-opacity:1"
           d="m 93.015625,303.91723 3.75,0 0,8.55 5.625005,5.625 5.625,-5.625 0,-8.55 3.75,0 0,10.2 -8.55,8.55 -1.65001,0 -8.549995,-8.55 0,-10.2 z" />
        <path
           id="path3568"
           style="font-style:normal;font-variant:normal;font-weight:500;font-stretch:normal;font-size:45px;line-height:125%;font-family:Bandal;-inkscape-font-specification:'Bandal, Medium';text-align:start;writing-mode:lr-tb;text-anchor:start;fill:url(#linearGradient4453);fill-opacity:1"
           d="m 115.51563,303.91723 18.74999,0 0,11.25 -14.99999,0 0,3.75 14.99999,0 0,3.75 -18.74999,0 0,-18.75 z m 3.75,3.75 0,3.75 11.24999,0 0,-3.75 -11.24999,0 z" />
        <path
           id="path3570"
           style="font-style:normal;font-variant:normal;font-weight:500;font-stretch:normal;font-size:45px;line-height:125%;font-family:Bandal;-inkscape-font-specification:'Bandal, Medium';text-align:start;writing-mode:lr-tb;text-anchor:start;fill:url(#linearGradient4453);fill-opacity:1"
           d="m 138.01562,303.91723 13.95,0 4.8,4.8 0,13.95 -3.75,0 0,-12.3 -2.7,-2.7 -8.55,0 0,15 -3.75,0 0,-18.75 z" />
        <path
           id="path3572"
           style="font-style:normal;font-variant:normal;font-weight:500;font-stretch:normal;font-size:45px;line-height:125%;font-family:Bandal;-inkscape-font-specification:'Bandal, Medium';text-align:start;writing-mode:lr-tb;text-anchor:start;fill:url(#linearGradient4453);fill-opacity:1"
           d="m 179.23633,296.41723 18.75,0 0,3.75 -15,0 0,7.5 15,0 0,15 -18.75,0 0,-3.75 15,0 0,-7.5 -15,0 0,-15 z" />
        <path
           id="path3574"
           style="font-style:normal;font-variant:normal;font-weight:500;font-stretch:normal;font-size:45px;line-height:125%;font-family:Bandal;-inkscape-font-specification:'Bandal, Medium';text-align:start;writing-mode:lr-tb;text-anchor:start;fill:url(#linearGradient4453);fill-opacity:1"
           d="m 201.73633,303.91723 3.75,0 0,12.3 2.7,2.7 8.55,0 0,-15 3.75,0 0,18.75 -13.95,0 -4.8,-4.8 0,-13.95 z" />
        <path
           id="path3576"
           style="font-style:normal;font-variant:normal;font-weight:500;font-stretch:normal;font-size:45px;line-height:125%;font-family:Bandal;-inkscape-font-specification:'Bandal, Medium';text-align:start;writing-mode:lr-tb;text-anchor:start;fill:url(#linearGradient4453);fill-opacity:1"
           d="m 224.23633,303.91723 13.95,0 4.8,4.8 0,13.95 -3.75,0 0,-12.3 -2.7,-2.7 -8.55,0 0,15 -3.75,0 0,-18.75 z" />
        <path
           id="path3578"
           style="font-style:normal;font-variant:normal;font-weight:500;font-stretch:normal;font-size:45px;line-height:125%;font-family:Bandal;-inkscape-font-specification:'Bandal, Medium';text-align:start;writing-mode:lr-tb;text-anchor:start;fill:url(#linearGradient4453);fill-opacity:1"
           d="m 269.20703,300.16723 0,18.75 8.55,0 2.7,-2.7 0,-13.35 -2.7,-2.7 -8.55,0 z m -3.75,-3.75 13.95,0 4.8,4.8 0,16.65 -4.8,4.8 -13.95,0 0,-26.25 z" />
        <path
           id="path3580"
           style="font-style:normal;font-variant:normal;font-weight:500;font-stretch:normal;font-size:45px;line-height:125%;font-family:Bandal;-inkscape-font-specification:'Bandal, Medium';text-align:start;writing-mode:lr-tb;text-anchor:start;fill:url(#linearGradient4453);fill-opacity:1"
           d="m 287.95703,303.91723 18.75,0 0,18.75 -18.75,0 0,-18.75 z m 3.75,3.75 0,11.25 11.25,0 0,-11.25 -11.25,0 z" />
        <path
           id="path3582"
           style="font-style:normal;font-variant:normal;font-weight:500;font-stretch:normal;font-size:45px;line-height:125%;font-family:Bandal;-inkscape-font-specification:'Bandal, Medium';text-align:start;writing-mode:lr-tb;text-anchor:start;fill:url(#linearGradient4453);fill-opacity:1"
           d="m 310.45703,303.91723 3.75,0 0,12.3 2.7,2.7 1.05,-1.05 0,-13.95 3.75,0 0,13.95 1.05,1.05 2.7,-2.7 0,-12.3 3.75,0 0,13.95 -4.8,4.8 -3.75,0 -0.825,-0.825 -0.825,0.825 -3.75,0 -4.8,-4.8 0,-13.95 z" />
        <path
           id="path3584"
           style="font-style:normal;font-variant:normal;font-weight:500;font-stretch:normal;font-size:45px;line-height:125%;font-family:Bandal;-inkscape-font-specification:'Bandal, Medium';text-align:start;writing-mode:lr-tb;text-anchor:start;fill:url(#linearGradient4453);fill-opacity:1"
           d="m 332.95703,303.91723 13.95,0 4.8,4.8 0,13.95 -3.75,0 0,-12.3 -2.7,-2.7 -8.55,0 0,15 -3.75,0 0,-18.75 z" />
        <path
           id="path3586"
           style="font-style:normal;font-variant:normal;font-weight:500;font-stretch:normal;font-size:45px;line-height:125%;font-family:Bandal;-inkscape-font-specification:'Bandal, Medium';text-align:start;writing-mode:lr-tb;text-anchor:start;fill:url(#linearGradient4453);fill-opacity:1"
           d="m 355.45703,303.91723 18.75,0 0,3.75 -15,0 0,3.75 15,0 0,11.25 -18.75,0 0,-3.75 15,0 0,-3.75 -15,0 0,-11.25 z" />
      </g>
      <g
         id="g4401">
        <path
           id="path4343"
           d="m 178.7143,613.35608 a 2.6322248,2.6322248 0 0 1 -2.63222,2.63222 2.6322248,2.6322248 0 0 1 -2.63223,-2.63222 2.6322248,2.6322248 0 0 1 2.63223,-2.63223 2.6322248,2.6322248 0 0 1 2.63222,2.63223 z"
           style="opacity:1;fill:url(#linearGradient4345);fill-opacity:1;stroke:none;stroke-width:1;stroke-linecap:round;stroke-linejoin:round;stroke-miterlimit:4;stroke-dasharray:none;stroke-opacity:1" />
        <path
           id="path4347"
           d="m 177.23811,614.02352 -1.15603,0.66744 -1.15604,-0.66744 0,-1.33488 1.15604,-0.66744 1.15603,0.66744 z"
           style="opacity:1;fill:url(#linearGradient4359);fill-opacity:1;stroke:none;stroke-width:1;stroke-linecap:round;stroke-linejoin:round;stroke-miterlimit:4;stroke-dasharray:none;stroke-opacity:1" />
      </g>
      <g
         id="g4397"
         transform="translate(369.67685,-45.586935)">
        <path
           id="path4343-9"
           d="m 183.8457,615.90729 a 2.6322248,2.6322248 0 0 1 -2.63223,2.63222 2.6322248,2.6322248 0 0 1 -2.63222,-2.63222 2.6322248,2.6322248 0 0 1 2.63222,-2.63223 2.6322248,2.6322248 0 0 1 2.63223,2.63223 z"
           style="opacity:1;fill:url(#linearGradient4345-4);fill-opacity:1;stroke:none;stroke-width:1;stroke-linecap:round;stroke-linejoin:round;stroke-miterlimit:4;stroke-dasharray:none;stroke-opacity:1" />
        <path
           id="path4347-1"
           d="m 182.36951,616.57473 -1.15604,0.66743 -1.15604,-0.66743 0,-1.33488 1.15604,-0.66744 1.15604,0.66744 z"
           style="opacity:1;fill:url(#linearGradient4359-2);fill-opacity:1;stroke:none;stroke-width:1;stroke-linecap:round;stroke-linejoin:round;stroke-miterlimit:4;stroke-dasharray:none;stroke-opacity:1" />
      </g>
    </g>
  </g>
</svg>
