C:\Users\LTeichmann\IdeaProjects\Desafio\src\test\java\steps\TestInitialize.java
C:\Users\LTeichmann\IdeaProjects\Desafio\src\test\java\steps\delete_steps.java
C:\Users\LTeichmann\IdeaProjects\Desafio\src\test\java\steps\get_steps.java
C:\Users\LTeichmann\IdeaProjects\Desafio\src\test\java\steps\put_steps.java
C:\Users\LTeichmann\IdeaProjects\Desafio\src\test\java\steps\post_steps.java
