@startuml

title __IMPL's Class Diagram__\n

  namespace fr.cnam.foad.nfa035.badges.wallet.fileutils.streaming {
    namespace media {
      namespace impl {
        class fr.cnam.foad.nfa035.badges.wallet.fileutils.streaming.media.impl.ImageByteArrayFrame {
            + ImageByteArrayFrame()
            + getEncodedImageInput()
            + getEncodedImageOutput()
        }
      }
    }
  }
  

  namespace fr.cnam.foad.nfa035.badges.wallet.fileutils.streaming {
    namespace media {
      namespace impl {
        class fr.cnam.foad.nfa035.badges.wallet.fileutils.streaming.media.impl.ImageFileFrame {
            + ImageFileFrame()
            + getEncodedImageInput()
            + getEncodedImageOutput()
        }
      }
    }
  }
  

  namespace fr.cnam.foad.nfa035.badges.wallet.fileutils.streaming {
    namespace media {
      namespace impl {
        class fr.cnam.foad.nfa035.badges.wallet.fileutils.streaming.media.impl.ResumableImageFileFrame {
            - reader : BufferedReader
            + ResumableImageFileFrame()
            + getEncodedImageInput()
            + getEncodedImageOutput()
            + getEncodedImageReader()
        }
      }
    }
  }
  

  fr.cnam.foad.nfa035.badges.wallet.fileutils.streaming.media.impl.ImageByteArrayFrame -up-|> fr.cnam.foad.nfa035.badges.wallet.fileutils.streaming.media.AbstractImageFrameMedia
  fr.cnam.foad.nfa035.badges.wallet.fileutils.streaming.media.impl.ImageFileFrame -up-|> fr.cnam.foad.nfa035.badges.wallet.fileutils.streaming.media.AbstractImageFrameMedia
  fr.cnam.foad.nfa035.badges.wallet.fileutils.streaming.media.impl.ResumableImageFileFrame .up.|> fr.cnam.foad.nfa035.badges.wallet.fileutils.streaming.media.ResumableImageFrameMedia
  fr.cnam.foad.nfa035.badges.wallet.fileutils.streaming.media.impl.ResumableImageFileFrame -up-|> fr.cnam.foad.nfa035.badges.wallet.fileutils.streaming.media.AbstractImageFrameMedia


right footer


PlantUML diagram generated by SketchIt! (https://bitbucket.org/pmesmeur/sketch.it)
For more information about this tool, please contact philippe.mesmeur@gmail.com
endfooter

@enduml
