{
  "name": "example",
  "$schema": "../../node_modules/nx/schemas/project-schema.json",
  "sourceRoot": "libs/src",
  "projectType": "library",
  "targets": {
    "build": {
      "executor": "@nx/js:tsc",
      "outputs": ["{options.outputPath}"],
      "options": {
        "outputPath": "dist/libs/example",
        "main": "libs/example/src/index.ts",
        "tsConfig": "libs/example/tsconfig.lib.json",
        "assets": ["libs/example/*.md"]
      }
    },
    "lint": {
      "executor": "@nx/eslint:lint",
      "outputs": ["{options.outputFile}"],
      "options": {
        "lintFilePatterns": [
          "libs/example/**/*.ts",
          "libs/example/package.json"
        ]
      }
    },
    "test": {
      "executor": "@nx/jest:jest",
      "outputs": ["{workspaceRoot}/coverage/{projectRoot}"],
      "options": {
        "jestConfig": "libs/jest.config.ts"
      }
    }
  },
  "tags": ["typscript", "lib"]
}
