pv260\unittesting\CatchExceptionTest.class
pv260\unittesting\CatchExceptionTest$MyObject.class
pv260\unittesting\CustomerAnalysisTest.class
pv260\unittesting\QuickcheckTest.class
pv260\unittesting\CSVFileInputTest.class
pv260\unittesting\AssertJTest.class
pv260\unittesting\Vector2DTest.class
