C:\Ja\MU\vyuka\Software quality\jaro2017\seminar4-unittesting\UnitTesting\src\test\java\pv260\unittesting\CSVFileInputTest.java
C:\Ja\MU\vyuka\Software quality\jaro2017\seminar4-unittesting\UnitTesting\src\test\java\pv260\unittesting\CatchExceptionTest.java
C:\Ja\MU\vyuka\Software quality\jaro2017\seminar4-unittesting\UnitTesting\src\test\java\pv260\unittesting\QuickcheckTest.java
C:\Ja\MU\vyuka\Software quality\jaro2017\seminar4-unittesting\UnitTesting\src\test\java\pv260\unittesting\CustomerAnalysisTest.java
C:\Ja\MU\vyuka\Software quality\jaro2017\seminar4-unittesting\UnitTesting\src\test\java\pv260\unittesting\AssertJTest.java
C:\Ja\MU\vyuka\Software quality\jaro2017\seminar4-unittesting\UnitTesting\src\test\java\pv260\unittesting\Vector2DTest.java
