-------------------------------------------------------------------------------
Test set: pv260.unittesting.CatchExceptionTest
-------------------------------------------------------------------------------
Tests run: 2, Failures: 0, Errors: 0, Skipped: 0, Time elapsed: 0.069 sec
