{
  "f9155ac790fd02fadcdeca367b02581c04a353aa6d5aa84409a59f6804c87acd": true,
  "cfe162270ab72704367babd5099d3933d2486340e14cd120ab6d90ee3e9419ea": true,
  "3e163638dc3317ea5f19347eda76a641cdaaa0c9d0621e32effe34835eb84646": true,
  "e7fc0741cc6562975a990e3d9ef820571588dab20aba97032df9f00caa9cd57a": true
}
