flight_code,destination,carrier,max_passengers,max_baggage_weight,max_baggage_dimension,total_checks_in,total_baggage_volume,total_baggage_weight,total_extra_fees
FBLN2445,Berlin,Ryanair,60,10,55x40x20
FAMD6578,Amsterdam,Norwegian,50,10,55x40x20
FAM76578,Madrid,Iberia,50,20,55x40x20
FAMD6578,Paris,Air France,50,55x40x20
BAMD6578,Barcelona,Ryanair,50,10,55x40x20
FAM7657,Buenos Aires,KLM,50,20,55x40x20

