(module PhoenixContact_MC_1,5_4-G-3.81_1x04_P3.81mm_Horizontal locked (layer F.Cu) (tedit 5D57CDE2)
  (descr "Generic Phoenix Contact connector footprint for: MC_1,5/4-G-3.81; number of pins: 04; pin pitch: 3.81mm; Angled || order number: 1803293 8A 160V")
  (tags "phoenix_contact connector MC_01x04_G_3.81mm")
  (fp_text reference P1 (at 5.715 -2.8) (layer F.SilkS) hide
    (effects (font (size 1 1) (thickness 0.15)))
  )
  (fp_text value CONN_01X04 (at 5.715 9) (layer F.Fab) hide
    (effects (font (size 1 1) (thickness 0.15)))
  )
  (fp_line (start -2.68 -1.28) (end -2.68 8.08) (layer F.SilkS) (width 0.12))
  (fp_line (start -2.68 8.08) (end 14.11 8.08) (layer F.SilkS) (width 0.12))
  (fp_line (start 14.11 8.08) (end 14.11 -1.28) (layer F.SilkS) (width 0.12))
  (fp_line (start -2.68 -1.28) (end -1.05 -1.28) (layer F.SilkS) (width 0.12))
  (fp_line (start 14.11 -1.28) (end 12.48 -1.28) (layer F.SilkS) (width 0.12))
  (fp_line (start 1.05 -1.28) (end 2.76 -1.28) (layer F.SilkS) (width 0.12))
  (fp_line (start 4.86 -1.28) (end 6.57 -1.28) (layer F.SilkS) (width 0.12))
  (fp_line (start 8.67 -1.28) (end 10.38 -1.28) (layer F.SilkS) (width 0.12))
  (fp_line (start -2.6 -1.2) (end -2.6 8) (layer F.Fab) (width 0.1))
  (fp_line (start -2.6 8) (end 14.03 8) (layer F.Fab) (width 0.1))
  (fp_line (start 14.03 8) (end 14.03 -1.2) (layer F.Fab) (width 0.1))
  (fp_line (start 14.03 -1.2) (end -2.6 -1.2) (layer F.Fab) (width 0.1))
  (fp_line (start -2.68 4.8) (end 14.11 4.8) (layer F.SilkS) (width 0.12))
  (fp_line (start -3.18 -2.3) (end -3.18 8.5) (layer F.CrtYd) (width 0.05))
  (fp_line (start -3.18 8.5) (end 14.53 8.5) (layer F.CrtYd) (width 0.05))
  (fp_line (start 14.53 8.5) (end 14.53 -2.3) (layer F.CrtYd) (width 0.05))
  (fp_line (start 14.53 -2.3) (end -3.18 -2.3) (layer F.CrtYd) (width 0.05))
  (fp_line (start 0.3 -2.6) (end 0 -2) (layer F.SilkS) (width 0.12))
  (fp_line (start 0 -2) (end -0.3 -2.6) (layer F.SilkS) (width 0.12))
  (fp_line (start -0.3 -2.6) (end 0.3 -2.6) (layer F.SilkS) (width 0.12))
  (fp_line (start 0.8 -1.2) (end 0 0) (layer F.Fab) (width 0.1))
  (fp_line (start 0 0) (end -0.8 -1.2) (layer F.Fab) (width 0.1))
  (fp_text user %R (at 5.715 3) (layer F.Fab)
    (effects (font (size 1 1) (thickness 0.15)))
  )
  (pad 1 thru_hole roundrect (at 0 0) (size 2 3) (drill 1.2) (layers *.Cu *.Mask) (roundrect_rratio 0.25))
  (pad 2 thru_hole roundrect (at 3.81 0) (size 2 3) (drill 1.2) (layers *.Cu *.Mask) (roundrect_rratio 0.25))
  (pad 3 thru_hole roundrect (at 7.62 0) (size 2 3) (drill 1.2) (layers *.Cu *.Mask) (roundrect_rratio 0.25))
  (pad 4 thru_hole roundrect (at 11.43 0) (size 2 3) (drill 1.2) (layers *.Cu *.Mask) (roundrect_rratio 0.25))
  (model ${KISYS3DMOD}/Connector_Phoenix_MC.3dshapes/PhoenixContact_MC_1,5_4-G-3.81_1x04_P3.81mm_Horizontal.wrl
    (at (xyz 0 0 0))
    (scale (xyz 1 1 1))
    (rotate (xyz 0 0 0))
  )
)
