#VRML V2.0 utf8
DEF TXFM_1 Transform {
  center 0 0 0
  rotation 0 0 1 0
  scale 1 1 1
  scaleOrientation 0 0 1 0
  translation 0 0 0
 children [
DEF TXFM_2 Transform {
  center 0 0 0
  rotation 0 0 1 0
  scale 1 1 1
  scaleOrientation 0 0 1 0
  translation 0 0 0
 children [
DEF SHAPE_1 Shape {
 appearance DEF APP_1 Appearance {
  material Material {
   ambientIntensity 0.13665412
   diffuseColor 0.88300002 0.71100003 0.49200001
   emissiveColor 0 0 0
   shininess 0.1
   specularColor 0.12 0.12 0.12
   transparency 0
} }
 geometry DEF FACE_1 IndexedFaceSet {
  coord DEF COORD_1 Coordinate { point [
  0.98425197 0 0.88582677,0.98425197 0 0.88582677,
  0.94775324 0.265548 0.88582677,0.84096398 0.51140153 0.88582677,
  0.67180427 0.71932674 0.88582677,0.45281992 0.87390277 0.88582677,
  0.20025198 0.96366544 0.88582677,-0.06716773 0.98195745 0.88582677,
  -0.32960592 0.92742217 0.88582677,-0.56759874 0.80410423 0.88582677,
  -0.76349536 0.62114955 0.88582677,-0.90276703 0.39212706 0.88582677,
  -0.97508459 0.13402229 0.88582677,-0.97508459 -0.13402229 0.88582677,
  -0.90276703 -0.39212706 0.88582677,-0.76349536 -0.62114955 0.88582677,
  -0.56759874 -0.80410423 0.88582677,-0.32960592 -0.92742217 0.88582677,
  -0.06716773 -0.98195745 0.88582677,0.20025198 -0.96366544 0.88582677,
  0.45281992 -0.87390277 0.88582677,0.67180427 -0.71932674 0.88582677,
  0.84096398 -0.51140153 0.88582677,0.94775324 -0.265548 0.88582677,
  0.98425197 0 1.9192913,0.98425197 0 1.9192913,
  0.94775324 0.265548 1.9192913,0.84096398 0.51140153 1.9192913,
  0.67180427 0.71932674 1.9192913,0.45281992 0.87390277 1.9192913,
  0.20025198 0.96366544 1.9192913,-0.06716773 0.98195745 1.9192913,
  -0.32960592 0.92742217 1.9192913,-0.56759874 0.80410423 1.9192913,
  -0.76349536 0.62114955 1.9192913,-0.90276703 0.39212706 1.9192913,
  -0.97508459 0.13402229 1.9192913,-0.97508459 -0.13402229 1.9192913,
  -0.90276703 -0.39212706 1.9192913,-0.76349536 -0.62114955 1.9192913,
  -0.56759874 -0.80410423 1.9192913,-0.32960592 -0.92742217 1.9192913,
  -0.06716773 -0.98195745 1.9192913,0.20025198 -0.96366544 1.9192913,
  0.45281992 -0.87390277 1.9192913,0.67180427 -0.71932674 1.9192913,
  0.84096398 -0.51140153 1.9192913,0.94775324 -0.265548 1.9192913] }
 coordIndex [
  4,5,29,-1,3,4,27,-1,2,26,25,-1,2,27,26,-1,2,3,27,-1,23,1,24,-1,0,2,25,-1,23,47,46,-1,
  23,24,47,-1,22,46,45,-1,22,23,46,-1,21,22,45,-1,20,45,44,-1,20,21,45,-1,19,43,42,-1,19,44,43,-1,
  19,20,44,-1,18,19,42,-1,17,41,40,-1,17,42,41,-1,17,18,42,-1,16,40,39,-1,16,17,40,-1,15,16,39,-1,
  14,39,38,-1,14,15,39,-1,13,38,37,-1,13,14,38,-1,12,36,35,-1,12,37,36,-1,12,13,37,-1,11,12,35,-1,
  11,35,34,-1,10,11,34,-1,10,34,33,-1,9,10,33,-1,9,33,32,-1,8,9,32,-1,8,32,31,-1,7,8,31,-1,
  7,31,30,-1,6,7,30,-1,5,6,30,-1,5,30,29,-1,4,28,27,-1,4,29,28,-1]
  normalPerVertex TRUE
  normal DEF NORM_1 Normal { vector [
  0.99068595 0.13616665 0,0.99068595 -0.13616665 0,
  0.96291729 0.26979677 0,0.8544194 0.51958395 0,
  0.68255314 0.73083596 0,0.41894656 0.90801089 0,
  0.20345601 0.97908409 0,-0.022509995 0.99974662 0,
  -0.29140367 0.95660018 0,-0.53868527 0.84250708 0,
  -0.74601505 0.66592908 0,-0.89801631 0.43996217 0,
  -0.99068595 0.13616665 0,-0.9834158 -0.18136528 0,
  -0.89801631 -0.43996217 0,-0.77571129 -0.63108794 0,
  -0.61346678 -0.78972053 0,-0.33487961 -0.94226092 0,
  -0.068242413 -0.99766877 0,0.20345601 -0.97908409 0,
  0.50021932 -0.86589874 0,0.68255314 -0.73083596 0,
  0.82974396 -0.55814421 0,0.96291729 -0.26979677 0,
  0.99068595 -0.13616665 0,0.99068595 0.13616665 0,
  0.96291729 0.26979677 0,0.8544194 0.51958395 0,
  0.68255314 0.73083596 0,0.50021932 0.86589874 0,
  0.20345601 0.97908409 0,-0.11383181 0.99350003 0,
  -0.37765372 0.9259469 0,-0.61346678 0.78972053 0,
  -0.80378182 0.59492419 0,-0.93448403 0.35600505 0,
  -0.99068595 0.13616665 0,-0.99587984 -0.090682641 0,
  -0.93448403 -0.35600505 0,-0.77571129 -0.63108794 0,
  -0.53868527 -0.84250708 0,-0.33487961 -0.94226092 0,
  -0.068242413 -0.99766877 0,0.20345601 -0.97908409 0,
  0.41894656 -0.90801089 0,0.68255314 -0.73083596 0,
  0.87730418 -0.47993476 0,0.96291729 -0.26979677 0] }
}
}
DEF SHAPE_2 Shape {
 appearance USE APP_1
 geometry DEF FACE_2 IndexedFaceSet {
  coord DEF COORD_2 Coordinate { point [
  0.49212598 0 0.39370079,0.49212598 0 0.39370079,
  0.47387662 0.132774 0.39370079,0.42048199 0.25570076 0.39370079,
  0.33590214 0.35966337 0.39370079,0.22640996 0.43695139 0.39370079,
  0.10012599 0.48183272 0.39370079,-0.033583865 0.49097872 0.39370079,
  -0.16480296 0.46371108 0.39370079,-0.28379937 0.40205211 0.39370079,
  -0.38174768 0.31057478 0.39370079,-0.45138351 0.19606353 0.39370079,
  -0.4875423 0.067011146 0.39370079,-0.4875423 -0.067011146 0.39370079,
  -0.45138351 -0.19606353 0.39370079,-0.38174768 -0.31057478 0.39370079,
  -0.28379937 -0.40205211 0.39370079,-0.16480296 -0.46371108 0.39370079,
  -0.033583865 -0.49097872 0.39370079,0.10012599 -0.48183272 0.39370079,
  0.22640996 -0.43695139 0.39370079,0.33590214 -0.35966337 0.39370079,
  0.42048199 -0.25570076 0.39370079,0.47387662 -0.132774 0.39370079,
  0.98425197 0 0.88582677,0.96016561 0 0.73375148,
  0.89026427 0 0.59656238,0.78139038 0 0.48768849,
  0.64420128 0 0.41778715,0.98425197 0 0.88582677,
  0.94775324 0.265548 0.88582677,0.84096398 0.51140153 0.88582677,
  0.67180427 0.71932674 0.88582677,0.45281992 0.87390277 0.88582677,
  0.20025198 0.96366544 0.88582677,-0.06716773 0.98195745 0.88582677,
  -0.32960592 0.92742217 0.88582677,-0.56759874 0.80410423 0.88582677,
  -0.76349536 0.62114955 0.88582677,-0.90276703 0.39212706 0.88582677,
  -0.97508459 0.13402229 0.88582677,-0.97508459 -0.13402229 0.88582677,
  -0.90276703 -0.39212706 0.88582677,-0.76349536 -0.62114955 0.88582677,
  -0.56759874 -0.80410423 0.88582677,-0.32960592 -0.92742217 0.88582677,
  -0.06716773 -0.98195745 0.88582677,0.20025198 -0.96366544 0.88582677,
  0.45281992 -0.87390277 0.88582677,0.67180427 -0.71932674 0.88582677,
  0.84096398 -0.51140153 0.88582677,0.94775324 -0.265548 0.88582677,
  0.96016561 0 0.73375148,0.89026427 0 0.59656238,
  0.78139038 0 0.48768849,0.64420128 0 0.41778715,
  0.92456006 -0.25904958 0.73375148,0.85725085 -0.24019043 0.59656238,
  0.82038413 -0.49888664 0.73375148,0.75241431 -0.2108166 0.48768849,
  0.76065907 -0.46256703 0.59656238,0.65536405 -0.70172356 0.73375148,
  0.62031255 -0.17380342 0.41778715,0.6676351 -0.4059979 0.48768849,
  0.60765268 -0.65063715 0.59656238,0.44173863 -0.85251685 0.73375148,
  0.55041807 -0.33471664 0.41778715,0.53334046 -0.57106819 0.48768849,
  0.40957946 -0.79045248 0.59656238,0.19535147 -0.94008287 0.73375148,
  0.43970161 -0.47080546 0.41778715,0.35949039 -0.69378497 0.48768849,
  0.18112962 -0.87164358 0.59656238,-0.065524018 -0.95792724 0.73375148,
  0.29637448 -0.57197679 0.41778715,0.15897857 -0.76504689 0.48768849,
  -0.060753782 -0.88818886 0.59656238,-0.32153989 -0.90472653 0.73375148,
  0.13106662 -0.63072722 0.41778715,-0.053323965 -0.77956878 0.48768849,
  -0.29813135 -0.83886123 0.59656238,-0.55370861 -0.78442639 0.73375148,
  -0.04396185 -0.64269949 0.41778715,-0.26167171 -0.73627362 0.48768849,
  -0.51339789 -0.7273191 0.59656238,-0.7448113 -0.60594894 0.73375148,
  -0.21572987 -0.60700569 0.41778715,-0.45061246 -0.63837242 0.48768849,
  -0.69058805 -0.56183505 0.59656238,-0.88067475 -0.38253102 0.73375148,
  -0.3714982 -0.52629305 0.41778715,-0.60613334 -0.49312605 0.48768849,
  -0.81656045 -0.35468225 0.59656238,-0.95122257 -0.13074253 0.73375148,
  -0.4997142 -0.40654766 0.41778715,-0.71670009 -0.31130678 0.48768849,
  -0.8819723 -0.1212243 0.59656238,-0.95122257 0.13074253 0.73375148,
  -0.59086869 -0.25665049 0.41778715,-0.77411247 -0.10639931 0.48768849,
  -0.8819723 0.1212243 0.59656238,-0.88067475 0.38253102 0.73375148,
  -0.63820115 -0.087718729 0.41778715,-0.77411247 0.10639931 0.48768849,
  -0.81656045 0.35468225 0.59656238,-0.7448113 0.60594894 0.73375148,
  -0.63820115 0.087718729 0.41778715,-0.71670009 0.31130678 0.48768849,
  -0.69058805 0.56183505 0.59656238,-0.55370861 0.78442639 0.73375148,
  -0.59086869 0.25665049 0.41778715,-0.60613334 0.49312605 0.48768849,
  -0.51339789 0.7273191 0.59656238,-0.32153989 0.90472653 0.73375148,
  -0.4997142 0.40654766 0.41778715,-0.45061246 0.63837242 0.48768849,
  -0.29813135 0.83886123 0.59656238,-0.065524018 0.95792724 0.73375148,
  -0.3714982 0.52629305 0.41778715,-0.26167171 0.73627362 0.48768849,
  -0.060753782 0.88818886 0.59656238,0.19535147 0.94008287 0.73375148,
  -0.21572987 0.60700569 0.41778715,-0.053323965 0.77956878 0.48768849,
  0.18112962 0.87164358 0.59656238,0.44173863 0.85251685 0.73375148,
  -0.04396185 0.64269949 0.41778715,0.15897857 0.76504689 0.48768849,
  0.40957946 0.79045248 0.59656238,0.65536405 0.70172356 0.73375148,
  0.13106662 0.63072722 0.41778715,0.35949039 0.69378497 0.48768849,
  0.60765268 0.65063715 0.59656238,0.82038413 0.49888664 0.73375148,
  0.29637448 0.57197679 0.41778715,0.53334046 0.57106819 0.48768849,
  0.76065907 0.46256703 0.59656238,0.92456006 0.25904958 0.73375148,
  0.43970161 0.47080546 0.41778715,0.6676351 0.4059979 0.48768849,
  0.85725085 0.24019043 0.59656238,0.55041807 0.33471664 0.41778715,
  0.75241431 0.2108166 0.48768849,0.62031255 0.17380342 0.41778715] }
 coordIndex [
  51,25,24,-1,52,30,29,-1,0,2,55,-1,56,26,25,-1,56,51,50,-1,56,25,51,-1,57,27,26,-1,57,26,56,-1,
  58,56,50,-1,58,57,56,-1,59,27,57,-1,59,28,27,-1,60,59,57,-1,60,57,58,-1,61,50,49,-1,61,58,50,-1,
  62,22,23,-1,62,23,1,-1,62,1,28,-1,62,28,59,-1,63,62,59,-1,63,59,60,-1,64,58,61,-1,64,60,58,-1,
  65,48,47,-1,65,49,48,-1,65,61,49,-1,66,22,62,-1,66,62,63,-1,67,63,60,-1,67,60,64,-1,68,64,61,-1,
  68,61,65,-1,69,68,65,-1,69,65,47,-1,70,63,67,-1,70,22,66,-1,70,21,22,-1,70,66,63,-1,71,64,68,-1,
  71,67,64,-1,72,68,69,-1,72,71,68,-1,73,46,45,-1,73,47,46,-1,73,69,47,-1,74,70,67,-1,74,20,21,-1,
  74,21,70,-1,74,67,71,-1,75,74,71,-1,75,71,72,-1,76,72,69,-1,76,69,73,-1,77,73,45,-1,78,18,19,-1,
  78,19,20,-1,78,20,74,-1,78,74,75,-1,79,72,76,-1,79,75,72,-1,80,76,73,-1,80,73,77,-1,81,44,43,-1,
  81,45,44,-1,81,77,45,-1,82,18,78,-1,82,78,75,-1,82,75,79,-1,83,76,80,-1,83,79,76,-1,84,80,77,-1,
  84,77,81,-1,85,81,43,-1,85,84,81,-1,85,43,42,-1,86,18,82,-1,86,16,17,-1,86,17,18,-1,86,82,79,-1,
  86,79,83,-1,87,83,80,-1,87,80,84,-1,88,87,84,-1,88,84,85,-1,89,88,85,-1,89,85,42,-1,90,83,87,-1,
  90,16,86,-1,90,86,83,-1,91,87,88,-1,92,88,89,-1,92,91,88,-1,93,89,42,-1,93,42,41,-1,94,16,90,-1,
  94,14,15,-1,94,87,91,-1,94,15,16,-1,94,90,87,-1,95,91,92,-1,96,89,93,-1,96,92,89,-1,97,93,41,-1,
  97,40,39,-1,97,41,40,-1,98,14,94,-1,98,94,91,-1,98,91,95,-1,99,95,92,-1,99,92,96,-1,100,96,93,-1,
  100,93,97,-1,101,97,39,-1,102,95,99,-1,102,13,14,-1,102,14,98,-1,102,98,95,-1,103,96,100,-1,103,99,96,-1,
  104,97,101,-1,104,100,97,-1,105,39,38,-1,105,101,39,-1,105,104,101,-1,106,11,12,-1,106,12,13,-1,106,102,99,-1,
  106,13,102,-1,106,99,103,-1,107,103,100,-1,107,100,104,-1,108,104,105,-1,108,107,104,-1,109,37,36,-1,109,38,37,-1,
  109,105,38,-1,110,10,11,-1,110,11,106,-1,110,106,103,-1,110,103,107,-1,111,107,108,-1,112,108,105,-1,112,105,109,-1,
  113,112,109,-1,113,109,36,-1,114,10,110,-1,114,110,107,-1,114,107,111,-1,115,111,108,-1,115,108,112,-1,116,112,113,-1,
  116,115,112,-1,117,36,35,-1,117,116,113,-1,117,113,36,-1,118,9,10,-1,118,10,114,-1,118,114,111,-1,118,111,115,-1,
  119,115,116,-1,120,116,117,-1,120,119,116,-1,121,35,34,-1,121,117,35,-1,122,7,8,-1,122,8,9,-1,122,9,118,-1,
  122,118,115,-1,122,115,119,-1,123,119,120,-1,124,117,121,-1,124,120,117,-1,125,34,33,-1,125,121,34,-1,126,6,7,-1,
  126,7,122,-1,126,119,123,-1,126,122,119,-1,127,120,124,-1,127,123,120,-1,128,121,125,-1,128,124,121,-1,129,125,33,-1,
  129,32,31,-1,129,33,32,-1,130,6,126,-1,130,126,123,-1,130,123,127,-1,131,127,124,-1,131,124,128,-1,132,128,125,-1,
  132,125,129,-1,133,129,31,-1,133,31,30,-1,133,132,129,-1,134,5,6,-1,134,130,127,-1,134,127,131,-1,134,6,130,-1,
  135,128,132,-1,135,131,128,-1,136,132,133,-1,136,135,132,-1,137,133,30,-1,137,136,133,-1,137,30,52,-1,138,4,5,-1,
  138,5,134,-1,138,134,131,-1,138,131,135,-1,139,135,136,-1,140,139,136,-1,140,136,137,-1,140,137,52,-1,140,52,53,-1,
  140,53,54,-1,141,3,4,-1,141,4,138,-1,141,138,135,-1,141,135,139,-1,142,140,54,-1,142,141,139,-1,142,139,140,-1,
  143,2,3,-1,143,3,141,-1,143,54,55,-1,143,142,54,-1,143,141,142,-1,143,55,2,-1]
  normalPerVertex TRUE
  normal DEF NORM_2 Normal { vector [
  0.15639832 0.021496454 -0.98746011,0.15639832 -0.021496454 -0.98746011,
  0.15292275 0.034013933 -0.98765261,0.13807511 0.074010668 -0.98765261,
  0.11298707 0.10851837 -0.98765261,0.079519296 0.13497776 -0.98765261,
  0.031827533 0.1531625 -0.98768834,-0.01916071 0.1554837 -0.98765261,
  -0.052386713 0.14740208 -0.98768834,-0.08326071 0.13270256 -0.98765261,
  -0.12134798 0.098723905 -0.98768834,-0.14686685 0.054520104 -0.98765261,
  -0.15497743 0.021301157 -0.98768834,-0.15612998 -0.012874147 -0.98765261,
  -0.14348346 -0.062323661 -0.98768834,-0.12134798 -0.098723905 -0.98768834,
  -0.090212678 -0.12780225 -0.98768834,-0.052386713 -0.14740208 -0.98768834,
  -0.010675465 -0.15606978 -0.98768834,0.031827533 -0.1531625 -0.98768834,
  0.064415553 -0.14280389 -0.98765261,0.10055488 -0.12012923 -0.98765261,
  0.13366064 -0.081280837 -0.98768834,0.15063345 -0.042205514 -0.98768834,
  0.97871102 -0.13452073 -0.1550126,0.95784066 -0.13165217 -0.25536046,
  0.83478939 -0.11473916 -0.53848083,0.63085823 -0.086709467 -0.77103785,
  0.36477231 -0.0501368 -0.92974591,0.97871102 0.13452073 -0.1550126,
  0.95106218 0.26647513 -0.15643447,0.81996312 0.5506697 -0.15627975,
  0.67414978 0.72183816 -0.15643447,0.4934297 0.85563063 -0.15627975,
  0.24428561 0.95702726 -0.15627975,-0.022976029 0.98744556 -0.15627975,
  -0.33075669 0.93066013 -0.15643447,-0.56958043 0.80691164 -0.15643447,
  -0.73734309 0.65719236 -0.15627975,-0.90591891 0.39349611 -0.15643447,
  -0.97848896 0.13449021 -0.15643447,-0.98357566 -0.090308135 -0.15627975,
  -0.90591891 -0.39349611 -0.15643447,-0.73734309 -0.65719236 -0.15627975,
  -0.56958043 -0.80691164 -0.15643447,-0.33075669 -0.93066013 -0.15643447,
  -0.067402236 -0.98538581 -0.15643447,0.20095113 -0.96702994 -0.15643447,
  0.45440087 -0.87695388 -0.15643447,0.64098776 -0.75147278 -0.15627975,
  0.84390008 -0.51318701 -0.15643447,0.96211763 -0.2233972 -0.15627975,
  0.94420813 0.12977842 -0.30270212,0.80406126 0.11051568 -0.5841847,
  0.5959088 0.081905779 -0.79886429,0.26694748 0.036691086 -0.96301236,
  0.91537674 -0.26100038 -0.30653585,0.77985769 -0.22676322 -0.58343845,
  0.79835103 -0.48548802 -0.35628221,0.56973928 -0.17008536 -0.80403241,
  0.66620215 -0.4051265 -0.62613674,0.65287121 -0.69267233 -0.30653585,
  0.28768822 -0.092411463 -0.95325527,0.46975653 -0.28566527 -0.83529884,
  0.56012497 -0.58809828 -0.58343845,0.44453827 -0.85791993 -0.25760265,
  0.26403012 -0.16056027 -0.95105652,0.41313341 -0.42761276 -0.80403241,
  0.38661072 -0.74612483 -0.54206078,0.1901049 -0.91483502 -0.35628221,
  0.23000423 -0.22341792 -0.94719717,0.29133308 -0.56224732 -0.77395283,
  0.15863735 -0.76340486 -0.62613674,-0.081840796 -0.95513392 -0.28464235,
  0.1601333 -0.304019 -0.93911116,0.11185934 -0.53829669 -0.83529884,
  -0.047488316 -0.8107678 -0.58343845,-0.33714937 -0.87902182 -0.33712156,
  0.054348665 -0.26154013 -0.96366124,-0.030529279 -0.59380118 -0.80403241,
  -0.26446986 -0.76789014 -0.58343845,-0.5572179 -0.78939793 -0.25760265,
  -0.0088070485 -0.34399684 -0.9389295,-0.18960281 -0.56354472 -0.80403241,
  -0.48460713 -0.68653189 -0.54206078,-0.74110921 -0.59732145 -0.30653585,
  -0.090406752 -0.28832449 -0.95325527,-0.3598844 -0.4971316 -0.78952098,
  -0.63498731 -0.50635036 -0.58343845,-0.85702242 -0.37225737 -0.35628221,
  -0.18626015 -0.28934157 -0.9389295,-0.47837746 -0.35371046 -0.80376857,
  -0.71516182 -0.31063862 -0.62613674,-0.94239042 -0.13392563 -0.30653585,
  -0.22705406 -0.19937614 -0.95325527,-0.52311857 -0.21545682 -0.82457584,
  -0.80347164 -0.11846053 -0.58343845,-0.94732227 0.14683065 -0.28464235,
  -0.30948152 -0.15044127 -0.9389295,-0.58759266 -0.090921691 -0.80403241,
  -0.805637 0.10270636 -0.58343845,-0.87231979 0.37890195 -0.30901699,
  -0.31516463 -0.059065812 -0.94719717,-0.59033351 0.070980534 -0.80403241,
  -0.77076869 0.33479209 -0.54206078,-0.74580119 0.58036248 -0.32704735,
  -0.30068771 0.029854462 -0.95325527,-0.55995429 0.25121268 -0.78952098,
  -0.60483239 0.49206764 -0.62613674,-0.5572179 0.78939793 -0.25760265,
  -0.29777703 0.11839915 -0.94726474,-0.4319695 0.3653451 -0.82457584,
  -0.48460713 0.68653189 -0.54206078,-0.33714937 0.87902182 -0.33712156,
  -0.27595621 0.2055713 -0.9389295,-0.34790973 0.50558425 -0.78952098,
  -0.26446986 0.76789014 -0.58343845,-0.08489917 0.94118657 -0.32704735,
  -0.19743989 0.2526559 -0.94719717,-0.17308869 0.56920681 -0.80376857,
  -0.053209515 0.77789558 -0.62613674,0.18939445 0.93282663 -0.30653585,
  -0.11182857 0.28071117 -0.95325527,-0.027834801 0.56506629 -0.82457584,
  0.15744554 0.79674994 -0.58343845,0.43404481 0.84713687 -0.30653585,
  -0.031871947 0.31886313 -0.94726474,0.11110084 0.58411342 -0.80403241,
  0.3665676 0.724726 -0.58343845,0.65951762 0.70617094 -0.25760265,
  0.055565916 0.33959361 -0.9389295,0.26457284 0.53247826 -0.80403241,
  0.57357622 0.61415017 -0.54206078,0.81554173 0.49084361 -0.30653585,
  0.13349425 0.2915421 -0.94719717,0.42422517 0.44349704 -0.78952098,
  0.69802103 0.41517009 -0.58343845,0.8999805 0.27637682 -0.33712156,
  0.20720104 0.24471461 -0.94719717,0.53736152 0.30126727 -0.78770593,
  0.775173 0.19687782 -0.60028821,0.29238237 0.18050698 -0.93911116,
  0.54176119 0.16300153 -0.82457584,0.31112553 0.076749071 -0.94726474] }
}
}
DEF SHAPE_3 Shape {
 appearance USE APP_1
 geometry DEF FACE_3 IndexedFaceSet {
  coord DEF COORD_3 Coordinate { point [
  0.98425197 0 1.9192913,0.94775324 0.265548 1.9192913,
  0.84096398 0.51140153 1.9192913,0.67180427 0.71932674 1.9192913,
  0.45281992 0.87390277 1.9192913,0.20025198 0.96366544 1.9192913,
  -0.06716773 0.98195745 1.9192913,-0.32960592 0.92742217 1.9192913,
  -0.56759874 0.80410423 1.9192913,-0.76349536 0.62114955 1.9192913,
  -0.90276703 0.39212706 1.9192913,-0.97508459 0.13402229 1.9192913,
  -0.97508459 -0.13402229 1.9192913,-0.90276703 -0.39212706 1.9192913,
  -0.76349536 -0.62114955 1.9192913,-0.56759874 -0.80410423 1.9192913,
  -0.32960592 -0.92742217 1.9192913,-0.06716773 -0.98195745 1.9192913,
  0.20025198 -0.96366544 1.9192913,0.45281992 -0.87390277 1.9192913,
  0.67180427 -0.71932674 1.9192913,0.84096398 -0.51140153 1.9192913,
  0.94775324 -0.265548 1.9192913,0.88582677 0 1.9192913,
  0.85297791 -0.2389932 1.9192913,0.75686758 -0.46026137 1.9192913,
  0.60462385 -0.64739406 1.9192913,0.40753793 -0.7865125 1.9192913,
  0.18022678 -0.8672989 1.9192913,-0.060450957 -0.8837617 1.9192913,
  -0.29664533 -0.83467995 1.9192913,-0.51083887 -0.7236938 1.9192913,
  -0.68714583 -0.5590346 1.9192913,-0.81249033 -0.35291435 1.9192913,
  -0.87757613 -0.12062006 1.9192913,-0.87757613 0.12062006 1.9192913,
  -0.81249033 0.35291435 1.9192913,-0.68714583 0.5590346 1.9192913,
  -0.51083887 0.7236938 1.9192913,-0.29664533 0.83467995 1.9192913,
  -0.060450957 0.8837617 1.9192913,0.18022678 0.8672989 1.9192913,
  0.40753793 0.7865125 1.9192913,0.60462385 0.64739406 1.9192913,
  0.75686758 0.46026137 1.9192913,0.85297791 0.2389932 1.9192913] }
 coordIndex [
  35,12,34,-1,6,40,41,-1,6,41,5,-1,11,12,35,-1,26,20,21,-1,25,26,21,-1,22,25,21,-1,27,19,20,-1,
  36,11,35,-1,27,20,26,-1,24,25,22,-1,7,40,6,-1,28,18,19,-1,7,39,40,-1,10,11,36,-1,28,19,27,-1,
  10,36,37,-1,0,24,22,-1,8,39,7,-1,8,38,39,-1,9,10,37,-1,9,37,38,-1,9,38,8,-1,23,24,0,-1,
  29,17,18,-1,29,18,28,-1,1,23,0,-1,45,23,1,-1,30,16,17,-1,30,17,29,-1,2,45,1,-1,44,45,2,-1,
  31,15,16,-1,31,16,30,-1,3,43,44,-1,3,44,2,-1,32,15,31,-1,14,15,32,-1,4,42,43,-1,4,43,3,-1,
  33,14,32,-1,13,14,33,-1,34,13,33,-1,5,42,4,-1,5,41,42,-1,12,13,34,-1]
  normalPerVertex TRUE
  normal DEF NORM_3 Normal { vector [
  0 0 1,0 0 1,
  0 0 1,0 0 1,
  0 0 1,0 0 1,
  0 0 1,0 0 1,
  0 0 1,0 0 1,
  0 0 1,0 0 1,
  0 0 1,0 0 1,
  0 0 1,0 0 1,
  0 0 1,0 0 1,
  0 0 1,0 0 1,
  0 0 1,0 0 1,
  0 0 1,0 0 1,
  0 0 1,0 0 1,
  0 0 1,0 0 1,
  0 0 1,0 0 1,
  0 0 1,0 0 1,
  0 0 1,0 0 1,
  0 0 1,0 0 1,
  0 0 1,0 0 1,
  0 0 1,0 0 1,
  0 0 1,0 0 1,
  0 0 1,0 0 1,
  0 0 1,0 0 1] }
}
}
DEF SHAPE_4 Shape {
 appearance USE APP_1
 geometry DEF FACE_4 IndexedFaceSet {
  coord DEF COORD_4 Coordinate { point [
  0.49212598 0 0.39370079,0.47387662 0.132774 0.39370079,
  0.42048199 0.25570076 0.39370079,0.33590214 0.35966337 0.39370079,
  0.22640996 0.43695139 0.39370079,0.10012599 0.48183272 0.39370079,
  -0.033583865 0.49097872 0.39370079,-0.16480296 0.46371108 0.39370079,
  -0.28379937 0.40205211 0.39370079,-0.38174768 0.31057478 0.39370079,
  -0.45138351 0.19606353 0.39370079,-0.4875423 0.067011146 0.39370079,
  -0.4875423 -0.067011146 0.39370079,-0.45138351 -0.19606353 0.39370079,
  -0.38174768 -0.31057478 0.39370079,-0.28379937 -0.40205211 0.39370079,
  -0.16480296 -0.46371108 0.39370079,-0.033583865 -0.49097872 0.39370079,
  0.10012599 -0.48183272 0.39370079,0.22640996 -0.43695139 0.39370079,
  0.33590214 -0.35966337 0.39370079,0.42048199 -0.25570076 0.39370079,
  0.47387662 -0.132774 0.39370079,0.15748031 0 0.39370079,
  0.15164052 0.04248768 0.39370079,0.13455424 0.081824244 0.39370079,
  0.10748868 0.11509228 0.39370079,0.072451187 0.13982444 0.39370079,
  0.032040317 0.15418647 0.39370079,-0.010746837 0.15711319 0.39370079,
  -0.052736947 0.14838755 0.39370079,-0.090815799 0.12865668 0.39370079,
  -0.12215926 0.099383928 0.39370079,-0.14444272 0.062740329 0.39370079,
  -0.15601353 0.021443567 0.39370079,-0.15601353 -0.021443567 0.39370079,
  -0.14444272 -0.062740329 0.39370079,-0.12215926 -0.099383928 0.39370079,
  -0.090815799 -0.12865668 0.39370079,-0.052736947 -0.14838755 0.39370079,
  -0.010746837 -0.15711319 0.39370079,0.032040317 -0.15418647 0.39370079,
  0.072451187 -0.13982444 0.39370079,0.10748868 -0.11509228 0.39370079,
  0.13455424 -0.081824244 0.39370079,0.15164052 -0.04248768 0.39370079] }
 coordIndex [
  4,27,28,-1,4,3,27,-1,13,37,14,-1,13,36,37,-1,5,4,28,-1,12,36,13,-1,12,35,36,-1,6,28,29,-1,
  6,29,30,-1,6,5,28,-1,43,21,20,-1,11,35,12,-1,11,33,34,-1,11,34,35,-1,44,22,21,-1,44,21,43,-1,
  7,6,30,-1,42,20,19,-1,10,33,11,-1,42,43,20,-1,45,0,22,-1,8,30,31,-1,8,31,32,-1,8,7,30,-1,
  45,22,44,-1,9,33,10,-1,41,19,18,-1,9,32,33,-1,9,8,32,-1,41,42,19,-1,23,0,45,-1,40,17,16,-1,
  40,18,17,-1,40,41,18,-1,24,1,0,-1,24,0,23,-1,39,16,15,-1,39,40,16,-1,25,2,1,-1,25,1,24,-1,
  38,39,15,-1,37,38,15,-1,3,25,26,-1,3,2,25,-1,27,3,26,-1,14,37,15,-1]
  normalPerVertex TRUE
  normal DEF NORM_4 Normal { vector [
  0 0 -1,0 0 -1,
  0 0 -1,0 0 -1,
  0 0 -1,0 0 -1,
  0 0 -1,0 0 -1,
  0 0 -1,0 0 -1,
  0 0 -1,0 0 -1,
  0 0 -1,0 0 -1,
  0 0 -1,0 0 -1,
  0 0 -1,0 0 -1,
  0 0 -1,0 0 -1,
  0 0 -1,0 0 -1,
  0 0 -1,0 0 -1,
  0 0 -1,0 0 -1,
  0 0 -1,0 0 -1,
  0 0 -1,0 0 -1,
  0 0 -1,0 0 -1,
  0 0 -1,0 0 -1,
  0 0 -1,0 0 -1,
  0 0 -1,0 0 -1,
  0 0 -1,0 0 -1,
  0 0 -1,0 0 -1,
  0 0 -1,0 0 -1,
  0 0 -1,0 0 -1] }
}
}
DEF SHAPE_5 Shape {
 appearance USE APP_1
 geometry DEF FACE_5 IndexedFaceSet {
  coord DEF COORD_5 Coordinate { point [
  0.88582677 0 4.9704724,0.88582677 0 4.9704724,
  0.85297791 -0.2389932 4.9704724,0.75686758 -0.46026137 4.9704724,
  0.60462385 -0.64739406 4.9704724,0.40753793 -0.7865125 4.9704724,
  0.18022678 -0.8672989 4.9704724,-0.060450957 -0.8837617 4.9704724,
  -0.29664533 -0.83467995 4.9704724,-0.51083887 -0.7236938 4.9704724,
  -0.68714583 -0.5590346 4.9704724,-0.81249033 -0.35291435 4.9704724,
  -0.87757613 -0.12062006 4.9704724,-0.87757613 0.12062006 4.9704724,
  -0.81249033 0.35291435 4.9704724,-0.68714583 0.5590346 4.9704724,
  -0.51083887 0.7236938 4.9704724,-0.29664533 0.83467995 4.9704724,
  -0.060450957 0.8837617 4.9704724,0.18022678 0.8672989 4.9704724,
  0.40753793 0.7865125 4.9704724,0.60462385 0.64739406 4.9704724,
  0.75686758 0.46026137 4.9704724,0.85297791 0.2389932 4.9704724,
  0.88582677 0 1.9192913,0.88582677 0 1.9192913,
  0.85297791 -0.2389932 1.9192913,0.75686758 -0.46026137 1.9192913,
  0.60462385 -0.64739406 1.9192913,0.40753793 -0.7865125 1.9192913,
  0.18022678 -0.8672989 1.9192913,-0.060450957 -0.8837617 1.9192913,
  -0.29664533 -0.83467995 1.9192913,-0.51083887 -0.7236938 1.9192913,
  -0.68714583 -0.5590346 1.9192913,-0.81249033 -0.35291435 1.9192913,
  -0.87757613 -0.12062006 1.9192913,-0.87757613 0.12062006 1.9192913,
  -0.81249033 0.35291435 1.9192913,-0.68714583 0.5590346 1.9192913,
  -0.51083887 0.7236938 1.9192913,-0.29664533 0.83467995 1.9192913,
  -0.060450957 0.8837617 1.9192913,0.18022678 0.8672989 1.9192913,
  0.40753793 0.7865125 1.9192913,0.60462385 0.64739406 1.9192913,
  0.75686758 0.46026137 1.9192913,0.85297791 0.2389932 1.9192913] }
 coordIndex [
  45,44,21,-1,45,21,22,-1,46,45,22,-1,26,0,2,-1,47,22,23,-1,26,25,0,-1,47,46,22,-1,24,23,1,-1,
  24,47,23,-1,27,2,3,-1,27,26,2,-1,28,3,4,-1,28,4,5,-1,28,27,3,-1,29,28,5,-1,30,5,6,-1,
  30,29,5,-1,31,6,7,-1,31,30,6,-1,32,7,8,-1,32,8,9,-1,32,31,7,-1,33,32,9,-1,34,9,10,-1,
  34,33,9,-1,35,10,11,-1,35,34,10,-1,36,11,12,-1,36,12,13,-1,36,35,11,-1,37,36,13,-1,38,37,13,-1,
  38,13,14,-1,38,14,15,-1,39,38,15,-1,40,39,15,-1,40,15,16,-1,41,40,16,-1,41,16,17,-1,42,41,17,-1,
  42,17,18,-1,43,18,19,-1,43,42,18,-1,44,19,20,-1,44,20,21,-1,44,43,19,-1]
  normalPerVertex TRUE
  normal DEF NORM_5 Normal { vector [
  0.99068595 -0.13616665 0,0.99068595 0.13616665 0,
  0.94956031 -0.31358447 0,0.82974396 -0.55814421 0,
  0.68255314 -0.73083596 0,0.46006504 -0.88788522 0,
  0.15843248 -0.98736981 0,-0.11383181 -0.99350003 0,
  -0.33487961 -0.94226092 0,-0.57668032 -0.81696989 0,
  -0.80378182 -0.59492419 0,-0.93448403 -0.35600505 0,
  -0.99068595 -0.13616665 0,-0.99068595 0.13616665 0,
  -0.9172113 0.39840109 0,-0.77571129 0.63108794 0,
  -0.53868527 0.84250708 0,-0.29140367 0.95660018 0,
  -0.022509995 0.99974662 0,0.24805315 0.96874643 0,
  0.46006504 0.88788522 0,0.6483893 0.76130895 0,
  0.8544194 0.51958395 0,0.97425621 0.22544364 0,
  0.99068595 0.13616665 0,0.99068595 -0.13616665 0,
  0.97425621 -0.22544364 0,0.87730418 -0.47993476 0,
  0.68255314 -0.73083596 0,0.46006504 -0.88788522 0,
  0.24805315 -0.96874643 0,-0.022509995 -0.99974662 0,
  -0.33487961 -0.94226092 0,-0.57668032 -0.81696989 0,
  -0.74601505 -0.66592908 0,-0.89801631 -0.43996217 0,
  -0.99068595 -0.13616665 0,-0.99068595 0.13616665 0,
  -0.9172113 0.39840109 0,-0.77571129 0.63108794 0,
  -0.61346678 0.78972053 0,-0.37765372 0.9259469 0,
  -0.11383181 0.99350003 0,0.15843248 0.98736981 0,
  0.46006504 0.88788522 0,0.71528652 0.69883131 0,
  0.8544194 0.51958395 0,0.94956031 0.31358447 0] }
}
}
DEF SHAPE_6 Shape {
 appearance DEF APP_2 Appearance {
  material Material {
   ambientIntensity 0.122244
   diffuseColor 0.824 0.81999999 0.78100002
   emissiveColor 0 0 0
   shininess 0.1
   specularColor 0.12 0.12 0.12
   transparency 0
} }
 geometry DEF FACE_6 IndexedFaceSet {
  coord DEF COORD_6 Coordinate { point [
  0.15748031 0 -1.1811024,0.15748031 0 -1.1811024,
  0.15164052 0.04248768 -1.1811024,0.13455424 0.081824244 -1.1811024,
  0.10748868 0.11509228 -1.1811024,0.072451187 0.13982444 -1.1811024,
  0.032040317 0.15418647 -1.1811024,-0.010746837 0.15711319 -1.1811024,
  -0.052736947 0.14838755 -1.1811024,-0.090815799 0.12865668 -1.1811024,
  -0.12215926 0.099383928 -1.1811024,-0.14444272 0.062740329 -1.1811024,
  -0.15601353 0.021443567 -1.1811024,-0.15601353 -0.021443567 -1.1811024,
  -0.14444272 -0.062740329 -1.1811024,-0.12215926 -0.099383928 -1.1811024,
  -0.090815799 -0.12865668 -1.1811024,-0.052736947 -0.14838755 -1.1811024,
  -0.010746837 -0.15711319 -1.1811024,0.032040317 -0.15418647 -1.1811024,
  0.072451187 -0.13982444 -1.1811024,0.10748868 -0.11509228 -1.1811024,
  0.13455424 -0.081824244 -1.1811024,0.15164052 -0.04248768 -1.1811024,
  0.15748031 0 0.39370079,0.15748031 0 0.39370079,
  0.15164052 0.04248768 0.39370079,0.13455424 0.081824244 0.39370079,
  0.10748868 0.11509228 0.39370079,0.072451187 0.13982444 0.39370079,
  0.032040317 0.15418647 0.39370079,-0.010746837 0.15711319 0.39370079,
  -0.052736947 0.14838755 0.39370079,-0.090815799 0.12865668 0.39370079,
  -0.12215926 0.099383928 0.39370079,-0.14444272 0.062740329 0.39370079,
  -0.15601353 0.021443567 0.39370079,-0.15601353 -0.021443567 0.39370079,
  -0.14444272 -0.062740329 0.39370079,-0.12215926 -0.099383928 0.39370079,
  -0.090815799 -0.12865668 0.39370079,-0.052736947 -0.14838755 0.39370079,
  -0.010746837 -0.15711319 0.39370079,0.032040317 -0.15418647 0.39370079,
  0.072451187 -0.13982444 0.39370079,0.10748868 -0.11509228 0.39370079,
  0.13455424 -0.081824244 0.39370079,0.15164052 -0.04248768 0.39370079] }
 coordIndex [
  46,21,22,-1,46,22,23,-1,46,45,21,-1,25,0,2,-1,47,46,23,-1,24,23,1,-1,24,47,23,-1,26,25,2,-1,
  27,2,3,-1,27,3,4,-1,27,26,2,-1,28,27,4,-1,29,4,5,-1,29,28,4,-1,30,5,6,-1,30,6,7,-1,
  30,29,5,-1,31,30,7,-1,32,7,8,-1,32,31,7,-1,33,8,9,-1,33,32,8,-1,34,9,10,-1,34,10,11,-1,
  34,33,9,-1,35,11,12,-1,35,34,11,-1,36,12,13,-1,36,35,12,-1,37,13,14,-1,37,36,13,-1,38,37,14,-1,
  38,14,15,-1,39,38,15,-1,39,15,16,-1,40,39,16,-1,40,16,17,-1,41,40,17,-1,42,17,18,-1,42,41,17,-1,
  42,18,19,-1,43,42,19,-1,44,19,20,-1,44,20,21,-1,44,43,19,-1,45,44,21,-1]
  normalPerVertex TRUE
  normal DEF NORM_6 Normal { vector [
  0.99068595 0.13616665 0,0.99068595 -0.13616665 0,
  0.96291729 0.26979677 0,0.8544194 0.51958395 0,
  0.68255314 0.73083596 0,0.41894656 0.90801089 0,
  0.20345601 0.97908409 0,-0.068242413 0.99766877 0,
  -0.37765372 0.9259469 0,-0.61346678 0.78972053 0,
  -0.77571129 0.63108794 0,-0.89801631 0.43996217 0,
  -0.9834158 0.18136528 0,-0.99587984 -0.090682641 0,
  -0.93448403 -0.35600505 0,-0.80378182 -0.59492419 0,
  -0.61346678 -0.78972053 0,-0.33487961 -0.94226092 0,
  -0.068242413 -0.99766877 0,0.20345601 -0.97908409 0,
  0.46006504 -0.88788522 0,0.68255314 -0.73083596 0,
  0.8544194 -0.51958395 0,0.96291729 -0.26979677 0,
  0.99068595 -0.13616665 0,0.99068595 0.13616665 0,
  0.96291729 0.26979677 0,0.8544194 0.51958395 0,
  0.68255314 0.73083596 0,0.50021932 0.86589874 0,
  0.20345601 0.97908409 0,-0.068242413 0.99766877 0,
  -0.29140367 0.95660018 0,-0.53868527 0.84250708 0,
  -0.77571129 0.63108794 0,-0.93448403 0.35600505 0,
  -0.99587984 0.090682641 0,-0.9834158 -0.18136528 0,
  -0.89801631 -0.43996217 0,-0.74601505 -0.66592908 0,
  -0.53868527 -0.84250708 0,-0.33487961 -0.94226092 0,
  -0.068242413 -0.99766877 0,0.20345601 -0.97908409 0,
  0.46006504 -0.88788522 0,0.68255314 -0.73083596 0,
  0.8544194 -0.51958395 0,0.96291729 -0.26979677 0] }
}
}
DEF SHAPE_7 Shape {
 appearance USE APP_1
 geometry DEF FACE_7 IndexedFaceSet {
  coord DEF COORD_7 Coordinate { point [
  0.98425197 0 4.9704724,0.94775324 0.265548 4.9704724,
  0.84096398 0.51140153 4.9704724,0.67180427 0.71932674 4.9704724,
  0.45281992 0.87390277 4.9704724,0.20025198 0.96366544 4.9704724,
  -0.06716773 0.98195745 4.9704724,-0.32960592 0.92742217 4.9704724,
  -0.56759874 0.80410423 4.9704724,-0.76349536 0.62114955 4.9704724,
  -0.90276703 0.39212706 4.9704724,-0.97508459 0.13402229 4.9704724,
  -0.97508459 -0.13402229 4.9704724,-0.90276703 -0.39212706 4.9704724,
  -0.76349536 -0.62114955 4.9704724,-0.56759874 -0.80410423 4.9704724,
  -0.32960592 -0.92742217 4.9704724,-0.06716773 -0.98195745 4.9704724,
  0.20025198 -0.96366544 4.9704724,0.45281992 -0.87390277 4.9704724,
  0.67180427 -0.71932674 4.9704724,0.84096398 -0.51140153 4.9704724,
  0.94775324 -0.265548 4.9704724,0.88582677 0 4.9704724,
  0.85297791 -0.2389932 4.9704724,0.75686758 -0.46026137 4.9704724,
  0.60462385 -0.64739406 4.9704724,0.40753793 -0.7865125 4.9704724,
  0.18022678 -0.8672989 4.9704724,-0.060450957 -0.8837617 4.9704724,
  -0.29664533 -0.83467995 4.9704724,-0.51083887 -0.7236938 4.9704724,
  -0.68714583 -0.5590346 4.9704724,-0.81249033 -0.35291435 4.9704724,
  -0.87757613 -0.12062006 4.9704724,-0.87757613 0.12062006 4.9704724,
  -0.81249033 0.35291435 4.9704724,-0.68714583 0.5590346 4.9704724,
  -0.51083887 0.7236938 4.9704724,-0.29664533 0.83467995 4.9704724,
  -0.060450957 0.8837617 4.9704724,0.18022678 0.8672989 4.9704724,
  0.40753793 0.7865125 4.9704724,0.60462385 0.64739406 4.9704724,
  0.75686758 0.46026137 4.9704724,0.85297791 0.2389932 4.9704724] }
 coordIndex [
  35,34,12,-1,6,41,40,-1,6,5,41,-1,11,35,12,-1,26,21,20,-1,25,21,26,-1,22,21,25,-1,27,20,19,-1,
  36,35,11,-1,27,26,20,-1,24,22,25,-1,7,6,40,-1,28,19,18,-1,7,40,39,-1,10,36,11,-1,28,27,19,-1,
  10,37,36,-1,0,22,24,-1,8,7,39,-1,8,39,38,-1,9,37,10,-1,9,38,37,-1,9,8,38,-1,23,0,24,-1,
  29,18,17,-1,29,28,18,-1,1,0,23,-1,45,1,23,-1,30,17,16,-1,30,29,17,-1,2,1,45,-1,44,2,45,-1,
  31,16,15,-1,31,30,16,-1,3,44,43,-1,3,2,44,-1,32,31,15,-1,14,32,15,-1,4,43,42,-1,4,3,43,-1,
  33,32,14,-1,13,33,14,-1,34,33,13,-1,5,4,42,-1,5,42,41,-1,12,34,13,-1]
  normalPerVertex TRUE
  normal DEF NORM_7 Normal { vector [
  0 0 -1,0 0 -1,
  0 0 -1,0 0 -1,
  0 0 -1,0 0 -1,
  0 0 -1,0 0 -1,
  0 0 -1,0 0 -1,
  0 0 -1,0 0 -1,
  0 0 -1,0 0 -1,
  0 0 -1,0 0 -1,
  0 0 -1,0 0 -1,
  0 0 -1,0 0 -1,
  0 0 -1,0 0 -1,
  0 0 -1,0 0 -1,
  0 0 -1,0 0 -1,
  0 0 -1,0 0 -1,
  0 0 -1,0 0 -1,
  0 0 -1,0 0 -1,
  0 0 -1,0 0 -1,
  0 0 -1,0 0 -1,
  0 0 -1,0 0 -1,
  0 0 -1,0 0 -1,
  0 0 -1,0 0 -1,
  0 0 -1,0 0 -1,
  0 0 -1,0 0 -1] }
}
}
DEF SHAPE_8 Shape {
 appearance USE APP_2
 geometry DEF FACE_8 IndexedFaceSet {
  coord DEF COORD_8 Coordinate { point [
  0.15748031 0 -1.1811024,0.15164052 0.04248768 -1.1811024,
  0.13455424 0.081824244 -1.1811024,0.10748868 0.11509228 -1.1811024,
  0.072451187 0.13982444 -1.1811024,0.032040317 0.15418647 -1.1811024,
  -0.010746837 0.15711319 -1.1811024,-0.052736947 0.14838755 -1.1811024,
  -0.090815799 0.12865668 -1.1811024,-0.12215926 0.099383928 -1.1811024,
  -0.14444272 0.062740329 -1.1811024,-0.15601353 0.021443567 -1.1811024,
  -0.15601353 -0.021443567 -1.1811024,-0.14444272 -0.062740329 -1.1811024,
  -0.12215926 -0.099383928 -1.1811024,-0.090815799 -0.12865668 -1.1811024,
  -0.052736947 -0.14838755 -1.1811024,-0.010746837 -0.15711319 -1.1811024,
  0.032040317 -0.15418647 -1.1811024,0.072451187 -0.13982444 -1.1811024,
  0.10748868 -0.11509228 -1.1811024,0.13455424 -0.081824244 -1.1811024,
  0.15164052 -0.04248768 -1.1811024] }
 coordIndex [
  22,21,20,-1,1,19,18,-1,1,20,19,-1,1,0,22,-1,1,22,20,-1,16,18,17,-1,4,2,1,-1,4,3,2,-1,
  13,15,14,-1,13,16,15,-1,13,1,18,-1,13,18,16,-1,5,4,1,-1,12,1,13,-1,6,5,1,-1,6,1,12,-1,
  11,6,12,-1,10,7,6,-1,10,6,11,-1,9,8,7,-1,9,7,10,-1]
  normalPerVertex TRUE
  normal DEF NORM_8 Normal { vector [
  0 0 -1,0 0 -1,
  0 0 -1,0 0 -1,
  0 0 -1,0 0 -1,
  0 0 -1,0 0 -1,
  0 0 -1,0 0 -1,
  0 0 -1,0 0 -1,
  0 0 -1,0 0 -1,
  0 0 -1,0 0 -1,
  0 0 -1,0 0 -1,
  0 0 -1,0 0 -1,
  0 0 -1,0 0 -1,
  0 0 -1] }
}
}
DEF SHAPE_9 Shape {
 appearance USE APP_1
 geometry DEF FACE_9 IndexedFaceSet {
  coord DEF COORD_9 Coordinate { point [
  0.98425197 0 4.9704724,0.98425197 0 4.9704724,
  0.94775324 0.265548 4.9704724,0.84096398 0.51140153 4.9704724,
  0.67180427 0.71932674 4.9704724,0.45281992 0.87390277 4.9704724,
  0.20025198 0.96366544 4.9704724,-0.06716773 0.98195745 4.9704724,
  -0.32960592 0.92742217 4.9704724,-0.56759874 0.80410423 4.9704724,
  -0.76349536 0.62114955 4.9704724,-0.90276703 0.39212706 4.9704724,
  -0.97508459 0.13402229 4.9704724,-0.97508459 -0.13402229 4.9704724,
  -0.90276703 -0.39212706 4.9704724,-0.76349536 -0.62114955 4.9704724,
  -0.56759874 -0.80410423 4.9704724,-0.32960592 -0.92742217 4.9704724,
  -0.06716773 -0.98195745 4.9704724,0.20025198 -0.96366544 4.9704724,
  0.45281992 -0.87390277 4.9704724,0.67180427 -0.71932674 4.9704724,
  0.84096398 -0.51140153 4.9704724,0.94775324 -0.265548 4.9704724,
  0.98425197 0 6.003937,0.98425197 0 6.003937,
  0.94775324 0.265548 6.003937,0.84096398 0.51140153 6.003937,
  0.67180427 0.71932674 6.003937,0.45281992 0.87390277 6.003937,
  0.20025198 0.96366544 6.003937,-0.06716773 0.98195745 6.003937,
  -0.32960592 0.92742217 6.003937,-0.56759874 0.80410423 6.003937,
  -0.76349536 0.62114955 6.003937,-0.90276703 0.39212706 6.003937,
  -0.97508459 0.13402229 6.003937,-0.97508459 -0.13402229 6.003937,
  -0.90276703 -0.39212706 6.003937,-0.76349536 -0.62114955 6.003937,
  -0.56759874 -0.80410423 6.003937,-0.32960592 -0.92742217 6.003937,
  -0.06716773 -0.98195745 6.003937,0.20025198 -0.96366544 6.003937,
  0.45281992 -0.87390277 6.003937,0.67180427 -0.71932674 6.003937,
  0.84096398 -0.51140153 6.003937,0.94775324 -0.265548 6.003937] }
 coordIndex [
  3,4,27,-1,2,26,25,-1,2,27,26,-1,2,3,27,-1,0,2,25,-1,23,1,24,-1,23,47,46,-1,23,24,47,-1,
  22,46,45,-1,22,23,46,-1,21,45,44,-1,21,22,45,-1,20,44,43,-1,20,21,44,-1,19,20,43,-1,18,43,42,-1,
  18,19,43,-1,17,42,41,-1,17,18,42,-1,16,40,39,-1,16,41,40,-1,16,17,41,-1,15,39,38,-1,15,16,39,-1,
  14,38,37,-1,14,15,38,-1,13,37,36,-1,13,14,37,-1,12,13,36,-1,11,12,36,-1,11,35,34,-1,11,36,35,-1,
  10,11,34,-1,10,34,33,-1,9,10,33,-1,8,9,33,-1,8,32,31,-1,8,33,32,-1,7,8,31,-1,6,7,31,-1,
  6,31,30,-1,5,29,28,-1,5,30,29,-1,5,6,30,-1,4,5,28,-1,4,28,27,-1]
  normalPerVertex TRUE
  normal DEF NORM_9 Normal { vector [
  0.99068595 0.13616665 0,0.99068595 -0.13616665 0,
  0.96291729 0.26979677 0,0.8544194 0.51958395 0,
  0.71528652 0.69883131 0,0.46006504 0.88788522 0,
  0.15843248 0.98736981 0,-0.068242413 0.99766877 0,
  -0.33487961 0.94226092 0,-0.57668032 0.81696989 0,
  -0.74601505 0.66592908 0,-0.9172113 0.39840109 0,
  -0.99068595 0.13616665 0,-0.99587984 -0.090682641 0,
  -0.93448403 -0.35600505 0,-0.80378182 -0.59492419 0,
  -0.57668032 -0.81696989 0,-0.29140367 -0.95660018 0,
  -0.022509995 -0.99974662 0,0.20345601 -0.97908409 0,
  0.41894656 -0.90801089 0,0.6483893 -0.76130895 0,
  0.82974396 -0.55814421 0,0.96291729 -0.26979677 0,
  0.99068595 -0.13616665 0,0.99068595 0.13616665 0,
  0.96291729 0.26979677 0,0.8544194 0.51958395 0,
  0.6483893 0.76130895 0,0.46006504 0.88788522 0,
  0.24805315 0.96874643 0,-0.068242413 0.99766877 0,
  -0.33487961 0.94226092 0,-0.57668032 0.81696989 0,
  -0.80378182 0.59492419 0,-0.9172113 0.39840109 0,
  -0.99068595 0.13616665 0,-0.9834158 -0.18136528 0,
  -0.89801631 -0.43996217 0,-0.74601505 -0.66592908 0,
  -0.57668032 -0.81696989 0,-0.37765372 -0.9259469 0,
  -0.11383181 -0.99350003 0,0.20345601 -0.97908409 0,
  0.50021932 -0.86589874 0,0.71528652 -0.69883131 0,
  0.87730418 -0.47993476 0,0.96291729 -0.26979677 0] }
}
}
DEF SHAPE_10 Shape {
 appearance USE APP_1
 geometry DEF FACE_10 IndexedFaceSet {
  coord DEF COORD_10 Coordinate { point [
  0.98425197 0 6.003937,0.49212598 0 6.496063,
  0.96016561 0 6.1560123,0.89026427 0 6.2932014,
  0.78139038 0 6.4020753,0.64420128 0 6.4719766,
  0.98425197 0 6.003937,0.94775324 0.265548 6.003937,
  0.84096398 0.51140153 6.003937,0.67180427 0.71932674 6.003937,
  0.45281992 0.87390277 6.003937,0.20025198 0.96366544 6.003937,
  -0.06716773 0.98195745 6.003937,-0.32960592 0.92742217 6.003937,
  -0.56759874 0.80410423 6.003937,-0.76349536 0.62114955 6.003937,
  -0.90276703 0.39212706 6.003937,-0.97508459 0.13402229 6.003937,
  -0.97508459 -0.13402229 6.003937,-0.90276703 -0.39212706 6.003937,
  -0.76349536 -0.62114955 6.003937,-0.56759874 -0.80410423 6.003937,
  -0.32960592 -0.92742217 6.003937,-0.06716773 -0.98195745 6.003937,
  0.20025198 -0.96366544 6.003937,0.45281992 -0.87390277 6.003937,
  0.67180427 -0.71932674 6.003937,0.84096398 -0.51140153 6.003937,
  0.94775324 -0.265548 6.003937,0.49212598 0 6.496063,
  0.96016561 0 6.1560123,0.89026427 0 6.2932014,
  0.78139038 0 6.4020753,0.64420128 0 6.4719766,
  0.47387662 0.132774 6.496063,0.42048199 0.25570076 6.496063,
  0.33590214 0.35966337 6.496063,0.22640996 0.43695139 6.496063,
  0.10012599 0.48183272 6.496063,-0.033583865 0.49097872 6.496063,
  -0.16480296 0.46371108 6.496063,-0.28379937 0.40205211 6.496063,
  -0.38174768 0.31057478 6.496063,-0.45138351 0.19606353 6.496063,
  -0.4875423 0.067011146 6.496063,-0.4875423 -0.067011146 6.496063,
  -0.45138351 -0.19606353 6.496063,-0.38174768 -0.31057478 6.496063,
  -0.28379937 -0.40205211 6.496063,-0.16480296 -0.46371108 6.496063,
  -0.033583865 -0.49097872 6.496063,0.10012599 -0.48183272 6.496063,
  0.22640996 -0.43695139 6.496063,0.33590214 -0.35966337 6.496063,
  0.42048199 -0.25570076 6.496063,0.47387662 -0.132774 6.496063,
  0.92456006 0.25904958 6.1560123,0.85725085 0.24019043 6.2932014,
  0.82038413 0.49888664 6.1560123,0.75241431 0.2108166 6.4020753,
  0.76065907 0.46256703 6.2932014,0.65536405 0.70172356 6.1560123,
  0.62031255 0.17380342 6.4719766,0.6676351 0.4059979 6.4020753,
  0.60765268 0.65063715 6.2932014,0.44173863 0.85251685 6.1560123,
  0.55041807 0.33471664 6.4719766,0.53334046 0.57106819 6.4020753,
  0.40957946 0.79045248 6.2932014,0.19535147 0.94008287 6.1560123,
  0.43970161 0.47080546 6.4719766,0.35949039 0.69378497 6.4020753,
  0.18112962 0.87164358 6.2932014,-0.065524018 0.95792724 6.1560123,
  0.29637448 0.57197679 6.4719766,0.15897857 0.76504689 6.4020753,
  -0.060753782 0.88818886 6.2932014,-0.32153989 0.90472653 6.1560123,
  0.13106662 0.63072722 6.4719766,-0.053323965 0.77956878 6.4020753,
  -0.29813135 0.83886123 6.2932014,-0.55370861 0.78442639 6.1560123,
  -0.04396185 0.64269949 6.4719766,-0.26167171 0.73627362 6.4020753,
  -0.51339789 0.7273191 6.2932014,-0.7448113 0.60594894 6.1560123,
  -0.21572987 0.60700569 6.4719766,-0.45061246 0.63837242 6.4020753,
  -0.69058805 0.56183505 6.2932014,-0.88067475 0.38253102 6.1560123,
  -0.3714982 0.52629305 6.4719766,-0.60613334 0.49312605 6.4020753,
  -0.81656045 0.35468225 6.2932014,-0.95122257 0.13074253 6.1560123,
  -0.4997142 0.40654766 6.4719766,-0.71670009 0.31130678 6.4020753,
  -0.8819723 0.1212243 6.2932014,-0.95122257 -0.13074253 6.1560123,
  -0.59086869 0.25665049 6.4719766,-0.77411247 0.10639931 6.4020753,
  -0.8819723 -0.1212243 6.2932014,-0.88067475 -0.38253102 6.1560123,
  -0.63820115 0.087718729 6.4719766,-0.77411247 -0.10639931 6.4020753,
  -0.81656045 -0.35468225 6.2932014,-0.7448113 -0.60594894 6.1560123,
  -0.63820115 -0.087718729 6.4719766,-0.71670009 -0.31130678 6.4020753,
  -0.69058805 -0.56183505 6.2932014,-0.55370861 -0.78442639 6.1560123,
  -0.59086869 -0.25665049 6.4719766,-0.60613334 -0.49312605 6.4020753,
  -0.51339789 -0.7273191 6.2932014,-0.32153989 -0.90472653 6.1560123,
  -0.4997142 -0.40654766 6.4719766,-0.45061246 -0.63837242 6.4020753,
  -0.29813135 -0.83886123 6.2932014,-0.065524018 -0.95792724 6.1560123,
  -0.3714982 -0.52629305 6.4719766,-0.26167171 -0.73627362 6.4020753,
  -0.060753782 -0.88818886 6.2932014,0.19535147 -0.94008287 6.1560123,
  -0.21572987 -0.60700569 6.4719766,-0.053323965 -0.77956878 6.4020753,
  0.18112962 -0.87164358 6.2932014,0.44173863 -0.85251685 6.1560123,
  -0.04396185 -0.64269949 6.4719766,0.15897857 -0.76504689 6.4020753,
  0.40957946 -0.79045248 6.2932014,0.65536405 -0.70172356 6.1560123,
  0.13106662 -0.63072722 6.4719766,0.35949039 -0.69378497 6.4020753,
  0.60765268 -0.65063715 6.2932014,0.82038413 -0.49888664 6.1560123,
  0.29637448 -0.57197679 6.4719766,0.53334046 -0.57106819 6.4020753,
  0.76065907 -0.46256703 6.2932014,0.92456006 -0.25904958 6.1560123,
  0.43970161 -0.47080546 6.4719766,0.6676351 -0.4059979 6.4020753,
  0.85725085 -0.24019043 6.2932014,0.55041807 -0.33471664 6.4719766,
  0.75241431 -0.2108166 6.4020753,0.62031255 -0.17380342 6.4719766] }
 coordIndex [
  56,2,0,-1,56,0,7,-1,57,3,2,-1,57,4,3,-1,57,2,56,-1,58,7,8,-1,58,56,7,-1,59,4,57,-1,
  60,57,56,-1,60,56,58,-1,61,60,58,-1,61,8,9,-1,61,58,8,-1,62,5,4,-1,62,1,5,-1,62,34,1,-1,
  62,35,34,-1,62,4,59,-1,63,59,57,-1,63,57,60,-1,64,60,61,-1,65,9,10,-1,65,61,9,-1,65,64,61,-1,
  66,35,62,-1,66,62,59,-1,66,59,63,-1,67,63,60,-1,67,60,64,-1,68,64,65,-1,69,10,11,-1,69,11,12,-1,
  69,68,65,-1,69,65,10,-1,70,36,35,-1,70,66,63,-1,70,35,66,-1,70,63,67,-1,71,67,64,-1,71,64,68,-1,
  72,68,69,-1,72,71,68,-1,73,12,13,-1,73,72,69,-1,73,69,12,-1,74,37,36,-1,74,67,71,-1,74,36,70,-1,
  74,70,67,-1,75,71,72,-1,75,74,71,-1,76,72,73,-1,76,75,72,-1,77,73,13,-1,77,76,73,-1,78,38,37,-1,
  78,37,74,-1,78,74,75,-1,79,75,76,-1,79,78,75,-1,80,76,77,-1,80,79,76,-1,81,13,14,-1,81,14,15,-1,
  81,77,13,-1,82,39,38,-1,82,78,79,-1,82,38,78,-1,83,79,80,-1,83,82,79,-1,84,80,77,-1,84,77,81,-1,
  85,84,81,-1,85,81,15,-1,86,40,39,-1,86,82,83,-1,86,39,82,-1,87,83,80,-1,87,80,84,-1,88,87,84,-1,
  88,84,85,-1,89,15,16,-1,89,16,17,-1,89,85,15,-1,90,86,83,-1,90,41,40,-1,90,40,86,-1,90,83,87,-1,
  91,87,88,-1,91,90,87,-1,92,88,85,-1,92,85,89,-1,93,89,17,-1,93,92,89,-1,93,17,18,-1,94,41,90,-1,
  94,90,91,-1,94,42,41,-1,95,88,92,-1,95,91,88,-1,96,92,93,-1,96,95,92,-1,97,93,18,-1,97,96,93,-1,
  98,94,91,-1,98,42,94,-1,98,43,42,-1,98,91,95,-1,99,98,95,-1,99,95,96,-1,100,96,97,-1,100,99,96,-1,
  101,18,19,-1,101,97,18,-1,102,98,99,-1,102,43,98,-1,102,44,43,-1,103,102,99,-1,103,99,100,-1,104,97,101,-1,
  104,100,97,-1,105,19,20,-1,105,20,21,-1,105,101,19,-1,106,102,103,-1,106,45,44,-1,106,46,45,-1,106,44,102,-1,
  107,100,104,-1,107,103,100,-1,108,101,105,-1,108,104,101,-1,109,21,22,-1,109,105,21,-1,110,47,46,-1,110,106,103,-1,
  110,103,107,-1,110,46,106,-1,111,104,108,-1,111,107,104,-1,111,110,107,-1,112,105,109,-1,112,108,105,-1,113,109,22,-1,
  114,48,47,-1,114,47,110,-1,114,110,111,-1,115,111,108,-1,115,108,112,-1,115,114,111,-1,116,109,113,-1,116,112,109,-1,
  117,22,23,-1,117,113,22,-1,118,114,115,-1,118,48,114,-1,119,115,112,-1,119,112,116,-1,119,118,115,-1,120,113,117,-1,
  120,116,113,-1,120,119,116,-1,121,23,24,-1,121,117,23,-1,122,49,48,-1,122,118,119,-1,122,48,118,-1,123,119,120,-1,
  124,117,121,-1,124,120,117,-1,125,24,25,-1,125,121,24,-1,126,50,49,-1,126,119,123,-1,126,49,122,-1,126,122,119,-1,
  127,120,124,-1,127,123,120,-1,128,121,125,-1,128,124,121,-1,129,25,26,-1,129,125,25,-1,130,50,126,-1,130,126,123,-1,
  130,123,127,-1,130,51,50,-1,131,124,128,-1,131,127,124,-1,132,128,125,-1,132,125,129,-1,132,131,128,-1,133,26,27,-1,
  133,129,26,-1,133,27,28,-1,134,130,127,-1,134,51,130,-1,134,127,131,-1,134,52,51,-1,135,131,132,-1,136,132,129,-1,
  136,129,133,-1,137,28,6,-1,137,6,30,-1,137,30,31,-1,137,133,28,-1,138,131,135,-1,138,134,131,-1,138,52,134,-1,
  138,53,52,-1,138,54,53,-1,139,132,136,-1,139,135,132,-1,140,31,32,-1,140,137,31,-1,140,133,137,-1,140,136,133,-1,
  141,138,135,-1,141,54,138,-1,141,135,139,-1,142,32,33,-1,142,140,32,-1,142,139,136,-1,142,136,140,-1,142,141,139,-1,
  143,33,29,-1,143,142,33,-1,143,55,54,-1,143,29,55,-1,143,54,141,-1,143,141,142,-1]
  normalPerVertex TRUE
  normal DEF NORM_10 Normal { vector [
  0.97871102 0.13452073 0.1550126,0.15639832 0.021496454 0.98746011,
  0.9267668 0.12738116 0.35337988,0.80406126 0.11051568 0.5841847,
  0.5959088 0.081905779 0.79886429,0.30873864 0.042435149 0.95019983,
  0.97871102 -0.13452073 0.1550126,0.93812557 0.30902597 0.15627975,
  0.81996312 0.5506697 0.15627975,0.64098776 0.75147278 0.15627975,
  0.41447326 0.89654256 0.15627975,0.20095113 0.96702994 0.15643447,
  -0.022976029 0.98744556 0.15627975,-0.33075669 0.93066013 0.15643447,
  -0.56958043 0.80691164 0.15643447,-0.766161 0.6233182 0.15643447,
  -0.90591891 0.39349611 0.15643447,-0.97146685 0.17840627 0.15627975,
  -0.97848896 -0.13449021 0.15643447,-0.88730879 -0.4338891 0.15627975,
  -0.766161 -0.6233182 0.15643447,-0.60534223 -0.78047257 0.15627975,
  -0.33075669 -0.93066013 0.15643447,-0.022976029 -0.98744556 0.15627975,
  0.24428561 -0.95702726 0.15627975,0.4934297 -0.85563063 0.15627975,
  0.70597837 -0.69077578 0.15627975,0.84390008 -0.51318701 0.15643447,
  0.93812557 -0.30902597 0.15627975,0.15639832 -0.021496454 0.98746011,
  0.94303353 -0.12961698 0.30641017,0.83478939 -0.11473916 0.53848083,
  0.63085823 -0.086709467 0.77103785,0.36477231 -0.0501368 0.92974591,
  0.15063345 0.042205514 0.98768834,0.13366064 0.081280837 0.98768834,
  0.10055488 0.12012923 0.98765261,0.064415553 0.14280389 0.98765261,
  0.023498822 0.15488744 0.98765261,-0.01916071 0.1554837 0.98765261,
  -0.06039918 0.14454845 0.98765261,-0.097158119 0.12289269 0.98765261,
  -0.12671128 0.092122553 0.98765261,-0.14686685 0.054520104 0.98765261,
  -0.15612998 0.012874147 0.98765261,-0.15497743 -0.021301157 0.98768834,
  -0.14686685 -0.054520104 0.98765261,-0.12671128 -0.092122553 0.98765261,
  -0.090212678 -0.12780225 0.98768834,-0.044370456 -0.15024506 0.98765261,
  -0.0021894482 -0.15664457 0.98765261,0.040153941 -0.15142647 0.98765261,
  0.079519296 -0.13497776 0.98765261,0.10677484 -0.11432793 0.98768834,
  0.13366064 -0.081280837 0.98768834,0.15063345 -0.042205514 0.98768834,
  0.91772726 0.25261127 0.30653585,0.775173 0.19687782 0.60028821,
  0.83493641 0.47495047 0.27803462,0.54176119 0.16300153 0.82457584,
  0.69898381 0.43942354 0.56420616,0.68048048 0.66569783 0.30625595,
  0.29382191 0.070520034 0.95325527,0.51318184 0.30029366 0.80403241,
  0.52696628 0.61834358 0.58305897,0.4756433 0.82460339 0.30625595,
  0.30137789 0.16608057 0.9389295,0.41313341 0.42761276 0.80403241,
  0.35759021 0.7473013 0.5600625,0.21113591 0.93509377 0.28464235,
  0.23000423 0.22341792 0.94719717,0.29133308 0.56224732 0.77395283,
  0.15744554 0.79674994 0.58343845,-0.069302418 0.9493329 0.30653585,
  0.1601333 0.304019 0.93911116,0.11110084 0.58411342 0.80403241,
  -0.063353528 0.80968259 0.58343845,-0.31290427 0.88042825 0.35628221,
  0.055338194 0.31563777 0.94726474,-0.05061099 0.59242756 0.80403241,
  -0.26111008 0.73469334 0.62613674,-0.5572179 0.78939793 0.25760265,
  -0.031871947 0.31886313 0.94726474,-0.18411553 0.51805146 0.83529884,
  -0.48460713 0.68653189 0.54206078,-0.72480787 0.58967494 0.35628221,
  -0.092074872 0.26949476 0.95859,-0.36517892 0.51734067 0.77395283,
  -0.60483239 0.49206764 0.62613674,-0.88625628 0.38495543 0.25760265,
  -0.19626224 0.2820485 0.93911116,-0.42648311 0.34696974 0.83529884,
  -0.77076869 0.33479209 0.54206078,-0.94357673 0.12529459 0.30653585,
  -0.21869571 0.18242092 0.95859,-0.58081786 0.2522848 0.77395283,
  -0.805637 0.10270636 0.58343845,-0.92567554 -0.12723118 0.35628221,
  -0.31423814 0.139013 0.93911116,-0.59033351 0.070980534 0.80403241,
  -0.77245098 -0.10617094 0.62613674,-0.87478226 -0.37522228 0.30653585,
  -0.31867836 0.033669305 0.94726474,-0.54467535 -0.074863904 0.83529884,
  -0.74805195 -0.31625599 0.58343845,-0.73311968 -0.61766841 0.28464235,
  -0.26463931 -0.036373835 0.96366124,-0.57337906 -0.22529053 0.78770593,
  -0.63498731 -0.50635036 0.58343845,-0.51332631 -0.80168784 0.30625595,
  -0.31423814 -0.139013 0.93911116,-0.47837746 -0.35371046 0.80376857,
  -0.47482856 -0.65889104 0.58343845,-0.2932095 -0.89463805 0.33712156,
  -0.23859312 -0.21422146 0.94719717,-0.36520798 -0.46965861 0.80376857,
  -0.30208034 -0.77141264 0.5600625,-0.069302418 -0.9493329 0.30653585,
  -0.18626015 -0.28934157 0.9389295,-0.20023047 -0.56339453 0.80155746,
  -0.074079359 -0.7963456 0.60028821,0.18939445 -0.93282663 0.30653585,
  -0.098651374 -0.26715747 0.95859,-0.027834801 -0.56506629 0.82457584,
  0.15744554 -0.79674994 0.58343845,0.43404481 -0.84713687 0.30653585,
  -0.037420522 -0.3184607 0.94719717,0.11110084 -0.58411342 0.80403241,
  0.35759021 -0.7473013 0.5600625,0.64650404 -0.69861885 0.30653585,
  0.049886801 -0.31674725 0.94719717,0.28883968 -0.54150555 0.78952098,
  0.5314349 -0.59768805 0.60028821,0.82751164 -0.48394547 0.28464235,
  0.13349425 -0.2915421 0.94719717,0.39397203 -0.40603044 0.82457584,
  0.68975846 -0.42875731 0.58343845,0.92730164 -0.21521841 0.30625595,
  0.19779088 -0.22843633 0.95325527,0.514712 -0.33851281 0.78770593,
  0.77985769 -0.22676322 0.58343845,0.312061 -0.1897685 0.93091667,
  0.55215711 -0.17185533 0.81583593,0.25722154 -0.072070095 0.96366124] }
}
}
DEF SHAPE_11 Shape {
 appearance USE APP_1
 geometry DEF FACE_11 IndexedFaceSet {
  coord DEF COORD_11 Coordinate { point [
  0.49212598 0 6.496063,0.47387662 0.132774 6.496063,
  0.42048199 0.25570076 6.496063,0.33590214 0.35966337 6.496063,
  0.22640996 0.43695139 6.496063,0.10012599 0.48183272 6.496063,
  -0.033583865 0.49097872 6.496063,-0.16480296 0.46371108 6.496063,
  -0.28379937 0.40205211 6.496063,-0.38174768 0.31057478 6.496063,
  -0.45138351 0.19606353 6.496063,-0.4875423 0.067011146 6.496063,
  -0.4875423 -0.067011146 6.496063,-0.45138351 -0.19606353 6.496063,
  -0.38174768 -0.31057478 6.496063,-0.28379937 -0.40205211 6.496063,
  -0.16480296 -0.46371108 6.496063,-0.033583865 -0.49097872 6.496063,
  0.10012599 -0.48183272 6.496063,0.22640996 -0.43695139 6.496063,
  0.33590214 -0.35966337 6.496063,0.42048199 -0.25570076 6.496063,
  0.47387662 -0.132774 6.496063,0.15748031 0 6.496063,
  0.15164052 0.04248768 6.496063,0.13455424 0.081824244 6.496063,
  0.10748868 0.11509228 6.496063,0.072451187 0.13982444 6.496063,
  0.032040317 0.15418647 6.496063,-0.010746837 0.15711319 6.496063,
  -0.052736947 0.14838755 6.496063,-0.090815799 0.12865668 6.496063,
  -0.12215926 0.099383928 6.496063,-0.14444272 0.062740329 6.496063,
  -0.15601353 0.021443567 6.496063,-0.15601353 -0.021443567 6.496063,
  -0.14444272 -0.062740329 6.496063,-0.12215926 -0.099383928 6.496063,
  -0.090815799 -0.12865668 6.496063,-0.052736947 -0.14838755 6.496063,
  -0.010746837 -0.15711319 6.496063,0.032040317 -0.15418647 6.496063,
  0.072451187 -0.13982444 6.496063,0.10748868 -0.11509228 6.496063,
  0.13455424 -0.081824244 6.496063,0.15164052 -0.04248768 6.496063] }
 coordIndex [
  4,28,27,-1,4,27,3,-1,13,14,37,-1,13,37,36,-1,5,28,4,-1,12,13,36,-1,12,36,35,-1,6,29,28,-1,
  6,30,29,-1,6,28,5,-1,43,20,21,-1,11,12,35,-1,11,34,33,-1,11,35,34,-1,44,21,22,-1,44,43,21,-1,
  7,30,6,-1,42,19,20,-1,10,11,33,-1,42,20,43,-1,45,22,0,-1,8,31,30,-1,8,32,31,-1,8,30,7,-1,
  45,44,22,-1,9,10,33,-1,41,18,19,-1,9,33,32,-1,9,32,8,-1,41,19,42,-1,23,45,0,-1,40,16,17,-1,
  40,17,18,-1,40,18,41,-1,24,0,1,-1,24,23,0,-1,39,15,16,-1,39,16,40,-1,25,1,2,-1,25,24,1,-1,
  38,15,39,-1,37,15,38,-1,3,26,25,-1,3,25,2,-1,27,26,3,-1,14,15,37,-1]
  normalPerVertex TRUE
  normal DEF NORM_11 Normal { vector [
  0 0 1,0 0 1,
  0 0 1,0 0 1,
  0 0 1,0 0 1,
  0 0 1,0 0 1,
  0 0 1,0 0 1,
  0 0 1,0 0 1,
  0 0 1,0 0 1,
  0 0 1,0 0 1,
  0 0 1,0 0 1,
  0 0 1,0 0 1,
  0 0 1,0 0 1,
  0 0 1,0 0 1,
  0 0 1,0 0 1,
  0 0 1,0 0 1,
  0 0 1,0 0 1,
  0 0 1,0 0 1,
  0 0 1,0 0 1,
  0 0 1,0 0 1,
  0 0 1,0 0 1,
  0 0 1,0 0 1,
  0 0 1,0 0 1,
  0 0 1,0 0 1,
  0 0 1,0 0 1] }
}
}
DEF SHAPE_12 Shape {
 appearance USE APP_2
 geometry DEF FACE_12 IndexedFaceSet {
  coord DEF COORD_12 Coordinate { point [
  0.15748031 0 6.496063,0.15748031 0 6.496063,
  0.15164052 0.04248768 6.496063,0.13455424 0.081824244 6.496063,
  0.10748868 0.11509228 6.496063,0.072451187 0.13982444 6.496063,
  0.032040317 0.15418647 6.496063,-0.010746837 0.15711319 6.496063,
  -0.052736947 0.14838755 6.496063,-0.090815799 0.12865668 6.496063,
  -0.12215926 0.099383928 6.496063,-0.14444272 0.062740329 6.496063,
  -0.15601353 0.021443567 6.496063,-0.15601353 -0.021443567 6.496063,
  -0.14444272 -0.062740329 6.496063,-0.12215926 -0.099383928 6.496063,
  -0.090815799 -0.12865668 6.496063,-0.052736947 -0.14838755 6.496063,
  -0.010746837 -0.15711319 6.496063,0.032040317 -0.15418647 6.496063,
  0.072451187 -0.13982444 6.496063,0.10748868 -0.11509228 6.496063,
  0.13455424 -0.081824244 6.496063,0.15164052 -0.04248768 6.496063,
  0.15748031 0 6.8897638,0.15748031 0 6.8897638,
  0.15164052 0.04248768 6.8897638,0.13455424 0.081824244 6.8897638,
  0.10748868 0.11509228 6.8897638,0.072451187 0.13982444 6.8897638,
  0.032040317 0.15418647 6.8897638,-0.010746837 0.15711319 6.8897638,
  -0.052736947 0.14838755 6.8897638,-0.090815799 0.12865668 6.8897638,
  -0.12215926 0.099383928 6.8897638,-0.14444272 0.062740329 6.8897638,
  -0.15601353 0.021443567 6.8897638,-0.15601353 -0.021443567 6.8897638,
  -0.14444272 -0.062740329 6.8897638,-0.12215926 -0.099383928 6.8897638,
  -0.090815799 -0.12865668 6.8897638,-0.052736947 -0.14838755 6.8897638,
  -0.010746837 -0.15711319 6.8897638,0.032040317 -0.15418647 6.8897638,
  0.072451187 -0.13982444 6.8897638,0.10748868 -0.11509228 6.8897638,
  0.13455424 -0.081824244 6.8897638,0.15164052 -0.04248768 6.8897638] }
 coordIndex [
  45,20,21,-1,45,21,22,-1,45,44,20,-1,46,22,23,-1,46,45,22,-1,47,46,23,-1,26,0,2,-1,26,25,0,-1,
  24,23,1,-1,24,47,23,-1,27,2,3,-1,27,3,4,-1,27,26,2,-1,28,27,4,-1,29,4,5,-1,29,28,4,-1,
  30,5,6,-1,30,6,7,-1,30,29,5,-1,31,30,7,-1,32,7,8,-1,32,8,9,-1,32,31,7,-1,33,32,9,-1,
  34,9,10,-1,34,33,9,-1,35,10,11,-1,35,11,12,-1,35,34,10,-1,36,35,12,-1,37,12,13,-1,37,36,12,-1,
  38,37,13,-1,38,13,14,-1,39,38,14,-1,39,14,15,-1,39,15,16,-1,40,39,16,-1,40,16,17,-1,41,40,17,-1,
  42,17,18,-1,42,41,17,-1,42,18,19,-1,43,19,20,-1,43,42,19,-1,44,43,20,-1]
  normalPerVertex TRUE
  normal DEF NORM_12 Normal { vector [
  0.99068595 0.13616665 0,0.99068595 -0.13616665 0,
  0.94956031 0.31358447 0,0.8544194 0.51958395 0,
  0.68255314 0.73083596 0,0.41894656 0.90801089 0,
  0.20345601 0.97908409 0,-0.068242413 0.99766877 0,
  -0.33487961 0.94226092 0,-0.57668032 0.81696989 0,
  -0.80378182 0.59492419 0,-0.9172113 0.39840109 0,
  -0.99068595 0.13616665 0,-0.9834158 -0.18136528 0,
  -0.89801631 -0.43996217 0,-0.77571129 -0.63108794 0,
  -0.61346678 -0.78972053 0,-0.33487961 -0.94226092 0,
  -0.068242413 -0.99766877 0,0.15843248 -0.98736981 0,
  0.46006504 -0.88788522 0,0.68255314 -0.73083596 0,
  0.82974396 -0.55814421 0,0.96291729 -0.26979677 0,
  0.99068595 -0.13616665 0,0.99068595 0.13616665 0,
  0.97425621 0.22544364 0,0.8544194 0.51958395 0,
  0.68255314 0.73083596 0,0.50021932 0.86589874 0,
  0.20345601 0.97908409 0,-0.068242413 0.99766877 0,
  -0.33487961 0.94226092 0,-0.57668032 0.81696989 0,
  -0.74601505 0.66592908 0,-0.9172113 0.39840109 0,
  -0.99068595 0.13616665 0,-0.99587984 -0.090682641 0,
  -0.93448403 -0.35600505 0,-0.77571129 -0.63108794 0,
  -0.53868527 -0.84250708 0,-0.33487961 -0.94226092 0,
  -0.068242413 -0.99766877 0,0.24805315 -0.96874643 0,
  0.46006504 -0.88788522 0,0.68255314 -0.73083596 0,
  0.87730418 -0.47993476 0,0.96291729 -0.26979677 0] }
}
}
DEF SHAPE_13 Shape {
 appearance USE APP_2
 geometry DEF FACE_13 IndexedFaceSet {
  coord DEF COORD_13 Coordinate { point [
  0.15748031 0 6.8897638,0.47244094 0 7.2047244,
  0.17289559 0 6.987092,0.21763244 0 7.074893,
  0.28731173 0 7.1445723,0.37511276 0 7.1893091,
  0.47244094 0 7.2047244,0.47244094 -0.04248768 7.2105642,
  0.47244094 -0.081824244 7.2276505,0.47244094 -0.11509228 7.254716,
  0.47244094 -0.13982444 7.2897535,0.47244094 -0.15418647 7.3301644,
  0.47244094 -0.15711319 7.3729516,0.47244094 -0.14838755 7.4149417,
  0.47244094 -0.12865668 7.4530205,0.47244094 -0.099383928 7.484364,
  0.47244094 -0.062740329 7.5066474,0.47244094 -0.021443567 7.5182183,
  0.47244094 0.021443567 7.5182183,0.47244094 0.062740329 7.5066474,
  0.47244094 0.099383928 7.484364,0.47244094 0.12865668 7.4530205,
  0.47244094 0.14838755 7.4149417,0.47244094 0.15711319 7.3729516,
  0.47244094 0.15418647 7.3301644,0.47244094 0.13982444 7.2897535,
  0.47244094 0.11509228 7.254716,0.47244094 0.081824244 7.2276505,
  0.47244094 0.04248768 7.2105642,0.15748031 0 6.8897638,
  0.17289559 0 6.987092,0.21763244 0 7.074893,
  0.28731173 0 7.1445723,0.37511276 0 7.1893091,
  0.15164052 0.04248768 6.8897638,0.13455424 0.081824244 6.8897638,
  0.10748868 0.11509228 6.8897638,0.072451187 0.13982444 6.8897638,
  0.032040317 0.15418647 6.8897638,-0.010746837 0.15711319 6.8897638,
  -0.052736947 0.14838755 6.8897638,-0.090815799 0.12865668 6.8897638,
  -0.12215926 0.099383928 6.8897638,-0.14444272 0.062740329 6.8897638,
  -0.15601353 0.021443567 6.8897638,-0.15601353 -0.021443567 6.8897638,
  -0.14444272 -0.062740329 6.8897638,-0.12215926 -0.099383928 6.8897638,
  -0.090815799 -0.12865668 6.8897638,-0.052736947 -0.14838755 6.8897638,
  -0.010746837 -0.15711319 6.8897638,0.032040317 -0.15418647 6.8897638,
  0.072451187 -0.13982444 6.8897638,0.10748868 -0.11509228 6.8897638,
  0.13455424 -0.081824244 6.8897638,0.15164052 -0.04248768 6.8897638,
  0.16734161 -0.04248768 6.9888966,0.15109159 -0.081824244 6.9941765,
  0.21290795 -0.04248768 7.0783255,0.12535072 -0.11509228 7.0025402,
  0.19908486 -0.081824244 7.0883686,0.092028079 -0.13982444 7.0133674,
  0.28387918 -0.04248768 7.1492968,0.17718836 -0.11509228 7.1042773,
  0.053595058 -0.15418647 7.0258551,0.27383612 -0.081824244 7.1631199,
  0.14884243 -0.13982444 7.1248719,0.012902057 -0.15711319 7.039077,
  0.37330816 -0.04248768 7.1948631,0.25792739 -0.11509228 7.1850164,
  0.11614935 -0.15418647 7.1486248,-0.027032911 -0.14838755 7.0520527,
  0.36802821 -0.081824244 7.2111131,0.23733286 -0.13982444 7.2133623,
  0.081533818 -0.15711319 7.1737744,-0.063248052 -0.12865668 7.0638197,
  0.35966449 -0.11509228 7.236854,0.21357995 -0.15418647 7.2460554,
  0.047563105 -0.14838755 7.1984556,-0.093057453 -0.099383928 7.0735053,
  0.34883731 -0.13982444 7.2701766,0.18843029 -0.15711319 7.2806709,
  0.016756667 -0.12865668 7.2208378,-0.11425029 -0.062740329 7.0803913,
  0.33634967 -0.15418647 7.3086097,0.16374913 -0.14838755 7.3146416,
  -0.0086007244 -0.099383928 7.239261,-0.12525478 -0.021443567 7.0839669,
  0.32312771 -0.15711319 7.3493027,0.14136694 -0.12865668 7.3454481,
  -0.026628427 -0.062740329 7.2523589,-0.12525478 0.021443567 7.0839669,
  0.31015205 -0.14838755 7.3892376,0.12294371 -0.099383928 7.3708054,
  -0.035989409 -0.021443567 7.2591601,-0.11425029 0.062740329 7.0803913,
  0.29838504 -0.12865668 7.4254528,0.10984582 -0.062740329 7.3888332,
  -0.035989409 0.021443567 7.2591601,-0.093057453 0.099383928 7.0735053,
  0.28869938 -0.099383928 7.4552622,0.10304467 -0.021443567 7.3981941,
  -0.026628427 0.062740329 7.2523589,-0.063248052 0.12865668 7.0638197,
  0.28181341 -0.062740329 7.476455,0.10304467 0.021443567 7.3981941,
  -0.0086007244 0.099383928 7.239261,-0.027032911 0.14838755 7.0520527,
  0.27823783 -0.021443567 7.4874595,0.10984582 0.062740329 7.3888332,
  0.016756667 0.12865668 7.2208378,0.012902057 0.15711319 7.039077,
  0.27823783 0.021443567 7.4874595,0.12294371 0.099383928 7.3708054,
  0.047563105 0.14838755 7.1984556,0.053595058 0.15418647 7.0258551,
  0.28181341 0.062740329 7.476455,0.14136694 0.12865668 7.3454481,
  0.081533818 0.15711319 7.1737744,0.092028079 0.13982444 7.0133674,
  0.28869938 0.099383928 7.4552622,0.16374913 0.14838755 7.3146416,
  0.11614935 0.15418647 7.1486248,0.12535072 0.11509228 7.0025402,
  0.29838504 0.12865668 7.4254528,0.18843029 0.15711319 7.2806709,
  0.14884243 0.13982444 7.1248719,0.15109159 0.081824244 6.9941765,
  0.31015205 0.14838755 7.3892376,0.21357995 0.15418647 7.2460554,
  0.17718836 0.11509228 7.1042773,0.16734161 0.04248768 6.9888966,
  0.32312771 0.15711319 7.3493027,0.23733286 0.13982444 7.2133623,
  0.19908486 0.081824244 7.0883686,0.33634967 0.15418647 7.3086097,
  0.25792739 0.11509228 7.1850164,0.21290795 0.04248768 7.0783255,
  0.34883731 0.13982444 7.2701766,0.27383612 0.081824244 7.1631199,
  0.35966449 0.11509228 7.236854,0.28387918 0.04248768 7.1492968,
  0.36802821 0.081824244 7.2111131,0.37330816 0.04248768 7.1948631] }
 coordIndex [
  127,34,35,-1,127,35,36,-1,128,121,124,-1,128,21,22,-1,128,124,21,-1,128,125,121,-1,129,122,125,-1,129,126,122,-1,
  130,123,119,-1,130,119,126,-1,131,34,127,-1,131,30,29,-1,131,31,30,-1,131,29,34,-1,132,128,22,-1,132,22,23,-1,
  132,23,24,-1,132,125,128,-1,132,129,125,-1,133,130,126,-1,133,126,129,-1,134,127,123,-1,134,123,130,-1,134,131,127,-1,
  135,132,24,-1,135,24,25,-1,135,129,132,-1,135,133,129,-1,136,130,133,-1,136,134,130,-1,137,31,131,-1,137,131,134,-1,
  138,136,133,-1,138,135,25,-1,138,133,135,-1,139,134,136,-1,139,137,134,-1,140,25,26,-1,140,138,25,-1,140,136,138,-1,
  140,139,136,-1,141,32,31,-1,141,31,137,-1,141,137,139,-1,142,26,27,-1,142,140,26,-1,142,139,140,-1,142,141,139,-1,
  143,27,28,-1,143,28,6,-1,143,33,32,-1,143,6,33,-1,143,32,141,-1,143,142,27,-1,143,141,142,-1,56,0,2,-1,
  56,55,0,-1,57,55,56,-1,57,54,55,-1,58,2,3,-1,58,3,4,-1,58,57,56,-1,58,56,2,-1,59,53,54,-1,
  59,54,57,-1,60,57,58,-1,61,53,59,-1,61,51,52,-1,61,52,53,-1,62,4,5,-1,62,58,4,-1,62,60,58,-1,
  63,57,60,-1,63,59,57,-1,64,51,61,-1,65,60,62,-1,65,63,60,-1,66,59,63,-1,66,64,61,-1,66,61,59,-1,
  67,51,64,-1,67,50,51,-1,68,5,1,-1,68,1,7,-1,68,7,8,-1,68,65,62,-1,68,62,5,-1,69,63,65,-1,
  69,66,63,-1,70,64,66,-1,70,67,64,-1,71,49,50,-1,71,50,67,-1,72,65,68,-1,72,69,65,-1,72,68,8,-1,
  73,70,66,-1,73,66,69,-1,74,67,70,-1,74,71,67,-1,75,48,49,-1,75,49,71,-1,76,8,9,-1,76,69,72,-1,
  76,73,69,-1,76,72,8,-1,77,70,73,-1,77,74,70,-1,78,75,71,-1,78,71,74,-1,79,47,48,-1,79,48,75,-1,
  80,9,10,-1,80,10,11,-1,80,73,76,-1,80,77,73,-1,80,76,9,-1,81,74,77,-1,81,78,74,-1,82,75,78,-1,
  83,47,79,-1,83,46,47,-1,84,80,11,-1,84,77,80,-1,84,81,77,-1,85,78,81,-1,85,82,78,-1,86,79,75,-1,
  86,75,82,-1,87,45,46,-1,87,46,83,-1,88,11,12,-1,88,84,11,-1,88,81,84,-1,88,85,81,-1,89,86,82,-1,
  89,82,85,-1,90,83,79,-1,90,79,86,-1,91,45,87,-1,91,44,45,-1,92,85,88,-1,92,12,13,-1,92,13,14,-1,
  92,89,85,-1,92,88,12,-1,93,90,86,-1,93,86,89,-1,94,91,87,-1,94,83,90,-1,94,87,83,-1,95,44,91,-1,
  95,43,44,-1,96,14,15,-1,96,92,14,-1,96,93,89,-1,96,89,92,-1,97,94,90,-1,97,90,93,-1,98,91,94,-1,
  99,43,95,-1,99,42,43,-1,100,93,96,-1,100,97,93,-1,100,96,15,-1,101,98,94,-1,101,94,97,-1,102,99,95,-1,
  102,91,98,-1,102,95,91,-1,103,42,99,-1,103,40,41,-1,103,41,42,-1,104,15,16,-1,104,100,15,-1,104,97,100,-1,
  104,101,97,-1,105,98,101,-1,105,102,98,-1,106,99,102,-1,107,40,103,-1,108,16,17,-1,108,104,16,-1,108,105,101,-1,
  108,101,104,-1,109,106,102,-1,109,102,105,-1,110,103,99,-1,110,99,106,-1,110,107,103,-1,111,39,40,-1,111,40,107,-1,
  112,17,18,-1,112,108,17,-1,112,105,108,-1,112,109,105,-1,113,106,109,-1,113,110,106,-1,114,107,110,-1,115,38,39,-1,
  115,39,111,-1,116,18,19,-1,116,112,18,-1,116,109,112,-1,116,113,109,-1,117,110,113,-1,117,114,110,-1,118,111,107,-1,
  118,107,114,-1,119,38,115,-1,119,37,38,-1,120,19,20,-1,120,20,21,-1,120,116,19,-1,120,113,116,-1,120,117,113,-1,
  121,114,117,-1,121,118,114,-1,122,119,115,-1,122,115,111,-1,122,111,118,-1,123,36,37,-1,123,37,119,-1,124,117,120,-1,
  124,120,21,-1,124,121,117,-1,125,118,121,-1,125,122,118,-1,126,119,122,-1,127,36,123,-1]
  normalPerVertex TRUE
  normal DEF NORM_13 Normal { vector [
  0.97871102 -0.13452073 -0.1550126,0.1550126 -0.13452073 -0.97871102,
  0.92454228 -0.1359762 -0.35599445,0.80148177 -0.13616665 -0.58231059,
  0.62427012 -0.1359762 -0.76928362,0.35599445 -0.1359762 -0.92454228,
  0.1550126 0.13452073 -0.97871102,0.15076779 -0.26671278 -0.95191038,
  0.13374608 -0.51868473 -0.84443954,0.10182056 -0.75917792 -0.64286971,
  0.072674462 -0.8855374 -0.45884849,0.03120313 -0.97990504 -0.19700881,
  -0.018431009 -0.99303504 0.11636881,-0.052965271 -0.94093832 0.33440956,
  -0.085288602 -0.8383038 0.53849104,-0.12224713 -0.62395649 0.77183803,
  -0.14644373 -0.35164171 0.92460929,-0.15580561 -0.089575201 0.98371789,
  -0.1539177 0.17865537 0.97179813,-0.14088989 0.43458256 0.88954373,
  -0.12194369 0.62637815 0.76992217,-0.091500552 0.81109604 0.57771175,
  -0.046482746 0.9548343 0.29348051,-0.010807905 0.9976105 0.068238428,
  0.02463715 0.98752029 -0.15555284,0.071771646 0.88854117 -0.45314834,
  0.11231815 0.69605497 -0.70914886,0.13751307 0.47673718 -0.86822337,
  0.15076779 0.26671278 -0.95191038,0.97871102 0.13452073 -0.1550126,
  0.94219832 0.13616665 -0.30613879,0.80148177 0.13616665 -0.58231059,
  0.53872213 0.1359762 -0.83143788,0.30613879 0.13616665 -0.94219832,
  0.93851532 0.31159797 -0.14864622,0.84670162 0.51489066 -0.13410436,
  0.70914886 0.69605497 -0.11231815,0.49629533 0.86458783 -0.078605459,
  0.24507205 0.96872754 -0.038815599,-0.025290474 0.99967212 0.0040056175,
  -0.33932933 0.93913105 0.053744486,-0.5742898 0.81358329 0.090958568,
  -0.74192709 0.66010277 0.11750971,-0.88954373 0.43458256 0.14088989,
  -0.97179813 0.17865537 0.1539177,-0.98371789 -0.089575201 0.15580561,
  -0.92460929 -0.35164171 0.14644373,-0.79800115 -0.58925333 0.12639097,
  -0.611887 -0.78498541 0.09691338,-0.37896618 -0.92346194 0.060022346,
  -0.11636881 -0.99303504 0.018431009,0.19700881 -0.97990504 -0.03120313,
  0.45884849 -0.8855374 -0.072674462,0.64286971 -0.75917792 -0.10182056,
  0.82137446 -0.55535558 -0.13009293,0.93851532 -0.31159797 -0.14864622,
  0.93158958 -0.24350581 -0.26989957,0.81438249 -0.50564755 -0.28478364,
  0.79552718 -0.25252506 -0.55078816,0.64714707 -0.73347957 -0.20786629,
  0.68527987 -0.49668738 -0.53262852,0.44113021 -0.88960872 -0.11832357,
  0.56558851 -0.27136365 -0.77876274,0.57736689 -0.70048745 -0.4194816,
  0.21404 -0.97354686 -0.079958726,0.5005955 -0.5221265 -0.69049841,
  0.38746689 -0.88115415 -0.27099219,-0.024052863 -0.99968014 0.0078152489,
  0.27474415 -0.29065813 -0.91653342,0.39767203 -0.73347957 -0.55123922,
  0.15758245 -0.97993636 -0.12203482,-0.27941857 -0.95586751 0.090788598,
  0.28419497 -0.54413146 -0.78940115,0.26477804 -0.88985265 -0.37155732,
  -0.062890737 -0.99735791 0.036358678,-0.53068334 -0.82601631 0.18992695,
  0.20786629 -0.73347957 -0.64714707,0.11215898 -0.97993636 -0.16475767,
  -0.27838015 -0.94105273 0.19215684,-0.73699169 -0.62946693 0.24620037,
  0.12403961 -0.89900607 -0.4200027,-0.048577196 -0.99735791 0.054013464,
  -0.44100743 -0.83159235 0.33758941,-0.87148913 -0.39724082 0.28758724,
  0.05612899 -0.98466983 -0.16515105,-0.20537553 -0.94105273 0.26877621,
  -0.6044192 -0.66470805 0.43913625,-0.94728178 -0.16286277 0.27592198,
  -0.02950858 -0.99735791 0.066381036,-0.34660873 -0.81531046 0.46382242,
  -0.72690669 -0.43896107 0.52812862,-0.93769835 0.11625329 0.32742478,
  -0.10636281 -0.93400683 0.34105455,-0.46189343 -0.62946693 0.62484065,
  -0.81252189 -0.15493299 0.56196437,-0.89176567 0.3724839 0.2569236,
  -0.18997774 -0.78869796 0.58469136,-0.54281667 -0.39724082 0.73996607,
  -0.78501818 0.1088366 0.60983691,-0.74618144 0.61375056 0.25792151,
  -0.27176792 -0.60864506 0.74544845,-0.58352896 -0.13574737 0.80066635,
  -0.75958354 0.37891794 0.52863413,-0.55987166 0.81495146 0.14965906,
  -0.28758724 -0.39724082 0.87148913,-0.58115858 0.13574737 0.80238853,
  -0.6249827 0.60864506 0.48882289,-0.31595805 0.94092903 0.12175001,
  -0.30754952 -0.13574737 0.94179931,-0.53600998 0.39724082 0.74491142,
  -0.48731963 0.80345307 0.34202741,-0.071048095 0.99735791 0.015144851,
  -0.30476296 0.13574737 0.94270472,-0.45152586 0.62946693 0.63237314,
  -0.28378166 0.93202281 0.22539176,0.1666018 0.98466983 -0.051664044,
  -0.2795855 0.39724082 0.87408906,-0.33401335 0.81531046 0.4729735,
  -0.094160342 0.99320375 0.068411493,0.41269797 0.89900607 -0.14652124,
  -0.21687385 0.64404305 0.73360363,-0.19215684 0.94105273 0.27838015,
  0.14886046 0.98381995 -0.099693863,0.64573372 0.73347957 -0.21221614,
  -0.18478782 0.83159235 0.52374385,-0.036358678 0.99735791 0.062890737,
  0.34392339 0.90107745 -0.2641517,0.82428025 0.52159167 -0.22023669,
  -0.096727816 0.94105273 0.32413499,0.12203482 0.97993636 -0.15758245,
  0.52280967 0.76314415 -0.37984346,0.91319612 0.25252506 -0.31984986,
  -0.011707097 0.99854777 0.052586059,0.2715511 0.88985265 -0.36663641,
  0.69258824 0.53933244 -0.4790011,0.075788543 0.96945813 -0.23325315,
  0.40137224 0.73347957 -0.54855086,0.75413688 0.29712214 -0.5856586,
  0.16538001 0.87572672 -0.45359912,0.5020105 0.5221265 -0.68947036,
  0.21221614 0.73347957 -0.64573372,0.56587091 0.27136365 -0.77855756,
  0.2643823 0.5221265 -0.81085505,0.27799925 0.25252506 -0.92679421] }
}
}
DEF SHAPE_14 Shape {
 appearance USE APP_2
 geometry DEF FACE_14 IndexedFaceSet {
  coord DEF COORD_14 Coordinate { point [
  0.47244094 0 7.2047244,1.5275591 0 7.2047244,
  1.5275591 0 7.2047244,1.5275591 0.04248768 7.2105642,
  1.5275591 0.081824244 7.2276505,1.5275591 0.11509228 7.254716,
  1.5275591 0.13982444 7.2897535,1.5275591 0.15418647 7.3301644,
  1.5275591 0.15711319 7.3729516,1.5275591 0.14838755 7.4149417,
  1.5275591 0.12865668 7.4530205,1.5275591 0.099383928 7.484364,
  1.5275591 0.062740329 7.5066474,1.5275591 0.021443567 7.5182183,
  1.5275591 -0.021443567 7.5182183,1.5275591 -0.062740329 7.5066474,
  1.5275591 -0.099383928 7.484364,1.5275591 -0.12865668 7.4530205,
  1.5275591 -0.14838755 7.4149417,1.5275591 -0.15711319 7.3729516,
  1.5275591 -0.15418647 7.3301644,1.5275591 -0.13982444 7.2897535,
  1.5275591 -0.11509228 7.254716,1.5275591 -0.081824244 7.2276505,
  1.5275591 -0.04248768 7.2105642,0.47244094 0 7.2047244,
  0.47244094 -0.04248768 7.2105642,0.47244094 -0.081824244 7.2276505,
  0.47244094 -0.11509228 7.254716,0.47244094 -0.13982444 7.2897535,
  0.47244094 -0.15418647 7.3301644,0.47244094 -0.15711319 7.3729516,
  0.47244094 -0.14838755 7.4149417,0.47244094 -0.12865668 7.4530205,
  0.47244094 -0.099383928 7.484364,0.47244094 -0.062740329 7.5066474,
  0.47244094 -0.021443567 7.5182183,0.47244094 0.021443567 7.5182183,
  0.47244094 0.062740329 7.5066474,0.47244094 0.099383928 7.484364,
  0.47244094 0.12865668 7.4530205,0.47244094 0.14838755 7.4149417,
  0.47244094 0.15711319 7.3729516,0.47244094 0.15418647 7.3301644,
  0.47244094 0.13982444 7.2897535,0.47244094 0.11509228 7.254716,
  0.47244094 0.081824244 7.2276505,0.47244094 0.04248768 7.2105642] }
 coordIndex [
  21,30,29,-1,22,21,29,-1,22,29,28,-1,2,25,47,-1,23,28,27,-1,23,22,28,-1,3,47,46,-1,3,2,47,-1,
  24,27,26,-1,24,23,27,-1,4,3,46,-1,1,26,0,-1,1,24,26,-1,5,46,45,-1,5,4,46,-1,6,45,44,-1,
  6,5,45,-1,7,44,43,-1,7,6,44,-1,8,43,42,-1,8,7,43,-1,9,42,41,-1,9,8,42,-1,10,41,40,-1,
  10,9,41,-1,11,40,39,-1,11,10,40,-1,12,39,38,-1,12,11,39,-1,13,38,37,-1,13,12,38,-1,14,37,36,-1,
  14,13,37,-1,15,14,36,-1,15,36,35,-1,16,15,35,-1,16,35,34,-1,17,16,34,-1,17,34,33,-1,18,17,33,-1,
  18,33,32,-1,19,18,32,-1,19,32,31,-1,20,19,31,-1,20,31,30,-1,21,20,30,-1]
  normalPerVertex TRUE
  normal DEF NORM_14 Normal { vector [
  0 -0.13616665 -0.99068595,0 -0.13616665 -0.99068595,
  0 0.13616665 -0.99068595,0 0.31358447 -0.94956031,
  0 0.51958395 -0.8544194,0 0.69883131 -0.71528652,
  0 0.86589874 -0.50021932,0 0.96874643 -0.24805315,
  0 0.99974662 0.022509995,0 0.95660018 0.29140367,
  0 0.84250708 0.53868527,0 0.66592908 0.74601505,
  0 0.43996217 0.89801631,0 0.18136528 0.9834158,
  0 -0.090682641 0.99587984,0 -0.35600505 0.93448403,
  0 -0.59492419 0.80378182,0 -0.78972053 0.61346678,
  0 -0.9259469 0.37765372,0 -0.99350003 0.11383181,
  0 -0.98736981 -0.15843248,0 -0.90801089 -0.41894656,
  0 -0.76130895 -0.6483893,0 -0.55814421 -0.82974396,
  0 -0.31358447 -0.94956031,0 0.13616665 -0.99068595,
  0 -0.22544364 -0.97425621,0 -0.47993476 -0.87730418,
  0 -0.69883131 -0.71528652,0 -0.86589874 -0.50021932,
  0 -0.96874643 -0.24805315,0 -0.99974662 0.022509995,
  0 -0.95660018 0.29140367,0 -0.84250708 0.53868527,
  0 -0.66592908 0.74601505,0 -0.43996217 0.89801631,
  0 -0.18136528 0.9834158,0 0.090682641 0.99587984,
  0 0.35600505 0.93448403,0 0.59492419 0.80378182,
  0 0.78972053 0.61346678,0 0.9259469 0.37765372,
  0 0.99350003 0.11383181,0 0.98736981 -0.15843248,
  0 0.90801089 -0.41894656,0 0.76130895 -0.6483893,
  0 0.51958395 -0.8544194,0 0.22544364 -0.97425621] }
}
}
DEF SHAPE_15 Shape {
 appearance USE APP_2
 geometry DEF FACE_15 IndexedFaceSet {
  coord DEF COORD_15 Coordinate { point [
  1.5275591 0 7.2047244,1.8425197 0 6.8897638,
  1.6248872 0 7.1893091,1.7126883 0 7.1445723,
  1.7823676 0 7.074893,1.8271044 0 6.987092,
  1.8425197 0 6.8897638,1.8483595 -0.04248768 6.8897638,
  1.8654458 -0.081824244 6.8897638,1.8925113 -0.11509228 6.8897638,
  1.9275488 -0.13982444 6.8897638,1.9679597 -0.15418647 6.8897638,
  2.0107468 -0.15711319 6.8897638,2.0527369 -0.14838755 6.8897638,
  2.0908158 -0.12865668 6.8897638,2.1221593 -0.099383928 6.8897638,
  2.1444427 -0.062740329 6.8897638,2.1560135 -0.021443567 6.8897638,
  2.1560135 0.021443567 6.8897638,2.1444427 0.062740329 6.8897638,
  2.1221593 0.099383928 6.8897638,2.0908158 0.12865668 6.8897638,
  2.0527369 0.14838755 6.8897638,2.0107468 0.15711319 6.8897638,
  1.9679597 0.15418647 6.8897638,1.9275488 0.13982444 6.8897638,
  1.8925113 0.11509228 6.8897638,1.8654458 0.081824244 6.8897638,
  1.8483595 0.04248768 6.8897638,1.5275591 0 7.2047244,
  1.6248872 0 7.1893091,1.7126883 0 7.1445723,
  1.7823676 0 7.074893,1.8271044 0 6.987092,
  1.5275591 0.04248768 7.2105642,1.5275591 0.081824244 7.2276505,
  1.5275591 0.11509228 7.254716,1.5275591 0.13982444 7.2897535,
  1.5275591 0.15418647 7.3301644,1.5275591 0.15711319 7.3729516,
  1.5275591 0.14838755 7.4149417,1.5275591 0.12865668 7.4530205,
  1.5275591 0.099383928 7.484364,1.5275591 0.062740329 7.5066474,
  1.5275591 0.021443567 7.5182183,1.5275591 -0.021443567 7.5182183,
  1.5275591 -0.062740329 7.5066474,1.5275591 -0.099383928 7.484364,
  1.5275591 -0.12865668 7.4530205,1.5275591 -0.14838755 7.4149417,
  1.5275591 -0.15711319 7.3729516,1.5275591 -0.15418647 7.3301644,
  1.5275591 -0.13982444 7.2897535,1.5275591 -0.11509228 7.254716,
  1.5275591 -0.081824244 7.2276505,1.5275591 -0.04248768 7.2105642,
  1.6266918 -0.04248768 7.1948631,1.6319718 -0.081824244 7.2111131,
  1.7161208 -0.04248768 7.1492968,1.6403355 -0.11509228 7.236854,
  1.7261639 -0.081824244 7.1631199,1.6511627 -0.13982444 7.2701766,
  1.7870921 -0.04248768 7.0783255,1.7420726 -0.11509228 7.1850164,
  1.6636503 -0.15418647 7.3086097,1.8009151 -0.081824244 7.0883686,
  1.7626671 -0.13982444 7.2133623,1.6768723 -0.15711319 7.3493027,
  1.8326584 -0.04248768 6.9888966,1.8228116 -0.11509228 7.1042773,
  1.78642 -0.15418647 7.2460554,1.6898479 -0.14838755 7.3892376,
  1.8489084 -0.081824244 6.9941765,1.8511576 -0.13982444 7.1248719,
  1.8115697 -0.15711319 7.2806709,1.701615 -0.12865668 7.4254528,
  1.8746493 -0.11509228 7.0025402,1.8838506 -0.15418647 7.1486248,
  1.8362509 -0.14838755 7.3146416,1.7113006 -0.099383928 7.4552622,
  1.9079719 -0.13982444 7.0133674,1.9184662 -0.15711319 7.1737744,
  1.8586331 -0.12865668 7.3454481,1.7181866 -0.062740329 7.476455,
  1.9464049 -0.15418647 7.0258551,1.9524369 -0.14838755 7.1984556,
  1.8770563 -0.099383928 7.3708054,1.7217622 -0.021443567 7.4874595,
  1.9870979 -0.15711319 7.039077,1.9832433 -0.12865668 7.2208378,
  1.8901542 -0.062740329 7.3888332,1.7217622 0.021443567 7.4874595,
  2.0270329 -0.14838755 7.0520527,2.0086007 -0.099383928 7.239261,
  1.8969553 -0.021443567 7.3981941,1.7181866 0.062740329 7.476455,
  2.0632481 -0.12865668 7.0638197,2.0266284 -0.062740329 7.2523589,
  1.8969553 0.021443567 7.3981941,1.7113006 0.099383928 7.4552622,
  2.0930575 -0.099383928 7.0735053,2.0359894 -0.021443567 7.2591601,
  1.8901542 0.062740329 7.3888332,1.701615 0.12865668 7.4254528,
  2.1142503 -0.062740329 7.0803913,2.0359894 0.021443567 7.2591601,
  1.8770563 0.099383928 7.3708054,1.6898479 0.14838755 7.3892376,
  2.1252548 -0.021443567 7.0839669,2.0266284 0.062740329 7.2523589,
  1.8586331 0.12865668 7.3454481,1.6768723 0.15711319 7.3493027,
  2.1252548 0.021443567 7.0839669,2.0086007 0.099383928 7.239261,
  1.8362509 0.14838755 7.3146416,1.6636503 0.15418647 7.3086097,
  2.1142503 0.062740329 7.0803913,1.9832433 0.12865668 7.2208378,
  1.8115697 0.15711319 7.2806709,1.6511627 0.13982444 7.2701766,
  2.0930575 0.099383928 7.0735053,1.9524369 0.14838755 7.1984556,
  1.78642 0.15418647 7.2460554,1.6403355 0.11509228 7.236854,
  2.0632481 0.12865668 7.0638197,1.9184662 0.15711319 7.1737744,
  1.7626671 0.13982444 7.2133623,1.6319718 0.081824244 7.2111131,
  2.0270329 0.14838755 7.0520527,1.8838506 0.15418647 7.1486248,
  1.7420726 0.11509228 7.1850164,1.6266918 0.04248768 7.1948631,
  1.9870979 0.15711319 7.039077,1.8511576 0.13982444 7.1248719,
  1.7261639 0.081824244 7.1631199,1.9464049 0.15418647 7.0258551,
  1.8228116 0.11509228 7.1042773,1.7161208 0.04248768 7.1492968,
  1.9079719 0.13982444 7.0133674,1.8009151 0.081824244 7.0883686,
  1.8746493 0.11509228 7.0025402,1.7870921 0.04248768 7.0783255,
  1.8489084 0.081824244 6.9941765,1.8326584 0.04248768 6.9888966] }
 coordIndex [
  125,118,121,-1,126,119,122,-1,126,123,119,-1,127,36,123,-1,127,34,35,-1,127,35,36,-1,128,124,21,-1,128,117,124,-1,
  128,21,22,-1,128,121,117,-1,129,118,125,-1,129,122,118,-1,130,123,126,-1,130,127,123,-1,131,30,29,-1,131,31,30,-1,
  131,29,34,-1,131,34,127,-1,132,128,22,-1,132,22,23,-1,132,23,24,-1,132,121,128,-1,132,125,121,-1,133,126,122,-1,
  133,130,126,-1,133,122,129,-1,134,131,127,-1,134,127,130,-1,135,132,24,-1,135,125,132,-1,135,129,125,-1,136,130,133,-1,
  137,31,131,-1,137,131,134,-1,138,24,25,-1,138,25,26,-1,138,133,129,-1,138,135,24,-1,138,129,135,-1,139,130,136,-1,
  139,134,130,-1,140,26,27,-1,140,138,26,-1,140,133,138,-1,140,136,133,-1,141,31,137,-1,141,32,31,-1,141,134,139,-1,
  141,137,134,-1,142,139,136,-1,142,140,27,-1,142,136,140,-1,143,27,28,-1,143,33,32,-1,143,32,141,-1,143,142,27,-1,
  143,139,142,-1,143,141,139,-1,143,28,33,-1,6,33,28,-1,56,0,2,-1,56,2,3,-1,56,55,0,-1,57,55,56,-1,
  57,54,55,-1,58,57,56,-1,58,56,3,-1,59,54,57,-1,59,53,54,-1,60,59,57,-1,60,57,58,-1,61,52,53,-1,
  61,53,59,-1,62,3,4,-1,62,58,3,-1,63,61,59,-1,63,59,60,-1,64,51,52,-1,64,52,61,-1,65,63,60,-1,
  65,58,62,-1,65,60,58,-1,66,64,61,-1,66,61,63,-1,67,50,51,-1,67,51,64,-1,68,4,5,-1,68,5,1,-1,
  68,1,7,-1,68,62,4,-1,69,63,65,-1,70,64,66,-1,70,67,64,-1,71,48,49,-1,71,49,50,-1,71,50,67,-1,
  72,7,8,-1,72,8,9,-1,72,68,7,-1,72,65,62,-1,72,62,68,-1,73,63,69,-1,73,70,66,-1,73,66,63,-1,
  74,71,67,-1,74,67,70,-1,75,48,71,-1,76,65,72,-1,76,69,65,-1,76,72,9,-1,77,70,73,-1,77,74,70,-1,
  78,75,71,-1,78,71,74,-1,79,48,75,-1,79,47,48,-1,80,9,10,-1,80,69,76,-1,80,76,9,-1,80,73,69,-1,
  81,74,77,-1,82,75,78,-1,82,79,75,-1,83,46,47,-1,83,47,79,-1,84,10,11,-1,84,80,10,-1,84,77,73,-1,
  84,73,80,-1,85,74,81,-1,85,78,74,-1,86,79,82,-1,86,83,79,-1,87,46,83,-1,87,45,46,-1,88,11,12,-1,
  88,84,11,-1,88,81,77,-1,88,77,84,-1,89,82,78,-1,89,78,85,-1,90,83,86,-1,90,87,83,-1,91,45,87,-1,
  91,44,45,-1,92,81,88,-1,92,12,13,-1,92,13,14,-1,92,88,12,-1,92,85,81,-1,93,82,89,-1,93,86,82,-1,
  94,91,87,-1,94,87,90,-1,95,44,91,-1,95,43,44,-1,96,85,92,-1,96,89,85,-1,96,92,14,-1,97,86,93,-1,
  97,90,86,-1,98,91,94,-1,98,95,91,-1,99,43,95,-1,99,42,43,-1,100,89,96,-1,100,93,89,-1,100,14,15,-1,
  100,15,16,-1,100,96,14,-1,101,94,90,-1,101,90,97,-1,102,95,98,-1,102,99,95,-1,103,42,99,-1,103,41,42,-1,
  104,16,17,-1,104,93,100,-1,104,97,93,-1,104,100,16,-1,105,98,94,-1,105,94,101,-1,106,99,102,-1,106,103,99,-1,
  107,40,41,-1,107,41,103,-1,108,17,18,-1,108,101,97,-1,108,97,104,-1,108,104,17,-1,109,98,105,-1,109,102,98,-1,
  110,103,106,-1,110,107,103,-1,111,39,40,-1,111,40,107,-1,112,108,18,-1,112,105,101,-1,112,101,108,-1,113,106,102,-1,
  113,102,109,-1,114,107,110,-1,114,111,107,-1,115,38,39,-1,115,39,111,-1,116,18,19,-1,116,109,105,-1,116,112,18,-1,
  116,105,112,-1,117,110,106,-1,117,106,113,-1,118,111,114,-1,118,115,111,-1,119,37,38,-1,119,38,115,-1,120,19,20,-1,
  120,20,21,-1,120,116,19,-1,120,109,116,-1,120,113,109,-1,121,110,117,-1,121,114,110,-1,121,118,114,-1,122,115,118,-1,
  122,119,115,-1,123,36,37,-1,123,37,119,-1,124,113,120,-1,124,120,21,-1,124,117,113,-1]
  normalPerVertex TRUE
  normal DEF NORM_15 Normal { vector [
  -0.1550126 -0.13452073 -0.97871102,-0.97871102 -0.13452073 -0.1550126,
  -0.30613879 -0.13616665 -0.94219832,-0.58231059 -0.13616665 -0.80148177,
  -0.83143788 -0.1359762 -0.53872213,-0.94219832 -0.13616665 -0.30613879,
  -0.97871102 0.13452073 -0.1550126,-0.93851532 -0.31159797 -0.14864622,
  -0.84670162 -0.51489066 -0.13410436,-0.67441085 -0.73058901 -0.10681619,
  -0.41533849 -0.90728525 -0.065783154,-0.15555284 -0.98752029 -0.02463715,
  0.11636881 -0.99303504 0.018431009,0.33440956 -0.94093832 0.052965271,
  0.57771175 -0.81109604 0.091500552,0.76992217 -0.62637815 0.12194369,
  0.88954373 -0.43458256 0.14088989,0.97179813 -0.17865537 0.1539177,
  0.97879427 0.13389838 0.15502578,0.88954373 0.43458256 0.14088989,
  0.76992217 0.62637815 0.12194369,0.57771175 0.81109604 0.091500552,
  0.29348051 0.9548343 0.046482746,0.068238428 0.9976105 0.010807905,
  -0.19700881 0.97990504 -0.03120313,-0.45884849 0.8855374 -0.072674462,
  -0.64286971 0.75917792 -0.10182056,-0.84443954 0.51868473 -0.13374608,
  -0.96273884 0.22334481 -0.15248285,-0.1550126 0.13452073 -0.97871102,
  -0.30613879 0.13616665 -0.94219832,-0.58231059 0.13616665 -0.80148177,
  -0.83143788 0.1359762 -0.53872213,-0.9572187 0.1359762 -0.25542675,
  -0.14864622 0.31159797 -0.93851532,-0.13410436 0.51489066 -0.84670162,
  -0.11231815 0.69605497 -0.70914886,-0.078605459 0.86458783 -0.49629533,
  -0.038815599 0.96872754 -0.24507205,0.0040056175 0.99967212 0.025290474,
  0.046482746 0.9548343 0.29348051,0.085288602 0.8383038 0.53849104,
  0.11750971 0.66010277 0.74192709,0.14088989 0.43458256 0.88954373,
  0.1539177 0.17865537 0.97179813,0.15580561 -0.089575201 0.98371789,
  0.14644373 -0.35164171 0.92460929,0.12639097 -0.58925333 0.79800115,
  0.091500552 -0.81109604 0.57771175,0.052965271 -0.94093832 0.33440956,
  0.018431009 -0.99303504 0.11636881,-0.02463715 -0.98752029 -0.15555284,
  -0.065783154 -0.90728525 -0.41533849,-0.10182056 -0.75917792 -0.64286971,
  -0.13009293 -0.55535558 -0.82137446,-0.14864622 -0.31159797 -0.93851532,
  -0.30102279 -0.22598748 -0.92645288,-0.27086905 -0.48130964 -0.8336492,
  -0.55784285 -0.31509858 -0.76780482,-0.22053453 -0.70048745 -0.67873548,
  -0.47159333 -0.54413146 -0.69391692,-0.1538397 -0.86727134 -0.47346992,
  -0.77855756 -0.27136365 -0.56587091,-0.40356877 -0.74720391 -0.52803273,
  -0.075788543 -0.96945813 -0.23325315,-0.66957865 -0.53933244 -0.51067108,
  -0.24546322 -0.90107745 -0.35750137,0.0078152489 -0.99968014 0.024052863,
  -0.92645288 -0.22598748 -0.30102279,-0.54602817 -0.75053753 -0.37221856,
  -0.12203482 -0.97993636 -0.15758245,0.088170215 -0.94719998 0.30828269,
  -0.8262409 -0.50564755 -0.24828721,-0.34722154 -0.89900607 -0.26688067,
  0.0533208 -0.99569813 0.075776817,0.18478782 -0.83159235 0.52374385,
  -0.65950075 -0.71277161 -0.23877894,-0.1258831 -0.98782013 -0.091459428,
  0.22315307 -0.92512992 0.30714385,0.23086759 -0.66470805 0.71053738,
  -0.47346992 -0.86727134 -0.1538397,0.082960288 -0.99521154 0.051687428,
  0.36135914 -0.78869796 0.49736818,0.27765365 -0.43896107 0.85453006,
  -0.23325315 -0.96945813 -0.075788543,0.27838015 -0.94105273 0.19215684,
  0.47284529 -0.59401705 0.6508157,0.30392379 -0.18080996 0.93538125,
  0.024052863 -0.99968014 0.0078152489,0.4729735 -0.81531046 0.33401335,
  0.54939473 -0.35547408 0.75617697,0.3077438 0.090682641 0.94713801,
  0.30828269 -0.94719998 0.088170215,0.63237314 -0.62946693 0.45152586,
  0.58536348 -0.090682641 0.80568372,0.2888339 0.35547408 0.88893934,
  0.52374385 -0.83159235 0.18478782,0.74491142 -0.39724082 0.53600998,
  0.57809741 0.18080996 0.79568282,0.24858948 0.59401705 0.76507974,
  0.73360363 -0.64404305 0.21687385,0.80238853 -0.13574737 0.58115858,
  0.52812862 0.43896107 0.72690669,0.18997774 0.78869796 0.58469136,
  0.87408906 -0.39724082 0.2795855,0.80066635 0.13574737 0.58352896,
  0.43913625 0.66470805 0.6044192,0.11731851 0.92512992 0.36106925,
  0.94270472 -0.13574737 0.30476296,0.73996607 0.39724082 0.54281667,
  0.31767461 0.8413695 0.43724158,0.03596605 0.99320375 0.11069212,
  0.93504662 0.1088366 0.33740541,0.62484065 0.62946693 0.46189343,
  0.1776192 0.95053666 0.25481654,-0.048083067 0.98782013 -0.14798446,
  0.88893934 0.35547408 0.2888339,0.46382242 0.81531046 0.34660873,
  0.035661756 0.99854777 0.04038055,-0.12862526 0.90925474 -0.39586785,
  0.75527593 0.61375056 0.22993156,0.25253522 0.94719998 0.19758079,
  -0.14415838 0.96945813 -0.19841698,-0.19969553 0.76314415 -0.61459963,
  0.56333561 0.79988249 0.20698066,0.03342088 0.99908242 0.026783496,
  -0.26976147 0.87572672 -0.40041411,-0.24153558 0.53933244 -0.80671003,
  0.36106925 0.92512992 0.11731851,-0.16475767 0.97993636 -0.11215898,
  -0.41929178 0.72047543 -0.55236723,-0.31984986 0.25252506 -0.91319612,
  0.087677929 0.99569813 0.029963553,-0.37746275 0.88115415 -0.28476172,
  -0.51522354 0.48130964 -0.70914437,-0.16515105 0.98466983 -0.05612899,
  -0.58082104 0.71277161 -0.39319658,-0.56598858 0.26979677 -0.77901645,
  -0.4200027 0.89900607 -0.12403961,-0.69049841 0.5221265 -0.5005955,
  -0.64714707 0.73347957 -0.20786629,-0.74748751 0.27100648 -0.60647994,
  -0.78940115 0.54413146 -0.28419497,-0.90298167 0.29065813 -0.31645214] }
}
}
DEF SHAPE_16 Shape {
 appearance USE APP_2
 geometry DEF FACE_16 IndexedFaceSet {
  coord DEF COORD_16 Coordinate { point [
  1.8425197 0 6.8897638,1.8425197 0 -1.1811024,
  1.8425197 0 -1.1811024,1.8483595 0.04248768 -1.1811024,
  1.8654458 0.081824244 -1.1811024,1.8925113 0.11509228 -1.1811024,
  1.9275488 0.13982444 -1.1811024,1.9679597 0.15418647 -1.1811024,
  2.0107468 0.15711319 -1.1811024,2.0527369 0.14838755 -1.1811024,
  2.0908158 0.12865668 -1.1811024,2.1221593 0.099383928 -1.1811024,
  2.1444427 0.062740329 -1.1811024,2.1560135 0.021443567 -1.1811024,
  2.1560135 -0.021443567 -1.1811024,2.1444427 -0.062740329 -1.1811024,
  2.1221593 -0.099383928 -1.1811024,2.0908158 -0.12865668 -1.1811024,
  2.0527369 -0.14838755 -1.1811024,2.0107468 -0.15711319 -1.1811024,
  1.9679597 -0.15418647 -1.1811024,1.9275488 -0.13982444 -1.1811024,
  1.8925113 -0.11509228 -1.1811024,1.8654458 -0.081824244 -1.1811024,
  1.8483595 -0.04248768 -1.1811024,1.8425197 0 6.8897638,
  1.8483595 -0.04248768 6.8897638,1.8654458 -0.081824244 6.8897638,
  1.8925113 -0.11509228 6.8897638,1.9275488 -0.13982444 6.8897638,
  1.9679597 -0.15418647 6.8897638,2.0107468 -0.15711319 6.8897638,
  2.0527369 -0.14838755 6.8897638,2.0908158 -0.12865668 6.8897638,
  2.1221593 -0.099383928 6.8897638,2.1444427 -0.062740329 6.8897638,
  2.1560135 -0.021443567 6.8897638,2.1560135 0.021443567 6.8897638,
  2.1444427 0.062740329 6.8897638,2.1221593 0.099383928 6.8897638,
  2.0908158 0.12865668 6.8897638,2.0527369 0.14838755 6.8897638,
  2.0107468 0.15711319 6.8897638,1.9679597 0.15418647 6.8897638,
  1.9275488 0.13982444 6.8897638,1.8925113 0.11509228 6.8897638,
  1.8654458 0.081824244 6.8897638,1.8483595 0.04248768 6.8897638] }
 coordIndex [
  21,30,29,-1,22,21,29,-1,22,29,28,-1,2,25,47,-1,23,28,27,-1,23,22,28,-1,3,47,46,-1,3,2,47,-1,
  24,27,26,-1,24,23,27,-1,4,3,46,-1,1,26,0,-1,1,24,26,-1,5,46,45,-1,5,4,46,-1,6,45,44,-1,
  6,5,45,-1,7,44,43,-1,7,6,44,-1,8,43,42,-1,8,7,43,-1,9,42,41,-1,9,8,42,-1,10,41,40,-1,
  10,9,41,-1,11,40,39,-1,11,10,40,-1,12,39,38,-1,12,11,39,-1,13,38,37,-1,13,12,38,-1,14,37,36,-1,
  14,13,37,-1,15,14,36,-1,15,36,35,-1,16,15,35,-1,16,35,34,-1,17,16,34,-1,17,34,33,-1,18,17,33,-1,
  18,33,32,-1,19,18,32,-1,19,32,31,-1,20,19,31,-1,20,31,30,-1,21,20,30,-1]
  normalPerVertex TRUE
  normal DEF NORM_16 Normal { vector [
  -0.99068595 -0.13616665 0,-0.99068595 -0.13616665 0,
  -0.99068595 0.13616665 0,-0.94956031 0.31358447 0,
  -0.8544194 0.51958395 0,-0.71528652 0.69883131 0,
  -0.50021932 0.86589874 0,-0.24805315 0.96874643 0,
  0.022509995 0.99974662 0,0.29140367 0.95660018 0,
  0.53868527 0.84250708 0,0.74601505 0.66592908 0,
  0.89801631 0.43996217 0,0.9834158 0.18136528 0,
  0.99587984 -0.090682641 0,0.93448403 -0.35600505 0,
  0.80378182 -0.59492419 0,0.61346678 -0.78972053 0,
  0.37765372 -0.9259469 0,0.11383181 -0.99350003 0,
  -0.15843248 -0.98736981 0,-0.41894656 -0.90801089 0,
  -0.6483893 -0.76130895 0,-0.82974396 -0.55814421 0,
  -0.94956031 -0.31358447 0,-0.99068595 0.13616665 0,
  -0.97425621 -0.22544364 0,-0.87730418 -0.47993476 0,
  -0.71528652 -0.69883131 0,-0.50021932 -0.86589874 0,
  -0.24805315 -0.96874643 0,0.022509995 -0.99974662 0,
  0.29140367 -0.95660018 0,0.53868527 -0.84250708 0,
  0.74601505 -0.66592908 0,0.89801631 -0.43996217 0,
  0.9834158 -0.18136528 0,0.99587984 0.090682641 0,
  0.93448403 0.35600505 0,0.80378182 0.59492419 0,
  0.61346678 0.78972053 0,0.37765372 0.9259469 0,
  0.11383181 0.99350003 0,-0.15843248 0.98736981 0,
  -0.41894656 0.90801089 0,-0.6483893 0.76130895 0,
  -0.8544194 0.51958395 0,-0.97425621 0.22544364 0] }
}
}
DEF SHAPE_17 Shape {
 appearance USE APP_2
 geometry DEF FACE_17 IndexedFaceSet {
  coord DEF COORD_17 Coordinate { point [
  1.8425197 0 -1.1811024,1.8483595 0.04248768 -1.1811024,
  1.8654458 0.081824244 -1.1811024,1.8925113 0.11509228 -1.1811024,
  1.9275488 0.13982444 -1.1811024,1.9679597 0.15418647 -1.1811024,
  2.0107468 0.15711319 -1.1811024,2.0527369 0.14838755 -1.1811024,
  2.0908158 0.12865668 -1.1811024,2.1221593 0.099383928 -1.1811024,
  2.1444427 0.062740329 -1.1811024,2.1560135 0.021443567 -1.1811024,
  2.1560135 -0.021443567 -1.1811024,2.1444427 -0.062740329 -1.1811024,
  2.1221593 -0.099383928 -1.1811024,2.0908158 -0.12865668 -1.1811024,
  2.0527369 -0.14838755 -1.1811024,2.0107468 -0.15711319 -1.1811024,
  1.9679597 -0.15418647 -1.1811024,1.9275488 -0.13982444 -1.1811024,
  1.8925113 -0.11509228 -1.1811024,1.8654458 -0.081824244 -1.1811024,
  1.8483595 -0.04248768 -1.1811024] }
 coordIndex [
  19,20,21,-1,18,19,21,-1,16,17,18,-1,16,18,21,-1,14,15,16,-1,5,2,3,-1,5,3,4,-1,12,13,14,-1,
  12,21,22,-1,12,22,0,-1,12,16,21,-1,12,14,16,-1,6,1,2,-1,6,2,5,-1,10,0,1,-1,10,11,12,-1,
  10,12,0,-1,8,6,7,-1,8,1,6,-1,9,1,8,-1,9,10,1,-1]
  normalPerVertex TRUE
  normal DEF NORM_17 Normal { vector [
  0 0 -1,0 0 -1,
  0 0 -1,0 0 -1,
  0 0 -1,0 0 -1,
  0 0 -1,0 0 -1,
  0 0 -1,0 0 -1,
  0 0 -1,0 0 -1,
  0 0 -1,0 0 -1,
  0 0 -1,0 0 -1,
  0 0 -1,0 0 -1,
  0 0 -1,0 0 -1,
  0 0 -1,0 0 -1,
  0 0 -1] }
}
}
] }
] }
