# BEGIN PLOT
XTwosidedTicks=1
YTwosidedTicks=1
Title=$Z \rightarrow \ell^+ \ell^-$, dressed level
RatioPlotReference=/ATLAS_2017_I1514251/d21-x01-y01
RatioPlot=1
LogY=1
LegendOnly=/ATLAS_2017_I1514251/d21-x01-y01 //Users/geon/Documents/mcNet/ucl2019/mcnet-tutorial-material/02-TruthLevelAnalysisUsingRivet/output_multiweights_full_band.yoda/ATLAS_2017_I1514251/d21-x01-y01 //Users/geon/Documents/mcNet/ucl2019/mcnet-tutorial-material/02-TruthLevelAnalysisUsingRivet/output_multiweights_stat_MEonly.yoda/ATLAS_2017_I1514251/d21-x01-y01 //Users/geon/Documents/mcNet/ucl2019/mcnet-tutorial-material/02-TruthLevelAnalysisUsingRivet/output_multiweights_stat_only.yoda/ATLAS_2017_I1514251/d21-x01-y01
XLabel=$p_\text{T}^\text{jet}$ (leading jet, $\ge$ 3 jet) [GeV]
LegendAlign=r
XMinorTickMarks=0
YLabel=d$\sigma/$d$p_\text{T}^\text{jet}$ [pb/GeV]
DrawOnly=/ATLAS_2017_I1514251/d21-x01-y01 //Users/geon/Documents/mcNet/ucl2019/mcnet-tutorial-material/02-TruthLevelAnalysisUsingRivet/output_multiweights_full_band.yoda/ATLAS_2017_I1514251/d21-x01-y01 //Users/geon/Documents/mcNet/ucl2019/mcnet-tutorial-material/02-TruthLevelAnalysisUsingRivet/output_multiweights_stat_MEonly.yoda/ATLAS_2017_I1514251/d21-x01-y01 //Users/geon/Documents/mcNet/ucl2019/mcnet-tutorial-material/02-TruthLevelAnalysisUsingRivet/output_multiweights_stat_only.yoda/ATLAS_2017_I1514251/d21-x01-y01
Legend=1
LeftMargin=1.5
# END PLOT

# BEGIN HISTO1D /ATLAS_2017_I1514251/d21-x01-y01
ConnectBins=0
ErrorBars=1
IsRef=1
Path=/ATLAS_2017_I1514251/d21-x01-y01
PolyMarker=*
Title=Data
# xlow	 xhigh	 val	 errminus	 errplus
3.000000e+01	5.000000e+01	2.810000e-02	7.111259e-03	7.111259e-03
5.000000e+01	7.000000e+01	5.570000e-02	1.005684e-02	1.005684e-02
7.000000e+01	9.000000e+01	5.240000e-02	6.911584e-03	6.911584e-03
9.000000e+01	1.100000e+02	4.300000e-02	4.929503e-03	4.929503e-03
1.100000e+02	1.300000e+02	3.150000e-02	3.303029e-03	3.303029e-03
1.300000e+02	1.500000e+02	2.310000e-02	2.211334e-03	2.211334e-03
1.500000e+02	1.700000e+02	1.720000e-02	1.486607e-03	1.486607e-03
1.700000e+02	2.000000e+02	1.273000e-02	1.116557e-03	1.116557e-03
2.000000e+02	2.500000e+02	7.490000e-03	6.337981e-04	6.337981e-04
2.500000e+02	3.000000e+02	4.070000e-03	3.580503e-04	3.580503e-04
3.000000e+02	3.500000e+02	2.040000e-03	2.184033e-04	2.184033e-04
3.500000e+02	4.000000e+02	1.220000e-03	1.461301e-04	1.461301e-04
4.000000e+02	5.000000e+02	5.610000e-04	7.220111e-05	7.220111e-05
# END HISTO1D


# BEGIN HISTO1D //Users/geon/Documents/mcNet/ucl2019/mcnet-tutorial-material/02-TruthLevelAnalysisUsingRivet/output_multiweights_full_band.yoda/ATLAS_2017_I1514251/d21-x01-y01
ErrorBandColor=blue!30!white
ErrorBandOpacity=0.5
ErrorBands=1
ErrorBars=0
LineColor=blue!30!white
LineStyle=solid
Path=//Users/geon/Documents/mcNet/ucl2019/mcnet-tutorial-material/02-TruthLevelAnalysisUsingRivet/output_multiweights_full_band.yoda/ATLAS_2017_I1514251/d21-x01-y01
RatioPlotSameStyle=1
Title=ME+PS scales $\oplus$ stats
# xlow	 xhigh	 val	 errminus	 errplus
3.000000e+01	5.000000e+01	2.019034e-02	2.407098e-02	2.056542e-02
5.000000e+01	7.000000e+01	2.732967e-02	1.156607e-02	1.631193e-02
7.000000e+01	9.000000e+01	2.056430e-02	2.166783e-02	1.629175e-02
9.000000e+01	1.100000e+02	1.016126e-02	4.648428e-03	6.222900e-03
1.100000e+02	1.300000e+02	4.957989e-03	2.470672e-03	2.944449e-03
1.300000e+02	1.500000e+02	4.846363e-03	3.751291e-03	4.392356e-03
1.500000e+02	1.700000e+02	1.079669e-02	6.276275e-03	5.871042e-03
1.700000e+02	2.000000e+02	4.305537e-03	2.435057e-03	2.660032e-03
2.000000e+02	2.500000e+02	2.872898e-03	1.174068e-03	1.762410e-03
2.500000e+02	3.000000e+02	5.394518e-03	5.413234e-03	4.237661e-03
3.000000e+02	3.500000e+02	2.317216e-03	1.703296e-03	1.597577e-03
3.500000e+02	4.000000e+02	2.611754e-04	2.776705e-04	2.619217e-04
4.000000e+02	5.000000e+02	1.307273e-04	1.105016e-04	1.037039e-04
# END HISTO1D


# BEGIN HISTO1D //Users/geon/Documents/mcNet/ucl2019/mcnet-tutorial-material/02-TruthLevelAnalysisUsingRivet/output_multiweights_stat_MEonly.yoda/ATLAS_2017_I1514251/d21-x01-y01
ErrorBandColor=blue!60!white
ErrorBandOpacity=0.5
ErrorBands=1
ErrorBars=0
LineColor=blue!60!white
LineStyle=solid
Path=//Users/geon/Documents/mcNet/ucl2019/mcnet-tutorial-material/02-TruthLevelAnalysisUsingRivet/output_multiweights_stat_MEonly.yoda/ATLAS_2017_I1514251/d21-x01-y01
RatioPlotSameStyle=1
Title=ME scales $\oplus$ stats
# xlow	 xhigh	 val	 errminus	 errplus
3.000000e+01	5.000000e+01	2.019034e-02	2.028495e-02	2.019333e-02
5.000000e+01	7.000000e+01	2.732967e-02	1.116518e-02	1.136945e-02
7.000000e+01	9.000000e+01	2.056430e-02	1.642939e-02	1.651289e-02
9.000000e+01	1.100000e+02	1.016126e-02	4.376179e-03	4.442753e-03
1.100000e+02	1.300000e+02	4.957989e-03	2.515355e-03	2.541777e-03
1.300000e+02	1.500000e+02	4.846363e-03	3.564115e-03	3.581262e-03
1.500000e+02	1.700000e+02	1.079669e-02	5.834730e-03	5.887943e-03
1.700000e+02	2.000000e+02	4.305537e-03	2.310966e-03	2.329999e-03
2.000000e+02	2.500000e+02	2.872898e-03	1.209278e-03	1.226342e-03
2.500000e+02	3.000000e+02	5.394518e-03	4.263646e-03	4.280081e-03
3.000000e+02	3.500000e+02	2.317216e-03	1.608514e-03	1.616075e-03
3.500000e+02	4.000000e+02	2.611754e-04	2.625994e-04	2.634295e-04
4.000000e+02	5.000000e+02	1.307273e-04	1.048134e-04	1.054924e-04
# END HISTO1D


# BEGIN HISTO1D //Users/geon/Documents/mcNet/ucl2019/mcnet-tutorial-material/02-TruthLevelAnalysisUsingRivet/output_multiweights_stat_only.yoda/ATLAS_2017_I1514251/d21-x01-y01
ErrorBandColor=blue!90!white
ErrorBandOpacity=0.5
ErrorBandStyle=hlines
ErrorBands=1
ErrorBars=0
LineColor=blue!90!white
LineStyle=solid
Path=//Users/geon/Documents/mcNet/ucl2019/mcnet-tutorial-material/02-TruthLevelAnalysisUsingRivet/output_multiweights_stat_only.yoda/ATLAS_2017_I1514251/d21-x01-y01
RatioPlotSameStyle=1
Title=stats only
# xlow	 xhigh	 val	 errminus	 errplus
3.000000e+01	5.000000e+01	2.019034e-02	1.998513e-02	1.998513e-02
5.000000e+01	7.000000e+01	2.732967e-02	1.082561e-02	1.082561e-02
7.000000e+01	9.000000e+01	2.056430e-02	1.629175e-02	1.629175e-02
9.000000e+01	1.100000e+02	1.016126e-02	4.262358e-03	4.262358e-03
1.100000e+02	1.300000e+02	4.957989e-03	2.470672e-03	2.470672e-03
1.300000e+02	1.500000e+02	4.846363e-03	3.528608e-03	3.528608e-03
1.500000e+02	1.700000e+02	1.079669e-02	5.747856e-03	5.747856e-03
1.700000e+02	2.000000e+02	4.305537e-03	2.274740e-03	2.274740e-03
2.000000e+02	2.500000e+02	2.872898e-03	1.174068e-03	1.174068e-03
2.500000e+02	3.000000e+02	5.394518e-03	4.237661e-03	4.237661e-03
3.000000e+02	3.500000e+02	2.317216e-03	1.594062e-03	1.594062e-03
3.500000e+02	4.000000e+02	2.611754e-04	2.611380e-04	2.611380e-04
4.000000e+02	5.000000e+02	1.307273e-04	1.036304e-04	1.036304e-04
# END HISTO1D

