>>>>>>>>>>>>>>>>>>>>>>>>>>>>>>>>>>>>>>>>>>>>>>>>>>>>>>>>>>>>>>>>>>>>>>>>>>>>>>
>>>> Toolkit for HEP Event Generation - ThePEG 2.1.5 <<<<<<<<<<<<<<<<<<<<<<<<<
>>>> Tue Jul 30 15:52:40 2019                                             <<<<
<<<<<<<<<<<<<<<<<<<<<<<<<<<<<<<<<<<<<<<<<<<<<<<<<<<<<<<<<<<<<<<<<<<<<<<<<<<<<<

>> Herwig 7.1.5 / ThePEG 2.1.5

==============================================================================
Statistics for event handler 'EventHandler':
                                       generated    number of    Cross-section
                                          events     attempts             (nb)
==============================================================================
Total (from attempted events): including vetoed events            2.21(8)e-03
==============================================================================
Total (from generated events):              200          200      2.21(8)e-03
Events carry unit weights.
==============================================================================
Per matrix element breakdown:
MEubarg2Y1ubar                                 0            0                0
MEdbarg2Y1dbar                                 1            1       10(10)e-06
MEdubar2Y1W-                                   1            1       10(10)e-06
MEddbar2XmXm                                   0            0                0
MEddbar2Y1g                                   32           32      0.35(6)e-03
MEddbar2Y1gamma                                1            1       10(10)e-06
MEddbar2Y1Z0                                   0            0                0
MEddbar2Y1Y1                                   0            0                0
MEdg2Y1d                                       4            4       40(20)e-06
MEuubar2XmXm                                   0            0                0
MEuubar2Y1g                                   74           74      0.82(8)e-03
MEuubar2Y1gamma                                0            0                0
MEuubar2Y1Z0                                   0            0                0
MEuubar2Y1Y1                                   0            0                0
MEudbar2Y1W+                                   0            0                0
MEug2Y1u                                       9            9      0.10(3)e-03
MEddbar2Y12ddbar                              13           13      0.14(4)e-03
MEddbar2Y12uubar                              12           12      0.13(4)e-03
MEuubar2Y12ddbar                              35           35      0.39(6)e-03
MEuubar2Y12uubar                              18           18      0.20(5)e-03
==============================================================================
Per parton extractor breakdown:
PPExtractor                                  200          200      2.21(8)e-03
==============================================================================
Per incoming partons breakdown:
d dbar                                        30           30      0.33(6)e-03
d ubar                                         0            0                0
d g                                            3            3       30(20)e-06
dbar d                                        28           28      0.31(6)e-03
dbar u                                         0            0                0
dbar g                                         0            0                0
ubar d                                         1            1       10(10)e-06
ubar u                                        60           60      0.66(8)e-03
ubar g                                         0            0                0
u dbar                                         0            0                0
u ubar                                        67           67      0.74(8)e-03
u g                                            5            5       60(20)e-06
g d                                            1            1       10(10)e-06
g dbar                                         1            1       10(10)e-06
g ubar                                         0            0                0
g u                                            4            4       40(20)e-06
==============================================================================
Detailed breakdown:
(PPExtractor) ubar d (MEdubar2Y1W- d,ubar->Y1,W-) 
                                               1            1       10(10)e-06
(PPExtractor) ubar u (MEuubar2XmXm u,ubar->Xm,Xm) 
                                               0            0                0
(PPExtractor) ubar u (MEuubar2Y1g u,ubar->Y1,g) 
                                              34           34      0.38(6)e-03
(PPExtractor) ubar u (MEuubar2Y1gamma u,ubar->Y1,gamma) 
                                               0            0                0
(PPExtractor) ubar u (MEuubar2Y1Z0 u,ubar->Y1,Z0) 
                                               0            0                0
(PPExtractor) ubar u (MEuubar2Y1Y1 u,ubar->Y1,Y1) 
                                               0            0                0
(PPExtractor) ubar u (MEuubar2Y12ddbar u,ubar->d,dbar) 
                                              17           17      0.19(4)e-03
(PPExtractor) ubar u (MEuubar2Y12uubar u,ubar->u,ubar) 
                                               9            9      0.10(3)e-03
(PPExtractor) ubar g (MEubarg2Y1ubar ubar,g->Y1,ubar) 
                                               0            0                0
(PPExtractor) dbar d (MEddbar2XmXm d,dbar->Xm,Xm) 
                                               0            0                0
(PPExtractor) dbar d (MEddbar2Y1g d,dbar->Y1,g) 
                                              14           14      0.15(4)e-03
(PPExtractor) dbar d (MEddbar2Y1gamma d,dbar->Y1,gamma) 
                                               1            1       10(10)e-06
(PPExtractor) dbar d (MEddbar2Y1Z0 d,dbar->Y1,Z0) 
                                               0            0                0
(PPExtractor) dbar d (MEddbar2Y1Y1 d,dbar->Y1,Y1) 
                                               0            0                0
(PPExtractor) dbar d (MEddbar2Y12ddbar d,dbar->d,dbar) 
                                               6            6       70(30)e-06
(PPExtractor) dbar d (MEddbar2Y12uubar d,dbar->u,ubar) 
                                               7            7       80(30)e-06
(PPExtractor) dbar u (MEudbar2Y1W+ u,dbar->Y1,W+) 
                                               0            0                0
(PPExtractor) dbar g (MEdbarg2Y1dbar dbar,g->Y1,dbar) 
                                               0            0                0
(PPExtractor) d ubar (MEdubar2Y1W- d,ubar->Y1,W-) 
                                               0            0                0
(PPExtractor) d dbar (MEddbar2XmXm d,dbar->Xm,Xm) 
                                               0            0                0
(PPExtractor) d dbar (MEddbar2Y1g d,dbar->Y1,g) 
                                              18           18      0.20(5)e-03
(PPExtractor) d dbar (MEddbar2Y1gamma d,dbar->Y1,gamma) 
                                               0            0                0
(PPExtractor) d dbar (MEddbar2Y1Z0 d,dbar->Y1,Z0) 
                                               0            0                0
(PPExtractor) d dbar (MEddbar2Y1Y1 d,dbar->Y1,Y1) 
                                               0            0                0
(PPExtractor) d dbar (MEddbar2Y12ddbar d,dbar->d,dbar) 
                                               7            7       80(30)e-06
(PPExtractor) d dbar (MEddbar2Y12uubar d,dbar->u,ubar) 
                                               5            5       60(20)e-06
(PPExtractor) d g (MEdg2Y1d d,g->Y1,d) 
                                               3            3       30(20)e-06
(PPExtractor) u ubar (MEuubar2XmXm u,ubar->Xm,Xm) 
                                               0            0                0
(PPExtractor) u ubar (MEuubar2Y1g u,ubar->Y1,g) 
                                              40           40      0.44(6)e-03
(PPExtractor) u ubar (MEuubar2Y1gamma u,ubar->Y1,gamma) 
                                               0            0                0
(PPExtractor) u ubar (MEuubar2Y1Z0 u,ubar->Y1,Z0) 
                                               0            0                0
(PPExtractor) u ubar (MEuubar2Y1Y1 u,ubar->Y1,Y1) 
                                               0            0                0
(PPExtractor) u ubar (MEuubar2Y12ddbar u,ubar->d,dbar) 
                                              18           18      0.20(5)e-03
(PPExtractor) u ubar (MEuubar2Y12uubar u,ubar->u,ubar) 
                                               9            9      0.10(3)e-03
(PPExtractor) u dbar (MEudbar2Y1W+ u,dbar->Y1,W+) 
                                               0            0                0
(PPExtractor) u g (MEug2Y1u u,g->Y1,u) 
                                               5            5       60(20)e-06
(PPExtractor) g ubar (MEubarg2Y1ubar ubar,g->Y1,ubar) 
                                               0            0                0
(PPExtractor) g dbar (MEdbarg2Y1dbar dbar,g->Y1,dbar) 
                                               1            1       10(10)e-06
(PPExtractor) g d (MEdg2Y1d d,g->Y1,d) 
                                               1            1       10(10)e-06
(PPExtractor) g u (MEug2Y1u u,g->Y1,u) 
                                               4            4       40(20)e-06
==============================================================================
