>>>>>>>>>>>>>>>>>>>>>>>>>>>>>>>>>>>>>>>>>>>>>>>>>>>>>>>>>>>>>>>>>>>>>>>>>>>>>>
>>>> Toolkit for HEP Event Generation - ThePEG 2.1.5 <<<<<<<<<<<<<<<<<<<<<<<<<
>>>> Tue Jul 30 15:47:05 2019                                             <<<<
<<<<<<<<<<<<<<<<<<<<<<<<<<<<<<<<<<<<<<<<<<<<<<<<<<<<<<<<<<<<<<<<<<<<<<<<<<<<<<

>> Herwig 7.1.5 / ThePEG 2.1.5

==============================================================================
Statistics for event handler 'EventHandler':
                                       generated    number of    Cross-section
                                          events     attempts             (nb)
==============================================================================
Total (from attempted events): including vetoed events           0.158(6)e+03
==============================================================================
Total (from generated events):              200          200     0.158(6)e+03
Events carry unit weights.
==============================================================================
Per matrix element breakdown:
MEubarg2Y1ubar                                24           24        19(4)e+00
MEdbarg2Y1dbar                                26           26        21(4)e+00
MEdubar2Y1W-                                   1            1       0.8(8)e+00
MEddbar2XmXm                                   0            0                0
MEddbar2Y1g                                    6            6         5(2)e+00
MEddbar2Y1gamma                                0            0                0
MEddbar2Y1Z0                                   0            0                0
MEddbar2Y1Y1                                   3            3         2(1)e+00
MEdg2Y1d                                      49           49        39(5)e+00
MEuubar2XmXm                                   0            0                0
MEuubar2Y1g                                    9            9         7(2)e+00
MEuubar2Y1gamma                                0            0                0
MEuubar2Y1Z0                                   0            0                0
MEuubar2Y1Y1                                   4            4         3(2)e+00
MEudbar2Y1W+                                   0            0                0
MEug2Y1u                                      77           77        61(6)e+00
MEddbar2Y12ddbar                               0            0                0
MEddbar2Y12uubar                               0            0                0
MEuubar2Y12ddbar                               0            0                0
MEuubar2Y12uubar                               1            1       0.8(8)e+00
==============================================================================
Per parton extractor breakdown:
PPExtractor                                  200          200     0.158(6)e+03
==============================================================================
Per incoming partons breakdown:
d dbar                                         5            5         4(2)e+00
d ubar                                         1            1       0.8(8)e+00
d g                                           23           23        18(4)e+00
dbar d                                         4            4         3(2)e+00
dbar u                                         0            0                0
dbar g                                        12           12       9.5(3)e+00
ubar d                                         0            0                0
ubar u                                         9            9         7(2)e+00
ubar g                                        11           11         9(3)e+00
u dbar                                         0            0                0
u ubar                                         5            5         4(2)e+00
u g                                           36           36        29(4)e+00
g d                                           26           26        21(4)e+00
g dbar                                        14           14        11(3)e+00
g ubar                                        13           13        10(3)e+00
g u                                           41           41        32(5)e+00
==============================================================================
Detailed breakdown:
(PPExtractor) ubar d (MEdubar2Y1W- d,ubar->Y1,W-) 
                                               0            0                0
(PPExtractor) ubar u (MEuubar2XmXm u,ubar->Xm,Xm) 
                                               0            0                0
(PPExtractor) ubar u (MEuubar2Y1g u,ubar->Y1,g) 
                                               6            6         5(2)e+00
(PPExtractor) ubar u (MEuubar2Y1gamma u,ubar->Y1,gamma) 
                                               0            0                0
(PPExtractor) ubar u (MEuubar2Y1Z0 u,ubar->Y1,Z0) 
                                               0            0                0
(PPExtractor) ubar u (MEuubar2Y1Y1 u,ubar->Y1,Y1) 
                                               2            2         2(1)e+00
(PPExtractor) ubar u (MEuubar2Y12ddbar u,ubar->d,dbar) 
                                               0            0                0
(PPExtractor) ubar u (MEuubar2Y12uubar u,ubar->u,ubar) 
                                               1            1       0.8(8)e+00
(PPExtractor) ubar g (MEubarg2Y1ubar ubar,g->Y1,ubar) 
                                              11           11         9(3)e+00
(PPExtractor) dbar d (MEddbar2XmXm d,dbar->Xm,Xm) 
                                               0            0                0
(PPExtractor) dbar d (MEddbar2Y1g d,dbar->Y1,g) 
                                               3            3         2(1)e+00
(PPExtractor) dbar d (MEddbar2Y1gamma d,dbar->Y1,gamma) 
                                               0            0                0
(PPExtractor) dbar d (MEddbar2Y1Z0 d,dbar->Y1,Z0) 
                                               0            0                0
(PPExtractor) dbar d (MEddbar2Y1Y1 d,dbar->Y1,Y1) 
                                               1            1       0.8(8)e+00
(PPExtractor) dbar d (MEddbar2Y12ddbar d,dbar->d,dbar) 
                                               0            0                0
(PPExtractor) dbar d (MEddbar2Y12uubar d,dbar->u,ubar) 
                                               0            0                0
(PPExtractor) dbar u (MEudbar2Y1W+ u,dbar->Y1,W+) 
                                               0            0                0
(PPExtractor) dbar g (MEdbarg2Y1dbar dbar,g->Y1,dbar) 
                                              12           12       9.5(3)e+00
(PPExtractor) d ubar (MEdubar2Y1W- d,ubar->Y1,W-) 
                                               1            1       0.8(8)e+00
(PPExtractor) d dbar (MEddbar2XmXm d,dbar->Xm,Xm) 
                                               0            0                0
(PPExtractor) d dbar (MEddbar2Y1g d,dbar->Y1,g) 
                                               3            3         2(1)e+00
(PPExtractor) d dbar (MEddbar2Y1gamma d,dbar->Y1,gamma) 
                                               0            0                0
(PPExtractor) d dbar (MEddbar2Y1Z0 d,dbar->Y1,Z0) 
                                               0            0                0
(PPExtractor) d dbar (MEddbar2Y1Y1 d,dbar->Y1,Y1) 
                                               2            2         2(1)e+00
(PPExtractor) d dbar (MEddbar2Y12ddbar d,dbar->d,dbar) 
                                               0            0                0
(PPExtractor) d dbar (MEddbar2Y12uubar d,dbar->u,ubar) 
                                               0            0                0
(PPExtractor) d g (MEdg2Y1d d,g->Y1,d) 
                                              23           23        18(4)e+00
(PPExtractor) u ubar (MEuubar2XmXm u,ubar->Xm,Xm) 
                                               0            0                0
(PPExtractor) u ubar (MEuubar2Y1g u,ubar->Y1,g) 
                                               3            3         2(1)e+00
(PPExtractor) u ubar (MEuubar2Y1gamma u,ubar->Y1,gamma) 
                                               0            0                0
(PPExtractor) u ubar (MEuubar2Y1Z0 u,ubar->Y1,Z0) 
                                               0            0                0
(PPExtractor) u ubar (MEuubar2Y1Y1 u,ubar->Y1,Y1) 
                                               2            2         2(1)e+00
(PPExtractor) u ubar (MEuubar2Y12ddbar u,ubar->d,dbar) 
                                               0            0                0
(PPExtractor) u ubar (MEuubar2Y12uubar u,ubar->u,ubar) 
                                               0            0                0
(PPExtractor) u dbar (MEudbar2Y1W+ u,dbar->Y1,W+) 
                                               0            0                0
(PPExtractor) u g (MEug2Y1u u,g->Y1,u) 
                                              36           36        29(4)e+00
(PPExtractor) g ubar (MEubarg2Y1ubar ubar,g->Y1,ubar) 
                                              13           13        10(3)e+00
(PPExtractor) g dbar (MEdbarg2Y1dbar dbar,g->Y1,dbar) 
                                              14           14        11(3)e+00
(PPExtractor) g d (MEdg2Y1d d,g->Y1,d) 
                                              26           26        21(4)e+00
(PPExtractor) g u (MEug2Y1u u,g->Y1,u) 
                                              41           41        32(5)e+00
==============================================================================
