{
  "appId": "io.ionic.starter",
  "appName": "Aplicativo",
  "bundledWebRuntime": false,
  "linuxAndroidStudioPath": "/home/henrique/Downloads/android-studio/bin/studio.sh",
  "npmClient": "npm",
  "webDir": "www",
  "plugins": {
    "SplashScreen": {
      "launchShowDuration": 0
    }
  },
  "cordova": {}
}
