<?xml version="1.0" encoding="utf-8"?>
<!-- Generator: Adobe Illustrator 22.0.1, SVG Export Plug-In . SVG Version: 6.00 Build 0)  -->
<svg version="1.1" id="Layer_1" xmlns="http://www.w3.org/2000/svg" xmlns:xlink="http://www.w3.org/1999/xlink" x="0px" y="0px"
	 viewBox="0 0 600 600" style="enable-background:new 0 0 600 600;" xml:space="preserve">
<style type="text/css">
	.st0{fill:#ffffff;}
</style>
<g>
	<path class="st0" d="M389,439.2c-13.6-2.4-26.7,6.7-29.1,20.3c-0.7,4-2.9,7.4-6.2,9.7c-3.3,2.3-7.3,3.2-11.3,2.5
		c-2.6-0.5-5-1.6-7-3.3c-10.6-8.9-26.5-7.5-35.4,3.1c-8.9,10.6-7.5,26.5,3.1,35.4c8.7,7.3,19.3,12.2,30.5,14.2c3.9,0.7,7.7,1,11.6,1
		c13.3,0,26.2-4,37.3-11.8c14.3-10,23.9-25,26.9-42.2C411.8,454.7,402.7,441.7,389,439.2z"/>
	<path class="st0" d="M537,322.9c-4.7-13-19.2-19.8-32.2-15c-18.3,6.7-38.5-2.8-45.1-21l-34.4-94.5c-15.2-41.7-45.6-74.9-85.8-93.7
		c-40.2-18.7-85.3-20.7-126.9-5.5c-41.7,15.2-74.9,45.6-93.7,85.8c-18.7,40.2-20.7,85.3-5.5,126.9l34.4,94.5
		c6.6,18.2-2.8,38.5-21,45.1h0c-13,4.7-19.8,19.2-15,32.2c3.7,10.2,13.4,16.5,23.6,16.5c2.9,0,5.8-0.5,8.6-1.5c0,0,0,0,0.1,0
		L522,355.1C535.1,350.3,541.8,335.9,537,322.9z M199.9,418.8c0.9-11.8-0.6-23.9-4.9-35.7l-34.4-94.5c-10.6-29-9.2-60.5,3.9-88.5
		c13.1-28,36.2-49.3,65.3-59.8c12.9-4.7,26.3-7,39.6-7c16.7,0,33.3,3.6,48.8,10.9c28,13.1,49.3,36.3,59.8,65.3l34.4,94.5
		c4.3,11.8,10.9,22.1,19.2,30.5L199.9,418.8z"/>
</g>
</svg>
