<?xml version="1.0" encoding="utf-8"?>
<!-- Generator: Adobe Illustrator 22.0.1, SVG Export Plug-In . SVG Version: 6.00 Build 0)  -->
<svg version="1.1" id="Layer_1" xmlns="http://www.w3.org/2000/svg" xmlns:xlink="http://www.w3.org/1999/xlink" x="0px" y="0px"
	 viewBox="0 0 600 600" style="enable-background:new 0 0 600 600;" xml:space="preserve">
<style type="text/css">
	.st0{fill:#ffffff;}
</style>
<g>
	<path class="st0" d="M118.7,458.2c-11.3,0-20.4,9.2-20.4,20.4c0,11.3,9.2,20.4,20.4,20.4c11.3,0,20.4-9.2,20.4-20.4
		C139.2,467.3,130,458.2,118.7,458.2z"/>
	<path class="st0" d="M545.6,188.7c-1.9-12.3-5.3-24.3-9.9-35.8l-0.1,0c-4.9-12.2-18.8-18.1-31-13.2c-3,1.2-5.7,3-8,5.3l-76.9,76.9
		c-2.9,2.8-7.5,2.8-10.3,0l-33.8-33.8c-1.4-1.3-2.2-3.2-2.2-5.1c0-1.9,0.8-3.8,2.2-5.1l76.9-76.9c9.3-9.3,9.3-24.5-0.1-33.8
		c-2.3-2.3-5-4-7.9-5.2c-83.9-33.8-179.4,6.7-213.2,90.6c-4.7,11.5-8,23.6-9.9,35.8c-1.3,8.5-1.9,17.1-1.9,25.7v52.4L55.7,430.1
		c-30.8,30.8-30.8,80.8,0,111.6c30.8,30.8,80.8,30.8,111.6,0L331.1,378h52.4c8.6,0,17.2-0.6,25.7-1.9
		C498.6,362,559.6,278.1,545.6,188.7z M496.5,240.9c-10.8,45.7-48.2,80.4-94.6,87.7c-6.1,0.9-12.3,1.4-18.4,1.5l-0.1,0.2h-62.2
		c-6.3,0-12.4,2.5-16.9,7L133.5,508c-12.2,12.1-32,12-44.2-0.2c-12.1-12.2-12.1-31.8,0-43.9l170.7-170.8c4.5-4.5,7-10.5,7-16.9
		v-62.3c0-6.2,0.5-12.4,1.4-18.5c7.4-46.4,42-83.8,87.8-94.6c8.8-2.1,17.9-3.1,27-3.1h4.7l-46.1,46.1c-21.5,21.4-21.5,56.3-0.1,77.7
		c0,0,0,0,0.1,0.1l33.8,33.8c21.5,21.4,56.3,21.4,77.7,0l46.3-46.3C500,219.8,499,230.5,496.5,240.9z"/>
</g>
</svg>
