<?xml version="1.0" encoding="utf-8"?>
<!-- Generator: Adobe Illustrator 21.1.0, SVG Export Plug-In . SVG Version: 6.00 Build 0)  -->
<svg version="1.1" id="Camada_1" xmlns="http://www.w3.org/2000/svg" xmlns:xlink="http://www.w3.org/1999/xlink" x="0px" y="0px"
	 viewBox="0 0 784.9 512" style="enable-background:new 0 0 784.9 512;" xml:space="preserve">
<g>
	<g>
		<g>
			<path d="M483.1,2.5c-10.3-4.6-21.9-2.7-30.3,4.8l-17.2,15.5c-72.8,65.7-166.9,101.9-265,101.9H80c-26.8,0-48.5,21.8-48.5,48.5
				v7.9H20.7C9.3,181.2,0,190.5,0,201.9v63.6c0,11.4,9.3,20.7,20.7,20.7h10.8v7.9c0,26.8,21.8,48.5,48.5,48.5h33.5v140.1
				c0,16.1,13.1,29.2,29.2,29.2h55.5c16.1,0,29.2-13.1,29.2-29.2V414c30.3-3,56.2-23,66.7-51.5c51.8,17.1,100,44.8,141.3,82.1
				l17.2,15.5c5.3,4.8,12,7.3,18.8,7.3c3.9,0,7.8-0.8,11.6-2.5c10.3-4.6,16.7-14.4,16.7-25.7v-411C499.8,16.9,493.4,7.1,483.1,2.5z
				 M31.5,270.3H20.7c-2.6,0-4.8-2.1-4.8-4.8v-63.6c0-2.6,2.1-4.8,4.8-4.8h10.8V270.3z M80,326.8c-18,0-32.6-14.6-32.6-32.6V173.3
				c0-18,14.6-32.6,32.6-32.6h82.6v186.1H80z M211.6,482.8c0,7.3-5.9,13.3-13.3,13.3h-55.5c-7.3,0-13.3-5.9-13.3-13.3V342.7h41
				c13.8,0,27.5,0.7,41,2.1L211.6,482.8L211.6,482.8z M227.5,398v-51.1c17.4,2.5,34.6,6.2,51.4,11
				C270.5,379.7,250.8,395.1,227.5,398z M483.8,439.3c0,5-2.7,9.1-7.3,11.2c-4.5,2-9.5,1.2-13.1-2.1l-17.2-15.5
				c-73.8-66.6-168.5-104-267.7-105.9V140.6c99.1-1.9,193.9-39.3,267.7-105.9l17.2-15.5c3.7-3.3,8.6-4.1,13.1-2.1
				c4.5,2,7.3,6.2,7.3,11.2V439.3z"/>
			<path d="M262.7,248h-43.1c-4.4,0-8,3.6-8,8s3.6,8,8,8h43.1c4.4,0,8-3.6,8-8C270.7,251.6,267.1,248,262.7,248z"/>
			<path d="M305.8,203.5h-86.2c-4.4,0-8,3.6-8,8s3.6,8,8,8h86.2c4.4,0,8-3.6,8-8S310.2,203.5,305.8,203.5z"/>
		</g>
	</g>
</g>
<g>
	<path d="M746.6,109.1l-204.1,64.7c-4.2,1.3-8.7-1-10-5.2v0c-1.3-4.2,1-8.7,5.2-10l204.1-64.7c4.2-1.3,8.7,1,10,5.2v0
		C753.1,103.3,750.8,107.8,746.6,109.1z"/>
	<path d="M746.5,367.5l-202.7-68.8c-4.2-1.4-6.4-5.9-5-10.1l0,0c1.4-4.2,5.9-6.4,10.1-5l202.7,68.8c4.2,1.4,6.4,5.9,5,10.1l0,0
		C755.2,366.7,750.7,368.9,746.5,367.5z"/>
	<path d="M775.8,220.9L561.9,229c-4.4,0.2-8.1-3.3-8.3-7.7v0c-0.2-4.4,3.3-8.1,7.7-8.3l213.9-8.1c4.4-0.2,8.1,3.3,8.3,7.7v0
		C783.6,217,780.2,220.7,775.8,220.9z"/>
</g>
</svg>
