C:\Users\henri\OneDrive\Documentos\NetBeansProjects\OlaMundoJavaFx\src\main\java\com\cursoemvideo\olamundojavafx\App.java
C:\Users\henri\OneDrive\Documentos\NetBeansProjects\OlaMundoJavaFx\src\main\java\module-info.java
C:\Users\henri\OneDrive\Documentos\NetBeansProjects\OlaMundoJavaFx\src\main\java\com\cursoemvideo\olamundojavafx\PrimaryController.java
C:\Users\henri\OneDrive\Documentos\NetBeansProjects\OlaMundoJavaFx\src\main\java\com\cursoemvideo\olamundojavafx\SecondaryController.java
