﻿"GEBURTSDATUM","STRAßE","VORNAME","NAME","MOBILTEL","PLZ","ORT","PRIV. EMAIL*","E-MAIL","POSTFACH*","TITEL","VORWAHL","TELEFON","GESCHLECHT","KÜRZEL"
"29.04.1991","Lehrerstraße 1","Erika","Mustermann","0123-6543321","26121","Oldenburg","top1@secret.de","l1@schule.de","141","","0441","7654321","W","L1"
"29.05.1991","Lehrerstraße 2","Erik","Schmidt","0123-6543321","26121","Oldenburg","top2@secret.de","l2@schule.de","142","","0441","7654321","W","L2"
"29.06.1991","Lehrerstraße 3","Mike","Müller","0123-6543321","26121","Oldenburg","top3@secret.de","l3@schule.de","143","","0441","7654321","W","L3"
"29.07.1991","Lehrerstraße 4","Philip","Ye","0123-6543321","26121","Oldenburg","top4@secret.de","l4@schule.de","144","","0441","7654321","W","L4"
"29.08.1991","Lehrerstraße 5","Sandra","Schmidt-Kowski","0123-6543321","26121","Oldenburg","top5@secret.de","l5@schule.de","145","","0441","7654321","W","L5"
"29.09.1991","Lehrerstraße 6","Saskia","Franzosé-mit-âkzent","0123-6543321","26121","Oldenburg","top6@secret.de","l6@schule.de","146","","0441","7654321","W","L6"
