Import-ID;Account;Vorname;Nachnamenszusatz;Nachname;Klasse/Information;Gruppen
123456-654321;L1;Erika;von und zu;Mustermann;L1;"05A1;05A2;05A3;05D2;05D3;05E3;05F3;07A2;07A3;07E3;09D3;10A3;10B3;10C3;10D3;11D;13;"
123456-654321;L2;Erik;von und zu;Schmidt;L2;"05C2;05C3;05F3;06B2;06B3;08A1;08A2;08A3;08C2;08C3;08D2;08D3;08E3;12;13;"
123456-654321;L3;Mike;von und zu;Müller;L3;"06A3;06B3;06C3;07A3;07B3;07C3;07D3;07E3;09A3;09B3;09C3;09D3;09E3;11B;11D;11E;11F;13;"
123456-654321;L4;Philip;von und zu;Ye;L4;"05B2;06E3;09D3;09E3;10A3;10C3;12;13;"
123456-654321;L5;Sandra;von und zu;Schmidt-Kowski;L5;"06A1;06A2;06B2;06C2;06D2;07A3;08A3;09A3;09B3;09C3;09D3;09E3;11C;13;"
123456-654321;L6;Saskia;von und zu;Franzosé-mit-âkzent;L6;"05D2;05D3;05F3;08A3;08B3;08C3;08D3;08E3;09B3;10A3;10B3;10C3;10D3;11B;11G;"
