{
  "/squash/backend": {
    "target": "http://localhost:8080",
    "secure": false
  },
  "/squash/plugin": {
    "target": "http://localhost:8080",
    "secure": false,
    "logLevel": "debug",
    "changeOrigin": true
  },
  "logLevel": "debug"
}
