{
  "id": "RAA",
  "name": "reqA.A",
  "description": "desc reqA.A",
  "reference": "reqA.A.AAA",
  "status": "UNDER_REVIEW",
  "criticality": "MINOR",
  "category": "UNDEFINED",
  "custom_fields": [
    {
      "id": "cuf1",
      "value": "false"
    },
    {
      "id": "cuf2",
      "value": "a value"
    }
  ],
  "parent_type": "REQUIREMENT",
  "parent_id": "RA",
  "attachments": [
    {
      "zip_import_file_name": "AT06-attachment.jpg",
      "original_file_name":  "attachment.jpg"
    }
  ]
}
