{
  "apiVersion": "opentestfactory.org/v1alpha1",
  "kind": "Workflow",
  "metadata": {
    "name": "Simple Workflow",
    "workflow_id": "xxxx"
  },
  "jobs": {
    "explicitJob": {
      "runs-on":"dummy",
      "steps": [
        {"run": "echo this does nothing but is a direct step"},
        {"run":"mvn clean test"}
      ]
    }
  }
}
