{
	"info": {
		"_postman_id": "62313c8e-2149-40ae-a39a-c37bb6ab1fa9",
		"name": "OrderTests",
		"schema": "https://schema.getpostman.com/json/collection/v2.0.0/collection.json",
		"_exporter_id": "28217084"
	},
	"item": [
		{
			"name": "Create_customer",
			"event": [
				{
					"listen": "test",
					"script": {
						"exec": [
							"pm.test(\"Status code is 201 - Customer created\", function () {\r",
							"    pm.response.to.have.status(201);\r",
							"});\r",
							"\r",
							"var jsonData = pm.response.json();;\r",
							"value_id = jsonData.customer.id;\r",
							"pm.environment.set(\"DS_id_customer\", value_id);\r",
							"\r",
							""
						],
						"type": "text/javascript"
					}
				},
				{
					"listen": "prerequest",
					"script": {
						"exec": [
							""
						],
						"type": "text/javascript"
					}
				}
			],
			"request": {
				"method": "POST",
				"header": [
					{
						"key": "Output-Format",
						"value": "JSON",
						"type": "text"
					}
				],
				"body": {
					"mode": "raw",
					"raw": "<prestashop xmlns:xlink=\"http://www.w3.org/1999/xlink\">\r\n  <customer>\r\n    <passwd>{{DS_password}}</passwd>\r\n    <lastname>{{DS_lastname}}</lastname>\r\n    <firstname>{{DS_firstname}}</firstname>\r\n    <email>{{DS_email}}</email>\r\n    <id_gender>1</id_gender>\r\n    <birthday>{{DS_birthday}}</birthday>\r\n    <newsletter>1</newsletter>\r\n    <optin>1</optin>\r\n    <active>1</active>\r\n    <id_lang>1</id_lang>\r\n      <associations>\r\n      <groups>\r\n        <group>\r\n          <id>3</id>\r\n        </group>\r\n      </groups>\r\n    </associations>\r\n  </customer>\r\n</prestashop>\r\n",
					"options": {
						"raw": {
							"language": "xml"
						}
					}
				},
				"url": {
					"raw": "{{IT_CUF_base_url}}/customers",
					"host": [
						"{{IT_CUF_base_url}}"
					],
					"path": [
						"customers"
					],
					"query": [
						{
							"key": "",
							"value": null,
							"disabled": true
						}
					]
				}
			},
			"response": []
		},
		{
			"name": "Create_cart",
			"event": [
				{
					"listen": "test",
					"script": {
						"exec": [
							"pm.test(\"Status code is 201 - cart created\", function () {\r",
							"    pm.response.to.have.status(201);\r",
							"});\r",
							"\r",
							"var jsonData = pm.response.json();\r",
							"id_cart = jsonData.cart.id;\r",
							"pm.environment.set(\"DS_id_cart\", id_cart);"
						],
						"type": "text/javascript"
					}
				}
			],
			"request": {
				"method": "POST",
				"header": [
					{
						"key": "Output-Format",
						"value": "JSON",
						"type": "text"
					}
				],
				"body": {
					"mode": "raw",
					"raw": "<prestashop xmlns:xlink=\"http://www.w3.org/1999/xlink\">\r\n  <cart>\r\n    <id_address_delivery>1</id_address_delivery>\r\n    <id_address_invoice>1</id_address_invoice>\r\n    <id_currency>1</id_currency>\r\n    <id_customer>{{DS_id_customer}}</id_customer>\r\n    <id_lang>1</id_lang>\r\n    <gift>1</gift>\r\n    <gift_message>{{DS_gift_message}}</gift_message>\r\n        <associations>\r\n      <cart_rows>\r\n        <cart_row>\r\n          <id_product>{{DS_id_product}}</id_product>\r\n          <id_product_attribute></id_product_attribute>\r\n          <id_address_delivery></id_address_delivery>\r\n          <id_customization></id_customization>\r\n          <quantity>{{DS_quantity_product}}</quantity>\r\n        </cart_row>\r\n      </cart_rows>\r\n    </associations>\r\n  </cart>\r\n</prestashop>\r\n",
					"options": {
						"raw": {
							"language": "xml"
						}
					}
				},
				"url": "{{IT_CUF_base_url}}/carts"
			},
			"response": []
		},
		{
			"name": "Create_order",
			"event": [
				{
					"listen": "test",
					"script": {
						"exec": [
							"pm.test(\"Status code is 201 - order created\", function () {\r",
							"    pm.response.to.have.status(201);\r",
							"});\r",
							"\r",
							"var jsonData = pm.response.json();;\r",
							"id_order_body_response = jsonData.order.id;\r",
							"pm.environment.set(\"DS_id_order\", id_order_body_response);\r",
							""
						],
						"type": "text/javascript"
					}
				}
			],
			"request": {
				"method": "POST",
				"header": [
					{
						"key": "Output-Format",
						"value": "JSON",
						"type": "text"
					}
				],
				"body": {
					"mode": "raw",
					"raw": "<prestashop xmlns:xlink=\"http://www.w3.org/1999/xlink\">\r\n  <order>\r\n    <id_address_delivery>1</id_address_delivery>\r\n    <id_address_invoice>1</id_address_invoice>\r\n    <id_cart>{{DS_id_cart}}</id_cart>\r\n    <id_currency>1</id_currency>\r\n    <id_lang>1</id_lang>\r\n    <id_customer>{{DS_id_customer}}</id_customer>\r\n    <id_carrier>2</id_carrier>\r\n    <module>ps_wirepayment</module>\r\n    <payment>Payment by check</payment>\r\n    <total_paid>34.80</total_paid>\r\n    <total_paid_real>34.800</total_paid_real>\r\n    <total_products>29.00</total_products>\r\n    <total_products_wt>34.80</total_products_wt>\r\n    <conversion_rate>1.000000</conversion_rate>\r\n    <gift>1</gift>\r\n    <gift_message>{{DS_gift_message}}</gift_message>\r\n  </order>\r\n</prestashop>",
					"options": {
						"raw": {
							"language": "xml"
						}
					}
				},
				"url": "{{IT_CUF_base_url}}/orders"
			},
			"response": []
		},
		{
			"name": "Check_created_order",
			"event": [
				{
					"listen": "test",
					"script": {
						"exec": [
							"pm.test(\"Status code is 200 - request is ok\", function () {\r",
							"    pm.response.to.have.status(200);\r",
							"});\r",
							"\r",
							"pm.test(\"The order requested is equal to the one created\", function () {\r",
							"    var jsonData = pm.response.json();    \r",
							"    var id_order = jsonData.order.id;\r",
							"    pm.expect(pm.environment.get(\"DS_id_order\")).to.eql(id_order);\r",
							"\r",
							"});\r",
							"\r",
							"pm.test(\"Cart is correct\", function () {\r",
							"    var jsonData = pm.response.json();    \r",
							"    var id_cart_body_response = jsonData.order.id_cart;\r",
							"     pm.expect(pm.environment.get(\"DS_id_cart\")).to.eql(id_cart_body_response);\r",
							"});\r",
							"\r",
							"\r",
							"pm.test(\"Price is correct\", function () {\r",
							"    var jsonData = pm.response.json();    \r",
							"    var price_response_body = jsonData.order.total_paid;\r",
							"    var price_paid= 34.80;\r",
							"    pm.expect(price_paid).to.eql(parseFloat(price_response_body));\r",
							"});\r",
							"\r",
							"pm.test(\"Customer is correct\", function () {\r",
							"    var jsonData = pm.response.json();    \r",
							"    var id_customer_body_response = jsonData.order.id_customer;\r",
							"     pm.expect(pm.environment.get(\"DS_id_customer\")).to.eql(id_customer_body_response);\r",
							"});\r",
							"\r",
							"\r",
							"pm.test(\"Product id in order is correct\", function () {\r",
							"    var jsonData = pm.response.json();    \r",
							"    var product_response_body = jsonData.order.associations.order_rows[0].product_id;\r",
							"    pm.expect(pm.environment.get(\"DS_id_product\")).to.eql(product_response_body);\r",
							"});\r",
							"\r",
							"\r",
							""
						],
						"type": "text/javascript"
					}
				}
			],
			"request": {
				"method": "GET",
				"header": [
					{
						"key": "Output-Format",
						"value": "JSON",
						"type": "text"
					}
				],
				"url": "{{IT_CUF_base_url}}/orders/{{DS_id_order}}"
			},
			"response": []
		},
		{
			"name": "Delete_order",
			"event": [
				{
					"listen": "test",
					"script": {
						"exec": [
							"pm.test(\"Status code is 200 - request is ok\", function () {\r",
							"    pm.response.to.have.status(200);\r",
							"});"
						],
						"type": "text/javascript"
					}
				}
			],
			"request": {
				"method": "DELETE",
				"header": [],
				"url": "{{IT_CUF_base_url}}/orders/{{DS_id_order}}"
			},
			"response": []
		},
		{
			"name": "Check_deleted_order",
			"event": [
				{
					"listen": "test",
					"script": {
						"exec": [
							"pm.test(\"Status code is 404\", function () {\r",
							"    pm.response.to.have.status(404);\r",
							"});\r",
							""
						],
						"type": "text/javascript"
					}
				}
			],
			"request": {
				"method": "GET",
				"header": [],
				"url": "{{IT_CUF_base_url}}/orders/{{DS_id_order}}"
			},
			"response": []
		},
		{
			"name": "Delete_cart",
			"event": [
				{
					"listen": "test",
					"script": {
						"exec": [
							"pm.test(\"Status code is 200 - request is ok\", function () {\r",
							"    pm.response.to.have.status(200);\r",
							"});"
						],
						"type": "text/javascript"
					}
				}
			],
			"request": {
				"method": "DELETE",
				"header": [],
				"url": "{{IT_CUF_base_url}}/carts/{{DS_id_cart}}"
			},
			"response": []
		},
		{
			"name": "Delete_customer",
			"event": [
				{
					"listen": "test",
					"script": {
						"exec": [
							"pm.test(\"Status code is 200 - request is ok\", function () {\r",
							"    pm.response.to.have.status(200);\r",
							"});"
						],
						"type": "text/javascript"
					}
				}
			],
			"request": {
				"method": "DELETE",
				"header": [],
				"url": "{{IT_CUF_base_url}}/customers/{{DS_id_customer}}"
			},
			"response": []
		}
	],
	"auth": {
		"type": "basic",
		"basic": {
			"username": "{{IT_CUF_api_key}}"
		}
	},
	"event": [
		{
			"listen": "prerequest",
			"script": {
				"type": "text/javascript",
				"exec": [
					""
				]
			}
		},
		{
			"listen": "test",
			"script": {
				"type": "text/javascript",
				"exec": [
					""
				]
			}
		}
	]
}