{
	"info": {
		"_postman_id": "0b7e7c80-efa1-48f6-b3fb-5fd5a523c8e4",
		"name": "CustomerTests",
		"schema": "https://schema.getpostman.com/json/collection/v2.0.0/collection.json",
		"_exporter_id": "28217084"
	},
	"item": [
		{
			"name": "Create_customer_fail_missing_lastname",
			"event": [
				{
					"listen": "test",
					"script": {
						"exec": [
							"pm.test(\"Status code is 400\", function () {\r",
							"    pm.response.to.have.status(400);\r",
							"});\r",
							"\r",
							"\r",
							"pm.test(\"The issue comes from the lack of lastname - lastname required\", function(){\r",
							"let expectedStrings =['parameter','lastname','required'];\r",
							"responseText = pm.response.text();\r",
							"expectedStrings.forEach((s) => pm.expect(responseText).to.have.string(s));\r",
							"});\r",
							""
						],
						"type": "text/javascript"
					}
				}
			],
			"request": {
				"method": "POST",
				"header": [
					{
						"key": "Output-Format",
						"value": "JSON",
						"type": "text"
					}
				],
				"body": {
					"mode": "raw",
					"raw": "<prestashop xmlns:xlink=\"http://www.w3.org/1999/xlink\">\r\n  <customer>\r\n    <passwd>{{DS_password}}</passwd>\r\n    <firstname>{{DS_firstname}}</firstname>\r\n    <email>{{DS_email}}</email>\r\n    <id_gender>1</id_gender>\r\n    <birthday>{{DS_birthday}}</birthday>\r\n    <newsletter>1</newsletter>\r\n    <optin>1</optin>\r\n    <active>1</active>\r\n    <id_lang>1</id_lang>\r\n      <associations>\r\n      <groups>\r\n        <group>\r\n          <id>3</id>\r\n        </group>\r\n      </groups>\r\n    </associations>\r\n  </customer>\r\n</prestashop>\r\n",
					"options": {
						"raw": {
							"language": "xml"
						}
					}
				},
				"url": "{{IT_CUF_base_url}}/customers"
			},
			"response": []
		},
		{
			"name": "Create_customer",
			"event": [
				{
					"listen": "test",
					"script": {
						"exec": [
							"var jsonData = pm.response.json();\r",
							"value_id = jsonData.customer.id;\r",
							"pm.environment.set(\"DS_id_customer\", value_id);\r",
							"\r",
							"pm.test(\"Status code is 201 - Customer created\", function () {\r",
							"    pm.response.to.have.status(201);\r",
							"});\r",
							"\r",
							"pm.test(\"Check creation with email\", function () {\r",
							"    var jsonData = pm.response.json();    \r",
							"    var email_response_body = jsonData.customer.email;\r",
							"    pm.expect(pm.environment.get(\"DS_email\")).to.eql(email_response_body);\r",
							"    \r",
							"});\r",
							"\r",
							"\r",
							"\r",
							"\r",
							""
						],
						"type": "text/javascript"
					}
				},
				{
					"listen": "prerequest",
					"script": {
						"exec": [
							""
						],
						"type": "text/javascript"
					}
				}
			],
			"request": {
				"method": "POST",
				"header": [
					{
						"key": "Output-Format",
						"value": "JSON",
						"type": "text"
					}
				],
				"body": {
					"mode": "raw",
					"raw": "<prestashop xmlns:xlink=\"http://www.w3.org/1999/xlink\">\r\n  <customer>\r\n    <passwd>{{DS_password}}</passwd>\r\n    <lastname>{{DS_lastname}}</lastname>\r\n    <firstname>{{DS_firstname}}</firstname>\r\n    <email>{{DS_email}}</email>\r\n    <id_gender>1</id_gender>\r\n    <birthday>{{DS_birthday}}</birthday>\r\n    <newsletter>1</newsletter>\r\n    <optin>1</optin>\r\n    <active>1</active>\r\n    <id_lang>1</id_lang>\r\n      <associations>\r\n      <groups>\r\n        <group>\r\n          <id>3</id>\r\n        </group>\r\n      </groups>\r\n    </associations>\r\n  </customer>\r\n</prestashop>\r\n",
					"options": {
						"raw": {
							"language": "xml"
						}
					}
				},
				"url": {
					"raw": "{{IT_CUF_base_url}}/customers",
					"host": [
						"{{IT_CUF_base_url}}"
					],
					"path": [
						"customers"
					],
					"query": [
						{
							"key": "",
							"value": null,
							"disabled": true
						}
					]
				}
			},
			"response": []
		},
		{
			"name": "Check_created_customer",
			"event": [
				{
					"listen": "test",
					"script": {
						"exec": [
							"pm.test(\"Status code is 200 - request is ok\", function () {\r",
							"    pm.response.to.have.status(200);\r",
							"});\r",
							"\r",
							"\r",
							"\r",
							"pm.test(\"Check email\", function () {\r",
							"    var jsonData = pm.response.json();    \r",
							"    var email_response_body = jsonData.customer.email;\r",
							"    pm.expect(pm.environment.get(\"DS_email\")).to.eql(email_response_body);\r",
							"});\r",
							"\r",
							"\r",
							"pm.test(\"Check lastname\", function () {\r",
							"    var jsonData = pm.response.json();    \r",
							"    var lastname_response_body = jsonData.customer.lastname;\r",
							"    pm.expect(pm.environment.get(\"DS_lastname\")).to.eql(lastname_response_body);\r",
							"});\r",
							"\r",
							"\r",
							"pm.test(\"Check firstname\", function () {\r",
							"    var jsonData = pm.response.json();    \r",
							"    var firstname_response_body = jsonData.customer.firstname;\r",
							"    pm.expect(pm.environment.get(\"DS_firstname\")).to.eql(firstname_response_body);\r",
							"});\r",
							"\r",
							"\r",
							"pm.test(\"Check date of birth\", function () {\r",
							"    var jsonData = pm.response.json();    \r",
							"    var birthday_response_body = jsonData.customer.birthday;\r",
							"    pm.expect(pm.environment.get(\"DS_birthday\")).to.eql(birthday_response_body);\r",
							"});"
						],
						"type": "text/javascript"
					}
				}
			],
			"request": {
				"method": "GET",
				"header": [
					{
						"key": "Output-Format",
						"value": "JSON",
						"type": "text"
					}
				],
				"url": "{{IT_CUF_base_url}}/customers/{{DS_id_customer}}"
			},
			"response": []
		},
		{
			"name": "Update_customer_email_with_put",
			"event": [
				{
					"listen": "test",
					"script": {
						"exec": [
							"pm.test(\"Status code is 200 - request is ok\", function () {\r",
							"    pm.response.to.have.status(200);\r",
							"});\r",
							"\r",
							"pm.test(\"Check update with email\", function () {\r",
							"    var jsonData = pm.response.json();    \r",
							"    var email_response_body = jsonData.customer.email;\r",
							"    pm.expect(pm.environment.get(\"DS_updated_email\")).to.eql(email_response_body);\r",
							"});\r",
							""
						],
						"type": "text/javascript"
					}
				}
			],
			"request": {
				"method": "PUT",
				"header": [
					{
						"key": "Output-Format",
						"value": "JSON",
						"type": "text"
					}
				],
				"body": {
					"mode": "raw",
					"raw": "<?xml version=\"1.0\" encoding=\"UTF-8\"?>\r\n<prestashop xmlns:xlink=\"http://www.w3.org/1999/xlink\">\r\n<customer>\r\n    <id>{{DS_id_customer}}</id>\r\n    <passwd>{{DS_password}}</passwd>\r\n    <lastname>{{DS_lastname}}</lastname>\r\n    <firstname>{{DS_firstname}}</firstname>\r\n    <email>{{DS_updated_email}}</email>\r\n    <id_gender>1</id_gender>\r\n    <birthday>{{DS_birthday}}</birthday>\r\n    <newsletter>1</newsletter>\r\n    <optin>1</optin>\r\n</customer>\r\n</prestashop>\r\n",
					"options": {
						"raw": {
							"language": "xml"
						}
					}
				},
				"url": "{{IT_CUF_base_url}}/customers/{{DS_id_customer}}"
			},
			"response": []
		},
		{
			"name": "Check_updated_customer_put",
			"event": [
				{
					"listen": "test",
					"script": {
						"exec": [
							"pm.test(\"Status code is 200- request is ok\", function () {\r",
							"    pm.response.to.have.status(200);\r",
							"});\r",
							"\r",
							"pm.test(\"Check update with email\", function () {\r",
							"    var jsonData = pm.response.json();    \r",
							"    var email_response_body = jsonData.customer.email;\r",
							"    pm.expect(pm.environment.get(\"DS_updated_email\")).to.eql(email_response_body);\r",
							"});\r",
							"\r",
							"pm.test(\"Check lastname\", function () {\r",
							"    var jsonData = pm.response.json();    \r",
							"    var lastname_response_body = jsonData.customer.lastname;\r",
							"    pm.expect(pm.environment.get(\"DS_lastname\")).to.eql(lastname_response_body);\r",
							"});\r",
							"\r",
							"\r",
							"pm.test(\"Check firstname\", function () {\r",
							"    var jsonData = pm.response.json();    \r",
							"    var firstname_response_body = jsonData.customer.firstname;\r",
							"    pm.expect(pm.environment.get(\"DS_firstname\")).to.eql(firstname_response_body);\r",
							"});\r",
							"\r",
							"\r",
							"pm.test(\"Check date of birth\", function () {\r",
							"    var jsonData = pm.response.json();    \r",
							"    var birthday_response_body = jsonData.customer.birthday;\r",
							"    pm.expect(pm.environment.get(\"DS_birthday\")).to.eql(birthday_response_body);\r",
							"});"
						],
						"type": "text/javascript"
					}
				}
			],
			"request": {
				"method": "GET",
				"header": [
					{
						"key": "Output-Format",
						"value": "JSON",
						"type": "text"
					}
				],
				"url": "{{IT_CUF_base_url}}/customers/{{DS_id_customer}}"
			},
			"response": []
		},
		{
			"name": "Delete_customer",
			"event": [
				{
					"listen": "test",
					"script": {
						"exec": [
							"pm.test(\"Status code is 200 - request is ok\", function () {\r",
							"    pm.response.to.have.status(200);\r",
							"});"
						],
						"type": "text/javascript"
					}
				}
			],
			"request": {
				"method": "DELETE",
				"header": [],
				"url": "{{IT_CUF_base_url}}/customers/{{DS_id_customer}}"
			},
			"response": []
		},
		{
			"name": "Check_deleted_customer",
			"event": [
				{
					"listen": "test",
					"script": {
						"exec": [
							"pm.test(\"Status code is 404 - ressource not found\", function () {\r",
							"    pm.response.to.have.status(404);\r",
							"});"
						],
						"type": "text/javascript"
					}
				}
			],
			"request": {
				"method": "GET",
				"header": [],
				"url": "{{IT_CUF_base_url}}/customers/{{DS_id_customer}}"
			},
			"response": []
		}
	],
	"auth": {
		"type": "basic",
		"basic": {
			"username": "{{IT_CUF_api_key}}"
		}
	},
	"event": [
		{
			"listen": "prerequest",
			"script": {
				"type": "text/javascript",
				"exec": [
					""
				]
			}
		},
		{
			"listen": "test",
			"script": {
				"type": "text/javascript",
				"exec": [
					""
				]
			}
		}
	]
}