Name,Email,Logo,Website
PT. Ciputra Sakti,ciputrasakti@gmail.com,EMPTY,ciputrasakti.com
PT. Wilda Bakti,wildabakti@gmail.com,EMPTY,wildabakti.com
PT. Roma ,roma@gmail.com,EMPTY,roma.com
PT. Janji Group,janjigroup@gmail.com,EMPTY,janjigroup.com
PT. Pertamax,pertamax@gmail.com,EMPTY,pertamax.com
PT. Ciputra Sakti,ciputrasakti@gmail.com,EMPTY,ciputrasakti.com
PT. Wilda Bakti,wildabakti@gmail.com,EMPTY,wildabakti.com
PT. Roma ,roma@gmail.com,EMPTY,roma.com
PT. Janji Group,janjigroup@gmail.com,EMPTY,janjigroup.com
PT. Pertamax,pertamax@gmail.com,EMPTY,pertamax.com
PT. Ciputra Sakti,ciputrasakti@gmail.com,EMPTY,ciputrasakti.com
PT. Wilda Bakti,wildabakti@gmail.com,EMPTY,wildabakti.com
PT. Roma ,roma@gmail.com,EMPTY,roma.com
PT. Janji Group,janjigroup@gmail.com,EMPTY,janjigroup.com
PT. Pertamax,pertamax@gmail.com,EMPTY,pertamax.com
PT. Ciputra Sakti,ciputrasakti@gmail.com,EMPTY,ciputrasakti.com
PT. Wilda Bakti,wildabakti@gmail.com,EMPTY,wildabakti.com
PT. Roma ,roma@gmail.com,EMPTY,roma.com
PT. Janji Group,janjigroup@gmail.com,EMPTY,janjigroup.com
PT. Pertamax,pertamax@gmail.com,EMPTY,pertamax.com
PT. Ciputra Sakti,ciputrasakti@gmail.com,EMPTY,ciputrasakti.com
PT. Wilda Bakti,wildabakti@gmail.com,EMPTY,wildabakti.com
PT. Roma ,roma@gmail.com,EMPTY,roma.com
PT. Janji Group,janjigroup@gmail.com,EMPTY,janjigroup.com
PT. Pertamax,pertamax@gmail.com,EMPTY,pertamax.com
PT. Ciputra Sakti,ciputrasakti@gmail.com,EMPTY,ciputrasakti.com
PT. Wilda Bakti,wildabakti@gmail.com,EMPTY,wildabakti.com
PT. Roma ,roma@gmail.com,EMPTY,roma.com
PT. Janji Group,janjigroup@gmail.com,EMPTY,janjigroup.com
PT. Pertamax,pertamax@gmail.com,EMPTY,pertamax.com
PT. Ciputra Sakti,ciputrasakti@gmail.com,EMPTY,ciputrasakti.com
PT. Wilda Bakti,wildabakti@gmail.com,EMPTY,wildabakti.com
PT. Roma ,roma@gmail.com,EMPTY,roma.com
PT. Janji Group,janjigroup@gmail.com,EMPTY,janjigroup.com
PT. Pertamax,pertamax@gmail.com,EMPTY,pertamax.com
PT. Ciputra Sakti,ciputrasakti@gmail.com,EMPTY,ciputrasakti.com
PT. Wilda Bakti,wildabakti@gmail.com,EMPTY,wildabakti.com
PT. Roma ,roma@gmail.com,EMPTY,roma.com
PT. Janji Group,janjigroup@gmail.com,EMPTY,janjigroup.com
PT. Pertamax,pertamax@gmail.com,EMPTY,pertamax.com
PT. Ciputra Sakti,ciputrasakti@gmail.com,EMPTY,ciputrasakti.com
PT. Wilda Bakti,wildabakti@gmail.com,EMPTY,wildabakti.com
PT. Roma ,roma@gmail.com,EMPTY,roma.com
PT. Janji Group,janjigroup@gmail.com,EMPTY,janjigroup.com
PT. Pertamax,pertamax@gmail.com,EMPTY,pertamax.com
PT. Ciputra Sakti,ciputrasakti@gmail.com,EMPTY,ciputrasakti.com
PT. Wilda Bakti,wildabakti@gmail.com,EMPTY,wildabakti.com
PT. Roma ,roma@gmail.com,EMPTY,roma.com
PT. Janji Group,janjigroup@gmail.com,EMPTY,janjigroup.com
PT. Pertamax,pertamax@gmail.com,EMPTY,pertamax.com
PT. Ciputra Sakti,ciputrasakti@gmail.com,EMPTY,ciputrasakti.com
PT. Wilda Bakti,wildabakti@gmail.com,EMPTY,wildabakti.com
PT. Roma ,roma@gmail.com,EMPTY,roma.com
PT. Janji Group,janjigroup@gmail.com,EMPTY,janjigroup.com
PT. Pertamax,pertamax@gmail.com,EMPTY,pertamax.com
PT. Ciputra Sakti,ciputrasakti@gmail.com,EMPTY,ciputrasakti.com
PT. Wilda Bakti,wildabakti@gmail.com,EMPTY,wildabakti.com
PT. Roma ,roma@gmail.com,EMPTY,roma.com
PT. Janji Group,janjigroup@gmail.com,EMPTY,janjigroup.com
PT. Pertamax,pertamax@gmail.com,EMPTY,pertamax.com