<svg width="147" height="31" viewBox="0 0 147 31" fill="none" xmlns="http://www.w3.org/2000/svg">
<rect x="8.71405" y="9.88904" width="19.9739" height="18.5052" rx="2.74151" fill="url(#paint0_linear_11_315)"/>
<path d="M17.3201 1.38383C18.1173 0.612343 19.3827 0.612342 20.1799 1.38383L31.3367 12.1811C32.6647 13.4663 31.7549 15.7147 29.9068 15.7147H7.59324C5.74514 15.7147 4.8353 13.4663 6.16333 12.1811L17.3201 1.38383Z" fill="#FF7A00"/>
<rect x="23.4066" y="2.14282" width="5.27472" height="8.07692" rx="0.494505" fill="#FF7A00"/>
<path d="M37.3886 25V7.84858H40.1143L49.2172 20.4486V7.84858H51.9172V25H49.3715L40.0886 12.2714V25H37.3886ZM60.9598 25.3857C59.074 25.3514 57.634 24.7771 56.6398 23.6629C55.6626 22.5486 55.174 20.9629 55.174 18.9057C55.174 17.4486 55.354 16.2571 55.714 15.3314C56.0912 14.4057 56.5969 13.6857 57.2312 13.1714C57.8826 12.6571 58.6112 12.3057 59.4169 12.1171C60.2398 11.9114 61.0883 11.8086 61.9626 11.8086C62.8712 11.8086 63.7112 11.9286 64.4826 12.1686C65.254 12.4086 65.8626 12.7771 66.3083 13.2743C66.7712 13.7543 67.0026 14.38 67.0026 15.1514V25.3857C67.0026 26.2771 66.8055 27.1 66.4112 27.8543C66.034 28.6257 65.3998 29.2343 64.5083 29.68C63.634 30.1257 62.4598 30.3486 60.9855 30.3486C60.0598 30.3486 59.2455 30.2714 58.5426 30.1171C57.8569 29.98 57.2826 29.8343 56.8198 29.68V27.2114C57.2312 27.3657 57.7883 27.5286 58.4912 27.7C59.2112 27.8886 59.974 27.9829 60.7798 27.9829C61.7912 27.9829 62.5455 27.8543 63.0426 27.5971C63.5569 27.3571 63.8998 27.0314 64.0712 26.62C64.2426 26.2257 64.3283 25.7971 64.3283 25.3343V24.4343C63.8655 24.7257 63.334 24.9571 62.734 25.1286C62.134 25.3 61.5426 25.3857 60.9598 25.3857ZM61.3969 23.1743C61.894 23.1743 62.3998 23.1143 62.914 22.9943C63.4283 22.8743 63.8998 22.6857 64.3283 22.4286V15.6657C64.3283 15.0143 64.0712 14.5943 63.5569 14.4057C63.0426 14.2 62.4598 14.0971 61.8083 14.0971C60.7455 14.0971 59.9312 14.3114 59.3655 14.74C58.8169 15.1686 58.4398 15.7429 58.234 16.4629C58.0283 17.1657 57.9255 17.9543 57.9255 18.8286C57.9255 20.1314 58.2083 21.1857 58.774 21.9914C59.3398 22.78 60.214 23.1743 61.3969 23.1743ZM76.2881 25.3857C74.3852 25.3857 72.8681 24.8114 71.7367 23.6629C70.6224 22.4971 70.0652 20.8171 70.0652 18.6229C70.0652 16.3771 70.5881 14.68 71.6338 13.5314C72.6967 12.3657 74.1709 11.7829 76.0567 11.7829C77.4452 11.7829 78.5681 12.0914 79.4252 12.7086C80.2824 13.3257 80.8995 14.1914 81.2767 15.3057C81.6709 16.4029 81.8595 17.6886 81.8424 19.1629H72.7652C72.8509 20.4314 73.2281 21.4 73.8967 22.0686C74.5652 22.72 75.5081 23.0457 76.7252 23.0457C77.5824 23.0457 78.3624 22.9429 79.0652 22.7371C79.7852 22.5143 80.3938 22.2657 80.8909 21.9914V24.5114C80.2738 24.7857 79.5881 25 78.8338 25.1543C78.0795 25.3086 77.2309 25.3857 76.2881 25.3857ZM75.9795 13.9943C75.1052 13.9943 74.4024 14.2257 73.8709 14.6886C73.3395 15.1343 72.9967 15.9571 72.8424 17.1571H79.0909C78.9881 16.06 78.6795 15.2629 78.1652 14.7657C77.6681 14.2514 76.9395 13.9943 75.9795 13.9943ZM84.8698 25V7.84858H89.0355V15.0229L94.2812 7.84858H99.527L93.0984 15.1L100.067 25H94.847L90.2184 18.3143L89.0355 19.6257V25H84.8698ZM108.082 25.3857C103.676 25.3857 101.482 23.0714 101.499 18.4429C101.499 15.9914 102.056 14.2343 103.17 13.1714C104.285 12.0914 105.922 11.5514 108.082 11.5514C110.259 11.5514 111.913 12.1086 113.045 13.2229C114.176 14.32 114.742 16.06 114.742 18.4429C114.742 20.7229 114.167 22.4543 113.019 23.6371C111.87 24.8029 110.225 25.3857 108.082 25.3857ZM108.082 22.3257C109.025 22.3257 109.736 22 110.216 21.3486C110.696 20.68 110.936 19.7114 110.936 18.4429C110.936 17.0029 110.687 16 110.19 15.4343C109.71 14.8686 109.007 14.5857 108.082 14.5857C107.105 14.5857 106.393 14.8771 105.947 15.46C105.502 16.0429 105.279 17.0371 105.279 18.4429C105.279 19.7457 105.502 20.7229 105.947 21.3743C106.41 22.0086 107.122 22.3257 108.082 22.3257ZM121.243 25.3857C120.318 25.3857 119.521 25.2829 118.852 25.0771C118.201 24.8886 117.592 24.6743 117.026 24.4343V21.0657C117.541 21.4429 118.166 21.8029 118.903 22.1457C119.658 22.4714 120.489 22.6343 121.398 22.6343C122.015 22.6343 122.443 22.5314 122.683 22.3257C122.941 22.1029 123.069 21.8371 123.069 21.5286C123.069 21.2371 122.941 21.0057 122.683 20.8343C122.426 20.6457 122.092 20.4914 121.681 20.3714C121.269 20.2514 120.832 20.14 120.369 20.0371C119.803 19.9171 119.255 19.72 118.723 19.4457C118.209 19.1543 117.781 18.7429 117.438 18.2114C117.112 17.6629 116.949 16.96 116.949 16.1029C116.949 15.28 117.112 14.5857 117.438 14.02C117.763 13.4543 118.192 13 118.723 12.6571C119.255 12.3143 119.829 12.0743 120.446 11.9371C121.063 11.7829 121.663 11.7143 122.246 11.7314C123.309 11.7657 124.149 11.8857 124.766 12.0914C125.383 12.28 125.958 12.5286 126.489 12.8371V15.8457C125.906 15.52 125.323 15.22 124.741 14.9457C124.175 14.6543 123.523 14.5086 122.786 14.5086C122.118 14.5086 121.638 14.62 121.346 14.8429C121.055 15.0486 120.909 15.3143 120.909 15.64C120.909 16.1371 121.123 16.48 121.552 16.6686C121.981 16.8571 122.486 17.0286 123.069 17.1829C123.498 17.2857 123.943 17.4143 124.406 17.5686C124.869 17.7057 125.298 17.9114 125.692 18.1857C126.086 18.4429 126.403 18.8114 126.643 19.2914C126.901 19.7714 127.029 20.3886 127.029 21.1429C127.012 22.1886 126.729 23.02 126.181 23.6371C125.632 24.2543 124.921 24.7 124.046 24.9743C123.172 25.2486 122.238 25.3857 121.243 25.3857ZM135.114 25.5143C133.606 25.5143 132.483 25.1629 131.746 24.46C131.009 23.74 130.64 22.7286 130.64 21.4257V14.92H128.737V11.9886H130.64V8.41429H134.651V11.9886H137.506V14.92H134.651V20.9371C134.651 21.3829 134.746 21.7171 134.934 21.94C135.123 22.1457 135.44 22.2486 135.886 22.2486C136.486 22.2486 137.026 22.0686 137.506 21.7086V24.9743C137.129 25.18 136.734 25.3171 136.323 25.3857C135.911 25.4714 135.509 25.5143 135.114 25.5143Z" fill="#FF7A00"/>
<defs>
<linearGradient id="paint0_linear_11_315" x1="18.701" y1="9.88904" x2="18.701" y2="28.3943" gradientUnits="userSpaceOnUse">
<stop stop-color="#FFBC80"/>
<stop offset="0.4375" stop-color="#FF7A00"/>
<stop offset="1" stop-color="#FF7A00"/>
</linearGradient>
</defs>
</svg>
