<svg width="258" height="210" viewBox="0 0 258 210" fill="none" xmlns="http://www.w3.org/2000/svg">
<g clip-path="url(#clip0_25_646)">
<path opacity="0.1" d="M252.334 209.216C254.514 207.041 251.99 200.997 246.697 195.717C241.404 190.436 235.346 187.919 233.166 190.094C230.986 192.269 233.509 198.313 238.802 203.594C244.095 208.874 250.153 211.392 252.334 209.216Z" fill="#FF7A00"/>
<path d="M243.709 200.538C245.364 200.538 246.706 198.785 246.706 196.623C246.706 194.461 245.364 192.709 243.709 192.709C242.054 192.709 240.712 194.461 240.712 196.623C240.712 198.785 242.054 200.538 243.709 200.538Z" fill="#3F3D56"/>
<path d="M243.709 195.754C245.364 195.754 246.706 194.001 246.706 191.839C246.706 189.677 245.364 187.925 243.709 187.925C242.054 187.925 240.712 189.677 240.712 191.839C240.712 194.001 242.054 195.754 243.709 195.754Z" fill="#3F3D56"/>
<path d="M243.709 190.97C245.364 190.97 246.706 189.217 246.706 187.056C246.706 184.894 245.364 183.141 243.709 183.141C242.054 183.141 240.712 184.894 240.712 187.056C240.712 189.217 242.054 190.97 243.709 190.97Z" fill="#3F3D56"/>
<path d="M243.709 186.186C245.364 186.186 246.706 184.434 246.706 182.272C246.706 180.11 245.364 178.357 243.709 178.357C242.054 178.357 240.712 180.11 240.712 182.272C240.712 184.434 242.054 186.186 243.709 186.186Z" fill="#3F3D56"/>
<path d="M243.709 181.402C245.364 181.402 246.706 179.65 246.706 177.488C246.706 175.326 245.364 173.573 243.709 173.573C242.054 173.573 240.712 175.326 240.712 177.488C240.712 179.65 242.054 181.402 243.709 181.402Z" fill="#3F3D56"/>
<path d="M243.709 176.618C245.364 176.618 246.706 174.866 246.706 172.704C246.706 170.542 245.364 168.789 243.709 168.789C242.054 168.789 240.712 170.542 240.712 172.704C240.712 174.866 242.054 176.618 243.709 176.618Z" fill="#3F3D56"/>
<path d="M243.709 171.834C245.364 171.834 246.706 170.082 246.706 167.92C246.706 165.758 245.364 164.005 243.709 164.005C242.054 164.005 240.712 165.758 240.712 167.92C240.712 170.082 242.054 171.834 243.709 171.834Z" fill="#3F3D56"/>
<path d="M254.928 135.182C255.338 134.662 255.711 134.115 256.045 133.543L248.169 132.253L256.687 132.315C257.505 130.541 257.951 128.62 257.999 126.669C258.047 124.718 257.696 122.778 256.967 120.966L245.541 126.882L256.073 119.153C255.086 117.449 253.759 115.966 252.173 114.797C250.586 113.628 248.776 112.797 246.854 112.357C244.932 111.917 242.939 111.876 241.001 112.238C239.062 112.6 237.219 113.356 235.586 114.46C233.954 115.564 232.567 116.991 231.511 118.653C230.456 120.315 229.755 122.176 229.453 124.121C229.15 126.065 229.252 128.05 229.753 129.953C230.253 131.856 231.142 133.636 232.362 135.182C231.724 135.99 231.175 136.866 230.725 137.792L240.947 143.086L230.055 139.436C229.29 141.693 229.102 144.105 229.506 146.453C229.91 148.802 230.895 151.012 232.37 152.885C230.705 154.998 229.669 157.535 229.381 160.207C229.092 162.88 229.564 165.579 230.741 167.996C231.918 170.414 233.753 172.452 236.036 173.878C238.32 175.304 240.959 176.06 243.653 176.06C246.347 176.06 248.987 175.304 251.27 173.878C253.554 172.452 255.389 170.414 256.566 167.996C257.743 165.579 258.214 162.88 257.926 160.207C257.638 157.535 256.602 154.998 254.936 152.885C256.926 150.361 258.008 147.242 258.008 144.031C258.008 140.819 256.926 137.701 254.936 135.176L254.928 135.182Z" fill="#FF7A00"/>
<path opacity="0.1" d="M229.29 144.036C229.284 147.249 230.367 150.369 232.362 152.891C230.696 155.003 229.66 157.541 229.372 160.213C229.084 162.885 229.555 165.584 230.732 168.002C231.909 170.419 233.744 172.457 236.028 173.883C238.311 175.31 240.951 176.066 243.645 176.066C246.339 176.066 248.978 175.31 251.262 173.883C253.545 172.457 255.38 170.419 256.557 168.002C257.734 165.584 258.206 162.885 257.918 160.213C257.629 157.541 256.593 155.003 254.928 152.891C256.852 150.456 229.29 142.429 229.29 144.036Z" fill="black"/>
<path d="M236.543 0V200.608L168.398 191.135L85.5605 207.994L84.893 208.13L18.9827 190.02V15.6028L87.4066 0L162.254 15.6028L165.1 15.0038L236.543 0Z" fill="#444053"/>
<path d="M225.092 10.9554V190.446L164.122 181.971L90.004 197.055L89.4064 197.175L30.4333 180.973V24.9144L91.6574 10.9554L158.623 24.9144L161.17 24.3794L225.092 10.9554Z" fill="white"/>
<path opacity="0.1" d="M168.398 191.135L85.5605 207.994L87.4066 0L162.254 15.6028L165.1 15.0038L168.398 191.135Z" fill="black"/>
<g opacity="0.3">
<path opacity="0.3" d="M160.126 38.4498L160.159 96.8211H184.457V72.8596H226.07L230.957 66.6073" stroke="#444053" stroke-width="3" stroke-miterlimit="10"/>
<path opacity="0.3" d="M24.8477 56.9782H115.195L120.781 54.4706H123.015V110.752H162.114L163.79 115.767V141.122H193.952V172.467" stroke="#444053" stroke-width="3" stroke-miterlimit="10"/>
<path opacity="0.3" d="M134.949 172.467V110.752" stroke="#444053" stroke-width="3" stroke-miterlimit="10"/>
<path opacity="0.3" d="M230.957 155.934H134.949" stroke="#444053" stroke-width="3" stroke-miterlimit="10"/>
<path opacity="0.3" d="M206.911 38.4498V172.467" stroke="#444053" stroke-width="3" stroke-miterlimit="10"/>
<path opacity="0.3" d="M24.5684 144.086H230.957" stroke="#444053" stroke-width="3" stroke-miterlimit="10"/>
<path opacity="0.3" d="M49.687 172.467V38.4498" stroke="#444053" stroke-width="3" stroke-miterlimit="10"/>
<path opacity="0.3" d="M97.6619 38.4498V172.467" stroke="#444053" stroke-width="3" stroke-miterlimit="10"/>
<path opacity="0.3" d="M24.8477 72.3024L184.457 72.8596" stroke="#444053" stroke-width="3" stroke-miterlimit="10"/>
<path opacity="0.3" d="M71.3005 38.6923V172.467" stroke="#444053" stroke-width="3" stroke-miterlimit="10"/>
<path opacity="0.3" d="M24.5684 103.318H97.6619L134.949 144.086" stroke="#444053" stroke-width="3" stroke-miterlimit="10"/>
<path opacity="0.3" d="M143.025 38.4498V110.752" stroke="#444053" stroke-width="3" stroke-miterlimit="10"/>
<path opacity="0.3" d="M134.949 123.703H230.957" stroke="#444053" stroke-width="3" stroke-miterlimit="10"/>
</g>
<path d="M163.651 123.151H135.443V110.892L162.114 110.752L163.79 115.489L163.651 123.151Z" fill="#FF7A00"/>
<path d="M149.686 59.6251C145.592 59.6251 141.665 61.2478 138.77 64.1363C135.874 67.0248 134.248 70.9424 134.248 75.0273C134.248 83.5336 149.686 111.17 149.686 111.17C149.686 111.17 165.125 83.5448 165.125 75.0273C165.125 70.9424 163.499 67.0248 160.603 64.1363C157.708 61.2478 153.781 59.6251 149.686 59.6251ZM149.686 81.5972C148.343 81.5972 147.03 81.1998 145.913 80.4552C144.796 79.7107 143.925 78.6524 143.411 77.4142C142.897 76.1761 142.763 74.8136 143.025 73.4992C143.287 72.1848 143.934 70.9774 144.884 70.0297C145.834 69.0821 147.044 68.4367 148.361 68.1753C149.679 67.9138 151.045 68.048 152.286 68.5609C153.527 69.0737 154.588 69.9422 155.334 71.0566C156.08 72.1709 156.479 73.481 156.479 74.8211C156.478 76.6178 155.762 78.3406 154.488 79.6108C153.215 80.8809 151.487 81.5944 149.686 81.5944V81.5972Z" fill="#FF7A00"/>
<path opacity="0.1" d="M149.686 59.6251C145.592 59.6251 141.665 61.2478 138.77 64.1363C135.874 67.0248 134.248 70.9424 134.248 75.0273C134.248 83.5336 149.686 111.17 149.686 111.17C149.686 111.17 165.125 83.5448 165.125 75.0273C165.125 70.9424 163.499 67.0248 160.603 64.1363C157.708 61.2478 153.781 59.6251 149.686 59.6251ZM149.686 81.5972C148.343 81.5972 147.03 81.1998 145.913 80.4552C144.796 79.7107 143.925 78.6524 143.411 77.4142C142.897 76.1761 142.763 74.8136 143.025 73.4992C143.287 72.1848 143.934 70.9774 144.884 70.0297C145.834 69.0821 147.044 68.4367 148.361 68.1753C149.679 67.9138 151.045 68.048 152.286 68.5609C153.527 69.0737 154.588 69.9422 155.334 71.0566C156.08 72.1709 156.479 73.481 156.479 74.8211C156.478 76.6178 155.762 78.3406 154.488 79.6108C153.215 80.8809 151.487 81.5944 149.686 81.5944V81.5972Z" fill="black"/>
<path d="M149.686 61.854C145.592 61.854 141.665 63.4767 138.77 66.3652C135.874 69.2537 134.248 73.1713 134.248 77.2562C134.248 85.7625 149.686 113.399 149.686 113.399C149.686 113.399 165.125 85.7737 165.125 77.2562C165.125 73.1713 163.499 69.2537 160.603 66.3652C157.708 63.4767 153.781 61.854 149.686 61.854ZM149.686 83.8261C148.343 83.8261 147.03 83.4287 145.913 82.6841C144.796 81.9396 143.925 80.8813 143.411 79.6431C142.897 78.405 142.763 77.0425 143.025 75.7281C143.287 74.4137 143.934 73.2063 144.884 72.2586C145.834 71.311 147.044 70.6656 148.361 70.4042C149.679 70.1427 151.045 70.2769 152.286 70.7898C153.527 71.3026 154.588 72.1711 155.334 73.2854C156.08 74.3998 156.479 75.7099 156.479 77.05C156.478 78.8467 155.762 80.5695 154.488 81.8397C153.215 83.1098 151.487 83.8233 149.686 83.8233V83.8261Z" fill="#FF7A00"/>
<path opacity="0.1" d="M144.453 207.873C149.192 205.837 152.352 202.607 151.511 200.66C150.671 198.712 146.148 198.784 141.409 200.82C136.67 202.856 133.51 206.085 134.351 208.033C135.192 209.98 139.715 209.909 144.453 207.873Z" fill="#FF7A00"/>
<path d="M142.822 205.525C143.963 205.525 144.888 204.318 144.888 202.828C144.888 201.339 143.963 200.131 142.822 200.131C141.68 200.131 140.755 201.339 140.755 202.828C140.755 204.318 141.68 205.525 142.822 205.525Z" fill="#3F3D56"/>
<path d="M142.822 202.226C143.963 202.226 144.888 201.019 144.888 199.529C144.888 198.04 143.963 196.832 142.822 196.832C141.68 196.832 140.755 198.04 140.755 199.529C140.755 201.019 141.68 202.226 142.822 202.226Z" fill="#3F3D56"/>
<path d="M142.822 198.93C143.963 198.93 144.888 197.723 144.888 196.233C144.888 194.744 143.963 193.536 142.822 193.536C141.68 193.536 140.755 194.744 140.755 196.233C140.755 197.723 141.68 198.93 142.822 198.93Z" fill="#3F3D56"/>
<path d="M142.822 195.634C143.963 195.634 144.888 194.427 144.888 192.937C144.888 191.448 143.963 190.24 142.822 190.24C141.68 190.24 140.755 191.448 140.755 192.937C140.755 194.427 141.68 195.634 142.822 195.634Z" fill="#3F3D56"/>
<path d="M142.822 192.335C143.963 192.335 144.888 191.128 144.888 189.638C144.888 188.149 143.963 186.941 142.822 186.941C141.68 186.941 140.755 188.149 140.755 189.638C140.755 191.128 141.68 192.335 142.822 192.335Z" fill="#3F3D56"/>
<path d="M142.822 189.039C143.963 189.039 144.888 187.832 144.888 186.342C144.888 184.853 143.963 183.645 142.822 183.645C141.68 183.645 140.755 184.853 140.755 186.342C140.755 187.832 141.68 189.039 142.822 189.039Z" fill="#3F3D56"/>
<path d="M142.822 185.743C143.963 185.743 144.888 184.536 144.888 183.046C144.888 181.557 143.963 180.349 142.822 180.349C141.68 180.349 140.755 181.557 140.755 183.046C140.755 184.536 141.68 185.743 142.822 185.743Z" fill="#3F3D56"/>
<path d="M135.088 160.481C134.807 160.127 134.549 159.754 134.317 159.366L139.747 158.474L133.882 158.519C133.319 157.297 133.013 155.973 132.98 154.628C132.947 153.283 133.189 151.946 133.692 150.698L141.568 154.76L134.306 149.433C134.986 148.259 135.902 147.238 136.995 146.433C138.088 145.627 139.336 145.055 140.66 144.752C141.985 144.449 143.358 144.421 144.693 144.67C146.029 144.92 147.299 145.441 148.424 146.201C149.549 146.962 150.505 147.946 151.232 149.091C151.959 150.236 152.442 151.519 152.651 152.858C152.859 154.198 152.789 155.566 152.444 156.878C152.1 158.189 151.488 159.415 150.647 160.481C151.083 161.039 151.457 161.642 151.764 162.28L144.724 165.933L152.236 163.426C152.764 164.981 152.894 166.643 152.616 168.262C152.337 169.881 151.659 171.404 150.641 172.695C151.79 174.151 152.504 175.9 152.703 177.742C152.902 179.584 152.577 181.445 151.766 183.112C150.955 184.778 149.69 186.183 148.116 187.166C146.542 188.149 144.722 188.671 142.865 188.671C141.008 188.671 139.188 188.149 137.614 187.166C136.04 186.183 134.775 184.778 133.964 183.112C133.153 181.445 132.828 179.584 133.027 177.742C133.226 175.9 133.94 174.151 135.088 172.695C133.717 170.955 132.971 168.806 132.971 166.592C132.971 164.378 133.717 162.229 135.088 160.489V160.481Z" fill="#FF7A00"/>
<path opacity="0.1" d="M152.758 166.574C152.762 168.789 152.016 170.94 150.642 172.679C151.79 174.135 152.504 175.884 152.703 177.726C152.902 179.568 152.577 181.428 151.766 183.095C150.955 184.761 149.69 186.167 148.116 187.15C146.542 188.133 144.722 188.654 142.865 188.654C141.008 188.654 139.188 188.133 137.614 187.15C136.04 186.167 134.775 184.761 133.964 183.095C133.153 181.428 132.828 179.568 133.027 177.726C133.226 175.884 133.94 174.135 135.088 172.679C133.762 171.007 152.758 165.476 152.758 166.574Z" fill="black"/>
<path opacity="0.1" d="M23.0434 203.086C25.2237 200.911 22.7003 194.867 17.4073 189.587C12.1143 184.306 6.05611 181.789 3.87588 183.964C1.69565 186.139 4.21902 192.183 9.512 197.463C14.805 202.744 20.8632 205.261 23.0434 203.086Z" fill="#FF7A00"/>
<path d="M14.4193 194.408C16.0743 194.408 17.416 192.656 17.416 190.494C17.416 188.332 16.0743 186.579 14.4193 186.579C12.7643 186.579 11.4226 188.332 11.4226 190.494C11.4226 192.656 12.7643 194.408 14.4193 194.408Z" fill="#3F3D56"/>
<path d="M14.4193 189.624C16.0743 189.624 17.416 187.872 17.416 185.71C17.416 183.548 16.0743 181.795 14.4193 181.795C12.7643 181.795 11.4226 183.548 11.4226 185.71C11.4226 187.872 12.7643 189.624 14.4193 189.624Z" fill="#3F3D56"/>
<path d="M14.4193 184.84C16.0743 184.84 17.416 183.088 17.416 180.926C17.416 178.764 16.0743 177.011 14.4193 177.011C12.7643 177.011 11.4226 178.764 11.4226 180.926C11.4226 183.088 12.7643 184.84 14.4193 184.84Z" fill="#3F3D56"/>
<path d="M14.4193 180.057C16.0743 180.057 17.416 178.304 17.416 176.142C17.416 173.98 16.0743 172.227 14.4193 172.227C12.7643 172.227 11.4226 173.98 11.4226 176.142C11.4226 178.304 12.7643 180.057 14.4193 180.057Z" fill="#3F3D56"/>
<path d="M14.4193 175.273C16.0743 175.273 17.416 173.52 17.416 171.358C17.416 169.196 16.0743 167.443 14.4193 167.443C12.7643 167.443 11.4226 169.196 11.4226 171.358C11.4226 173.52 12.7643 175.273 14.4193 175.273Z" fill="#3F3D56"/>
<path d="M14.4193 170.489C16.0743 170.489 17.416 168.736 17.416 166.574C17.416 164.412 16.0743 162.659 14.4193 162.659C12.7643 162.659 11.4226 164.412 11.4226 166.574C11.4226 168.736 12.7643 170.489 14.4193 170.489Z" fill="#3F3D56"/>
<path d="M14.4193 165.705C16.0743 165.705 17.416 163.952 17.416 161.79C17.416 159.628 16.0743 157.875 14.4193 157.875C12.7643 157.875 11.4226 159.628 11.4226 161.79C11.4226 163.952 12.7643 165.705 14.4193 165.705Z" fill="#3F3D56"/>
<path d="M25.6381 129.052C26.0482 128.532 26.4214 127.985 26.7552 127.414L18.8795 126.124L27.3976 126.185C28.2147 124.412 28.6609 122.491 28.7089 120.54C28.757 118.588 28.4058 116.648 27.6769 114.837L16.2515 120.752L26.7832 113.023C25.7967 111.319 24.4689 109.837 22.8827 108.667C21.2966 107.498 19.486 106.668 17.5638 106.227C15.6417 105.787 13.6493 105.747 11.7107 106.108C9.77221 106.47 7.92918 107.226 6.29656 108.33C4.66393 109.434 3.27673 110.861 2.22143 112.523C1.16613 114.185 0.465371 116.047 0.16285 117.991C-0.139672 119.935 -0.0374687 121.921 0.463081 123.824C0.96363 125.727 1.8518 127.506 3.0722 129.052C2.43378 129.861 1.88505 130.736 1.43561 131.663L11.6573 136.957L0.765331 133.307C0.00054107 135.564 -0.188271 137.975 0.215969 140.324C0.62021 142.672 1.60475 144.882 3.08057 146.756C1.41508 148.868 0.379012 151.405 0.0908434 154.078C-0.197325 156.75 0.27403 159.449 1.45102 161.866C2.62801 164.284 4.46312 166.322 6.74656 167.748C9.02999 169.174 11.6696 169.931 14.3635 169.931C17.0575 169.931 19.6971 169.174 21.9805 167.748C24.2639 166.322 26.0991 164.284 27.2761 161.866C28.453 159.449 28.9244 156.75 28.6362 154.078C28.3481 151.405 27.312 148.868 25.6465 146.756C27.6365 144.231 28.7184 141.113 28.7184 137.901C28.7184 134.689 27.6365 131.571 25.6465 129.046L25.6381 129.052Z" fill="#FF7A00"/>
<path opacity="0.1" d="M2.00833e-05 137.907C-0.00537702 141.119 1.07717 144.239 3.07211 146.761C1.40661 148.874 0.37055 151.411 0.082382 154.083C-0.205786 156.755 0.265568 159.454 1.44256 161.872C2.61955 164.289 4.45466 166.328 6.7381 167.754C9.02153 169.18 11.6611 169.936 14.3551 169.936C17.049 169.936 19.6886 169.18 21.972 167.754C24.2555 166.328 26.0906 164.289 27.2676 161.872C28.4446 159.454 28.9159 156.755 28.6278 154.083C28.3396 151.411 27.3035 148.874 25.638 146.761C27.5623 144.326 2.00833e-05 136.299 2.00833e-05 137.907Z" fill="black"/>
</g>
<defs>
<clipPath id="clip0_25_646">
<rect width="258" height="210" fill="white"/>
</clipPath>
</defs>
</svg>
