<svg width="18" height="13" viewBox="0 0 18 13" fill="none" xmlns="http://www.w3.org/2000/svg">
<path d="M3 3H15" stroke="#0D114F" stroke-width="5" stroke-linecap="square"/>
<path d="M3 10H15" stroke="#0D114F" stroke-width="5" stroke-linecap="square"/>
</svg>
