{
  "_format": "hh-sol-artifact-1",
  "contractName": "EnumerableSet",
  "sourceName": "@openzeppelin/contracts/utils/structs/EnumerableSet.sol",
  "abi": [],
  "bytecode": "0x60566037600b82828239805160001a607314602a57634e487b7160e01b600052600060045260246000fd5b30600052607381538281f3fe73000000000000000000000000000000000000000030146080604052600080fdfea2646970667358221220592e5124e183c971fe262f038a04d95b450105842ffa81e88314af23d7cd169564736f6c63430008040033",
  "deployedBytecode": "0x73000000000000000000000000000000000000000030146080604052600080fdfea2646970667358221220592e5124e183c971fe262f038a04d95b450105842ffa81e88314af23d7cd169564736f6c63430008040033",
  "linkReferences": {},
  "deployedLinkReferences": {}
}
