{
  "_format": "hh-sol-artifact-1",
  "contractName": "SafeTransferLib",
  "sourceName": "solmate/src/utils/SafeTransferLib.sol",
  "abi": [],
  "bytecode": "0x60566037600b82828239805160001a607314602a57634e487b7160e01b600052600060045260246000fd5b30600052607381538281f3fe73000000000000000000000000000000000000000030146080604052600080fdfea2646970667358221220f0de78897c1872add829d7f541578f606b8f0f0a1668631e6ff74efd6ca54cdf64736f6c63430008040033",
  "deployedBytecode": "0x73000000000000000000000000000000000000000030146080604052600080fdfea2646970667358221220f0de78897c1872add829d7f541578f606b8f0f0a1668631e6ff74efd6ca54cdf64736f6c63430008040033",
  "linkReferences": {},
  "deployedLinkReferences": {}
}
