{
  "_format": "hh-sol-artifact-1",
  "contractName": "LSSVMPairCloner",
  "sourceName": "contracts/lib/LSSVMPairCloner.sol",
  "abi": [],
  "bytecode": "0x60566037600b82828239805160001a607314602a57634e487b7160e01b600052600060045260246000fd5b30600052607381538281f3fe73000000000000000000000000000000000000000030146080604052600080fdfea26469706673582212203523928ed703930e73ce94b8f0dcb6b34033cb5c584d117b480c58f008097ec464736f6c63430008040033",
  "deployedBytecode": "0x73000000000000000000000000000000000000000030146080604052600080fdfea26469706673582212203523928ed703930e73ce94b8f0dcb6b34033cb5c584d117b480c58f008097ec464736f6c63430008040033",
  "linkReferences": {},
  "deployedLinkReferences": {}
}
