// Jest Snapshot v1, https://goo.gl/fbAQLP

exports[`Test for Button Component should render the Button (Snapshot test) 1`] = `
<DocumentFragment>
  <button
    style="background-color: red;"
  >
    Test Button
  </button>
</DocumentFragment>
`;
