// Jest Snapshot v1, https://goo.gl/fbAQLP

exports[`Tests for Item Component should render the item (Snapshot) when removeButton is false 1`] = `
<DocumentFragment>
  <div
    class="itemCards"
  >
    <div
      class="itemCards__starIcon__wrapper"
      data-testid="star-icon-wrapper"
    >
      <svg
        viewBox="0 0 24 24"
        xmlns="http://www.w3.org/2000/svg"
      >
        <path
          d="M12,17.27L18.18,21L16.54,13.97L22,9.24L14.81,8.62L12,2L9.19,8.62L2,9.24L7.45,13.97L5.82,21L12,17.27Z"
          style="fill: grey;"
        />
      </svg>
    </div>
    <div
      class="itemCards__cover__wrapper"
    >
      <img
        alt="Test Item img"
        src="https://cdn.pixabay.com/photo/2015/04/23/22/00/tree-736885_1280.jpg"
      />
    </div>
    <div
      class="itemCards__content__wrapper"
    >
      <h3>
        Test Item
      </h3>
      <p>
        Item: 123
      </p>
      <p>
        Color: red
      </p>
    </div>
    <div
      class="itemCards__price__wrapper"
    >
      <span>
        $100
      </span>
    </div>
    <div
      class="itemCards__addToCard__wrapper"
    >
      <button
        style="background-color: rgb(77, 30, 64);"
      >
        Add to Cart
      </button>
    </div>
  </div>
</DocumentFragment>
`;

exports[`Tests for Item Component should render the item (Snapshot) when removeButton is true 1`] = `
<DocumentFragment>
  <div
    class="itemCards"
  >
    <div
      class="itemCards__starIcon__wrapper"
      data-testid="star-icon-wrapper"
    >
      <svg
        viewBox="0 0 24 24"
        xmlns="http://www.w3.org/2000/svg"
      >
        <path
          d="M12,17.27L18.18,21L16.54,13.97L22,9.24L14.81,8.62L12,2L9.19,8.62L2,9.24L7.45,13.97L5.82,21L12,17.27Z"
          style="fill: grey;"
        />
      </svg>
    </div>
    <div
      class="itemCards__cover__wrapper"
    >
      <img
        alt="Test Item img"
        src="https://cdn.pixabay.com/photo/2015/04/23/22/00/tree-736885_1280.jpg"
      />
    </div>
    <div
      class="itemCards__content__wrapper"
    >
      <h3>
        Test Item
      </h3>
      <p>
        Item: 123
      </p>
      <p>
        Color: red
      </p>
    </div>
    <div
      class="itemCards__price__wrapper"
    >
      <span>
        $100
      </span>
    </div>
    <div
      class="itemCards__addToCard__wrapper"
    >
      <button
        style="background-color: rgb(77, 30, 64);"
      >
        Add to Cart
      </button>
    </div>
    <button
      class="itemCards__removeCartButton"
      data-testid="removeFromCart-button"
    >
      <svg
        viewBox="0 0 24 24"
        xmlns="http://www.w3.org/2000/svg"
      >
        <path
          d="M13.46,12L19,17.54V19H17.54L12,13.46L6.46,19H5V17.54L10.54,12L5,6.46V5H6.46L12,10.54L17.54,5H19V6.46L13.46,12Z"
        />
      </svg>
    </button>
  </div>
</DocumentFragment>
`;

exports[`Tests for Item Component should render the item (Snapshot) with default props 1`] = `
<DocumentFragment>
  <div
    class="itemCards"
  >
    <div
      class="itemCards__starIcon__wrapper"
      data-testid="star-icon-wrapper"
    >
      <svg
        viewBox="0 0 24 24"
        xmlns="http://www.w3.org/2000/svg"
      >
        <path
          d="M12,17.27L18.18,21L16.54,13.97L22,9.24L14.81,8.62L12,2L9.19,8.62L2,9.24L7.45,13.97L5.82,21L12,17.27Z"
          style="fill: grey;"
        />
      </svg>
    </div>
    <div
      class="itemCards__cover__wrapper"
    >
      <img
        alt="Test Item img"
        src="https://cdn.pixabay.com/photo/2015/04/23/22/00/tree-736885_1280.jpg"
      />
    </div>
    <div
      class="itemCards__content__wrapper"
    >
      <h3>
        Test Item
      </h3>
      <p>
        Item: 123
      </p>
      <p>
        Color: red
      </p>
    </div>
    <div
      class="itemCards__price__wrapper"
    >
      <span>
        $100
      </span>
    </div>
    <div
      class="itemCards__addToCard__wrapper"
    >
      <button
        style="background-color: rgb(77, 30, 64);"
      >
        Add to Cart
      </button>
    </div>
  </div>
</DocumentFragment>
`;
