_a: m <-> 0.142511 | d <-> 0.28488 | l <-> 0.28488 | u <-> 0.142511 | n <-> 0.142511
_c: o <-> 0.498174 | i <-> 0.166169 | u <-> 0.332171
_d: o <-> 0.711987 | u <-> 0.142511 | e <-> 0.142511
_e: l <-> 0.0908019 | i <-> 0.0908019 | t <-> 0.0908019 | n <-> 0.0908019 | x <-> 0.272224 | a <-> 0.0908019 | s <-> 0.181513 | u <-> 0.0908019
_f: u <-> 0.977539
_i: p <-> 0.142511 | n <-> 0.569618 | r <-> 0.142511 | d <-> 0.142511
_l: a <-> 0.992394
_m: a <-> 0.331019 | i <-> 0.331019 | o <-> 0.331019
_n: o <-> 0.497266 | i <-> 0.248757 | u <-> 0.248757
_o: c <-> 0.494565 | f <-> 0.494565
_p: a <-> 0.494565 | r <-> 0.494565
_q: u <-> 0.988636
_r: e <-> 0.977539
_s: i <-> 0.497266 | e <-> 0.248757 | u <-> 0.248757
_t: e <-> 0.977539
_u: t <-> 0.745775 | l <-> 0.248757
_v: e <-> 0.661706 | o <-> 0.331019
,_: c <-> 0.248757 | s <-> 0.497266 | q <-> 0.248757
._: u <-> 0.331019 | d <-> 0.331019 | e <-> 0.331019
a_: a <-> 0.199244 | c <-> 0.199244 | p <-> 0.199244 | q <-> 0.199244 | d <-> 0.199244
a.: _ <-> 0.977539
ab: o <-> 0.992394
ad: i <-> 0.494565 | _ <-> 0.494565
ae: c <-> 0.977539
ag: n <-> 0.977539
al: i <-> 0.988636
am: e <-> 0.331019 | , <-> 0.331019 | c <-> 0.331019
an: i <-> 0.977539
ar: i <-> 0.977539
at: i <-> 0.124751 | . <-> 0.124751 | e <-> 0.124751 | _ <-> 0.374003 | u <-> 0.124751 | a <-> 0.124751
au: t <-> 0.977539
bo: r <-> 0.992394
ca: e <-> 0.494565 | t <-> 0.494565
cc: a <-> 0.977539
ce: p <-> 0.977539
ci: n <-> 0.199244 | d <-> 0.199244 | t <-> 0.199244 | l <-> 0.199244 | a <-> 0.199244
co: n <-> 0.497266 | _ <-> 0.248757 | m <-> 0.248757
ct: e <-> 0.977539
cu: p <-> 0.494565 | l <-> 0.494565
d_: d <-> 0.199244 | t <-> 0.199244 | m <-> 0.199244 | e <-> 0.398288
da: t <-> 0.977539
de: r <-> 0.331019 | n <-> 0.331019 | s <-> 0.331019
di: p <-> 0.494565 | d <-> 0.494565
do: l <-> 0.664177 | _ <-> 0.332171
du: n <-> 0.494565 | i <-> 0.494565
e_: e <-> 0.28488 | m <-> 0.142511 | i <-> 0.142511 | d <-> 0.142511 | v <-> 0.142511 | c <-> 0.142511
ea: _ <-> 0.977539
ec: t <-> 0.494565 | a <-> 0.494565
ed: _ <-> 0.977539
eh: e <-> 0.977539
ei: u <-> 0.977539
el: i <-> 0.988636
em: _ <-> 0.494565 | p <-> 0.494565
en: i <-> 0.497266 | d <-> 0.248757 | t <-> 0.248757
ep: r <-> 0.494565 | t <-> 0.494565
eq: u <-> 0.977539
er: c <-> 0.331019 | i <-> 0.331019 | u <-> 0.331019
es: s <-> 0.331019 | e <-> 0.331019 | t <-> 0.331019
et: , <-> 0.331019 | u <-> 0.331019 | _ <-> 0.331019
eu: _ <-> 0.494565 | r <-> 0.494565
ex: e <-> 0.331019 | _ <-> 0.331019 | c <-> 0.331019
ff: i <-> 0.977539
fi: c <-> 0.977539
fu: g <-> 0.977539
g_: e <-> 0.977539
gi: a <-> 0.977539
gn: a <-> 0.977539
he: n <-> 0.977539
i_: u <-> 0.494565 | o <-> 0.494565
ia: m <-> 0.248757 | t <-> 0.497266 | _ <-> 0.248757
ic: i <-> 0.977539
id: i <-> 0.199244 | u <-> 0.199244 | a <-> 0.199244 | e <-> 0.199244 | _ <-> 0.199244
il: l <-> 0.977539
im: _ <-> 0.992394
in: g <-> 0.142511 | c <-> 0.142511 | i <-> 0.142511 | _ <-> 0.427249 | t <-> 0.142511
io: n <-> 0.977539
ip: s <-> 0.331019 | i <-> 0.331019 | _ <-> 0.331019
iq: u <-> 0.988636
ir: u <-> 0.977539
is: c <-> 0.199244 | _ <-> 0.597333 | i <-> 0.199244
it: _ <-> 0.664177 | , <-> 0.166169 | a <-> 0.166169
iu: s <-> 0.977539
la: b <-> 0.597333 | m <-> 0.199244 | _ <-> 0.199244
li: t <-> 0.597333 | q <-> 0.398288
ll: a <-> 0.497266 | u <-> 0.248757 | i <-> 0.248757
lo: r <-> 0.995422
lp: a <-> 0.977539
lu: p <-> 0.494565 | m <-> 0.494565
m_: i <-> 0.332171 | d <-> 0.332171 | a <-> 0.166169 | v <-> 0.166169
m,: _ <-> 0.977539
m.: . <-> 0.977539
ma: g <-> 0.977539
mc: o <-> 0.977539
me: t <-> 0.977539
mi: n <-> 0.977539
mm: o <-> 0.977539
mo: d <-> 0.661706 | l <-> 0.331019
mp: o <-> 0.977539
n_: u <-> 0.199244 | r <-> 0.199244 | v <-> 0.199244 | p <-> 0.199244 | c <-> 0.199244
na: _ <-> 0.977539
nc: i <-> 0.977539
nd: e <-> 0.977539
ng: _ <-> 0.977539
ni: m <-> 0.597333 | a <-> 0.199244 | s <-> 0.199244
no: s <-> 0.494565 | n <-> 0.494565
ns: e <-> 0.988636
nt: _ <-> 0.796377 | , <-> 0.199244
nu: l <-> 0.977539
o_: e <-> 0.331019 | l <-> 0.331019 | c <-> 0.331019
oc: c <-> 0.977539
od: _ <-> 0.494565 | o <-> 0.494565
of: f <-> 0.977539
oi: d <-> 0.977539
ol: o <-> 0.664177 | u <-> 0.166169 | l <-> 0.166169
om: m <-> 0.977539
on: s <-> 0.497266 | _ <-> 0.497266
or: e <-> 0.443373 | _ <-> 0.332558 | i <-> 0.110926 | u <-> 0.110926
os: t <-> 0.977539
p_: e <-> 0.977539
pa: r <-> 0.494565 | _ <-> 0.494565
pi: s <-> 0.494565 | d <-> 0.494565
po: r <-> 0.977539
pr: e <-> 0.494565 | o <-> 0.494565
ps: u <-> 0.977539
pt: a <-> 0.494565 | e <-> 0.494565
qu: a <-> 0.398288 | i <-> 0.597333
r_: s <-> 0.398288 | a <-> 0.199244 | i <-> 0.398288
r.: _ <-> 0.977539
rc: i <-> 0.977539
re: m <-> 0.142511 | _ <-> 0.569618 | p <-> 0.142511 | h <-> 0.142511
ri: s <-> 0.331019 | t <-> 0.331019 | a <-> 0.331019
ro: i <-> 0.977539
ru: d <-> 0.248757 | r <-> 0.248757 | n <-> 0.248757 | m <-> 0.248757
s_: n <-> 0.661706 | a <-> 0.331019
sc: i <-> 0.977539
se: c <-> 0.199244 | d <-> 0.199244 | q <-> 0.199244 | _ <-> 0.199244 | r <-> 0.199244
si: t <-> 0.331019 | _ <-> 0.331019 | n <-> 0.331019
sm: o <-> 0.977539
ss: e <-> 0.977539
st: r <-> 0.494565 | _ <-> 0.494565
su: m <-> 0.494565 | n <-> 0.494565
t_: a <-> 0.187282 | u <-> 0.0624688 | l <-> 0.124875 | d <-> 0.0624688 | e <-> 0.124875 | i <-> 0.124875 | n <-> 0.124875 | o <-> 0.0624688 | c <-> 0.0624688 | m <-> 0.0624688
t,: _ <-> 0.992394
t.: _ <-> 0.977539
ta: t <-> 0.992394
te: t <-> 0.199244 | m <-> 0.199244 | _ <-> 0.398288 | u <-> 0.199244
ti: o <-> 0.977539
tr: u <-> 0.977539
tu: r <-> 0.988636
u_: f <-> 0.977539
ua: . <-> 0.494565 | t <-> 0.494565
ud: _ <-> 0.977539
ug: i <-> 0.977539
ui: s <-> 0.497266 | p <-> 0.248757 | _ <-> 0.248757
ul: l <-> 0.661706 | p <-> 0.331019
um: _ <-> 0.661706 | . <-> 0.331019
un: t <-> 0.992394
up: t <-> 0.494565 | i <-> 0.494565
ur: _ <-> 0.497266 | e <-> 0.248757 | . <-> 0.248757
us: m <-> 0.977539
ut: _ <-> 0.745775 | e <-> 0.248757
ve: n <-> 0.494565 | l <-> 0.494565
vo: l <-> 0.977539
x_: e <-> 0.977539
xc: e <-> 0.977539
xe: r <-> 0.977539
Entropia: 0.920069