(kicad_symbol_lib
	(version 20231120)
	(generator "kicad_symbol_editor")
	(generator_version "8.0")
	(symbol "DIN_Rail_Adapter"
		(exclude_from_sim yes)
		(in_bom yes)
		(on_board yes)
		(property "Reference" "DRA"
			(at 0 6.35 0)
			(effects
				(font
					(size 1.27 1.27)
				)
			)
		)
		(property "Value" "DIN_Rail_Adapter"
			(at 0 3.81 0)
			(effects
				(font
					(size 1.27 1.27)
				)
			)
		)
		(property "Footprint" ""
			(at 0 -5.08 0)
			(effects
				(font
					(size 1.27 1.27)
				)
				(hide yes)
			)
		)
		(property "Datasheet" "~"
			(at 0 3.81 0)
			(effects
				(font
					(size 1.27 1.27)
				)
				(hide yes)
			)
		)
		(property "Description" "DIN Rail adapter universal, mounting holes without connection"
			(at 0 0 0)
			(effects
				(font
					(size 1.27 1.27)
				)
				(hide yes)
			)
		)
		(property "ki_keywords" "Mounting holes, DIN rail adapter"
			(at 0 0 0)
			(effects
				(font
					(size 1.27 1.27)
				)
				(hide yes)
			)
		)
		(property "ki_fp_filters" "DINRailAdapter?3xM3* DINRailAdapter?2xM3*"
			(at 0 0 0)
			(effects
				(font
					(size 1.27 1.27)
				)
				(hide yes)
			)
		)
		(symbol "DIN_Rail_Adapter_0_1"
			(polyline
				(pts
					(xy 10.16 2.54) (xy -10.16 2.54) (xy -10.16 -3.81) (xy -7.62 -3.81) (xy -7.62 -2.54) (xy -8.89 -2.54)
					(xy -8.89 -1.27) (xy 8.89 -1.27) (xy 8.89 -2.54) (xy 7.62 -2.54) (xy 7.62 -3.81) (xy 10.16 -3.81)
					(xy 10.16 2.54) (xy -10.16 2.54)
				)
				(stroke
					(width 0)
					(type default)
				)
				(fill
					(type background)
				)
			)
		)
	)
	(symbol "Fiducial"
		(exclude_from_sim yes)
		(in_bom no)
		(on_board yes)
		(property "Reference" "FID"
			(at 0 5.08 0)
			(effects
				(font
					(size 1.27 1.27)
				)
			)
		)
		(property "Value" "Fiducial"
			(at 0 3.175 0)
			(effects
				(font
					(size 1.27 1.27)
				)
			)
		)
		(property "Footprint" ""
			(at 0 0 0)
			(effects
				(font
					(size 1.27 1.27)
				)
				(hide yes)
			)
		)
		(property "Datasheet" "~"
			(at 0 0 0)
			(effects
				(font
					(size 1.27 1.27)
				)
				(hide yes)
			)
		)
		(property "Description" "Fiducial Marker"
			(at 0 0 0)
			(effects
				(font
					(size 1.27 1.27)
				)
				(hide yes)
			)
		)
		(property "ki_keywords" "fiducial marker"
			(at 0 0 0)
			(effects
				(font
					(size 1.27 1.27)
				)
				(hide yes)
			)
		)
		(property "ki_fp_filters" "Fiducial*"
			(at 0 0 0)
			(effects
				(font
					(size 1.27 1.27)
				)
				(hide yes)
			)
		)
		(symbol "Fiducial_0_1"
			(circle
				(center 0 0)
				(radius 1.27)
				(stroke
					(width 0.508)
					(type default)
				)
				(fill
					(type background)
				)
			)
		)
	)
	(symbol "Heatsink"
		(pin_names
			(offset 1.016)
		)
		(exclude_from_sim yes)
		(in_bom yes)
		(on_board yes)
		(property "Reference" "HS"
			(at 0 5.08 0)
			(effects
				(font
					(size 1.27 1.27)
				)
			)
		)
		(property "Value" "Heatsink"
			(at 0 -1.27 0)
			(effects
				(font
					(size 1.27 1.27)
				)
			)
		)
		(property "Footprint" ""
			(at 0.3048 0 0)
			(effects
				(font
					(size 1.27 1.27)
				)
				(hide yes)
			)
		)
		(property "Datasheet" "~"
			(at 0.3048 0 0)
			(effects
				(font
					(size 1.27 1.27)
				)
				(hide yes)
			)
		)
		(property "Description" "Heatsink"
			(at 0 0 0)
			(effects
				(font
					(size 1.27 1.27)
				)
				(hide yes)
			)
		)
		(property "ki_keywords" "thermal heat temperature"
			(at 0 0 0)
			(effects
				(font
					(size 1.27 1.27)
				)
				(hide yes)
			)
		)
		(property "ki_fp_filters" "Heatsink_*"
			(at 0 0 0)
			(effects
				(font
					(size 1.27 1.27)
				)
				(hide yes)
			)
		)
		(symbol "Heatsink_0_1"
			(polyline
				(pts
					(xy -0.3302 1.27) (xy -0.9652 1.27) (xy -0.9652 3.81) (xy -1.6002 3.81) (xy -1.6002 1.27) (xy -2.2352 1.27)
					(xy -2.2352 3.81) (xy -2.8702 3.81) (xy -2.8702 0) (xy -0.9652 0)
				)
				(stroke
					(width 0.254)
					(type default)
				)
				(fill
					(type background)
				)
			)
			(polyline
				(pts
					(xy -0.3302 1.27) (xy -0.3302 3.81) (xy 0.3048 3.81) (xy 0.3048 1.27) (xy 0.9398 1.27) (xy 0.9398 3.81)
					(xy 1.5748 3.81) (xy 1.5748 1.27) (xy 2.2098 1.27) (xy 2.2098 3.81) (xy 2.8448 3.81) (xy 2.8448 0)
					(xy -0.9652 0)
				)
				(stroke
					(width 0.254)
					(type default)
				)
				(fill
					(type background)
				)
			)
		)
	)
	(symbol "Heatsink_Pad"
		(pin_names
			(offset 0)
		)
		(exclude_from_sim yes)
		(in_bom yes)
		(on_board yes)
		(property "Reference" "HS"
			(at 0 5.715 0)
			(effects
				(font
					(size 1.27 1.27)
				)
			)
		)
		(property "Value" "Heatsink_Pad"
			(at 0 3.81 0)
			(effects
				(font
					(size 1.27 1.27)
				)
			)
		)
		(property "Footprint" ""
			(at 0.3048 -1.27 0)
			(effects
				(font
					(size 1.27 1.27)
				)
				(hide yes)
			)
		)
		(property "Datasheet" "~"
			(at 0.3048 -1.27 0)
			(effects
				(font
					(size 1.27 1.27)
				)
				(hide yes)
			)
		)
		(property "Description" "Heatsink with electrical connection, 1 pin"
			(at 0 0 0)
			(effects
				(font
					(size 1.27 1.27)
				)
				(hide yes)
			)
		)
		(property "ki_keywords" "thermal heat temperature"
			(at 0 0 0)
			(effects
				(font
					(size 1.27 1.27)
				)
				(hide yes)
			)
		)
		(property "ki_fp_filters" "Heatsink_*"
			(at 0 0 0)
			(effects
				(font
					(size 1.27 1.27)
				)
				(hide yes)
			)
		)
		(symbol "Heatsink_Pad_0_1"
			(polyline
				(pts
					(xy -0.3302 0) (xy -0.9652 0) (xy -0.9652 2.54) (xy -1.6002 2.54) (xy -1.6002 0) (xy -2.2352 0)
					(xy -2.2352 2.54) (xy -2.8702 2.54) (xy -2.8702 -1.27) (xy -0.9652 -1.27)
				)
				(stroke
					(width 0.254)
					(type default)
				)
				(fill
					(type background)
				)
			)
			(polyline
				(pts
					(xy -0.3302 0) (xy -0.3302 2.54) (xy 0.3048 2.54) (xy 0.3048 0) (xy 0.9398 0) (xy 0.9398 2.54)
					(xy 1.5748 2.54) (xy 1.5748 0) (xy 2.2098 0) (xy 2.2098 2.54) (xy 2.8448 2.54) (xy 2.8448 -1.27)
					(xy -0.9652 -1.27)
				)
				(stroke
					(width 0.254)
					(type default)
				)
				(fill
					(type background)
				)
			)
		)
		(symbol "Heatsink_Pad_1_1"
			(pin passive line
				(at 0 -2.54 90)
				(length 1.27)
				(name "~"
					(effects
						(font
							(size 1.27 1.27)
						)
					)
				)
				(number "1"
					(effects
						(font
							(size 1.27 1.27)
						)
					)
				)
			)
		)
	)
	(symbol "Heatsink_Pad_2Pin"
		(pin_names
			(offset 0)
		)
		(exclude_from_sim yes)
		(in_bom yes)
		(on_board yes)
		(property "Reference" "HS"
			(at 0 5.715 0)
			(effects
				(font
					(size 1.27 1.27)
				)
			)
		)
		(property "Value" "Heatsink_Pad_2Pin"
			(at 0 3.81 0)
			(effects
				(font
					(size 1.27 1.27)
				)
			)
		)
		(property "Footprint" ""
			(at 0.3048 -1.27 0)
			(effects
				(font
					(size 1.27 1.27)
				)
				(hide yes)
			)
		)
		(property "Datasheet" "~"
			(at 0.3048 -1.27 0)
			(effects
				(font
					(size 1.27 1.27)
				)
				(hide yes)
			)
		)
		(property "Description" "Heatsink with electrical connection, 2 pin"
			(at 0 0 0)
			(effects
				(font
					(size 1.27 1.27)
				)
				(hide yes)
			)
		)
		(property "ki_keywords" "thermal heat temperature"
			(at 0 0 0)
			(effects
				(font
					(size 1.27 1.27)
				)
				(hide yes)
			)
		)
		(property "ki_fp_filters" "Heatsink_*"
			(at 0 0 0)
			(effects
				(font
					(size 1.27 1.27)
				)
				(hide yes)
			)
		)
		(symbol "Heatsink_Pad_2Pin_0_1"
			(polyline
				(pts
					(xy -0.3302 0) (xy -0.9652 0) (xy -0.9652 2.54) (xy -1.6002 2.54) (xy -1.6002 0) (xy -2.2352 0)
					(xy -2.2352 2.54) (xy -2.8702 2.54) (xy -2.8702 -1.27) (xy -0.9652 -1.27)
				)
				(stroke
					(width 0.254)
					(type default)
				)
				(fill
					(type background)
				)
			)
			(polyline
				(pts
					(xy -0.3302 0) (xy -0.3302 2.54) (xy 0.3048 2.54) (xy 0.3048 0) (xy 0.9398 0) (xy 0.9398 2.54)
					(xy 1.5748 2.54) (xy 1.5748 0) (xy 2.2098 0) (xy 2.2098 2.54) (xy 2.8448 2.54) (xy 2.8448 -1.27)
					(xy -0.9652 -1.27)
				)
				(stroke
					(width 0.254)
					(type default)
				)
				(fill
					(type background)
				)
			)
		)
		(symbol "Heatsink_Pad_2Pin_1_1"
			(pin passive line
				(at -2.54 -2.54 90)
				(length 1.27)
				(name "~"
					(effects
						(font
							(size 1.27 1.27)
						)
					)
				)
				(number "1"
					(effects
						(font
							(size 1.27 1.27)
						)
					)
				)
			)
			(pin passive line
				(at 2.54 -2.54 90)
				(length 1.27)
				(name "~"
					(effects
						(font
							(size 1.27 1.27)
						)
					)
				)
				(number "2"
					(effects
						(font
							(size 1.27 1.27)
						)
					)
				)
			)
		)
	)
	(symbol "Heatsink_Pad_3Pin"
		(pin_names
			(offset 0)
		)
		(exclude_from_sim yes)
		(in_bom yes)
		(on_board yes)
		(property "Reference" "HS"
			(at 0 5.715 0)
			(effects
				(font
					(size 1.27 1.27)
				)
			)
		)
		(property "Value" "Heatsink_Pad_3Pin"
			(at 0 3.81 0)
			(effects
				(font
					(size 1.27 1.27)
				)
			)
		)
		(property "Footprint" ""
			(at 0.3048 -1.27 0)
			(effects
				(font
					(size 1.27 1.27)
				)
				(hide yes)
			)
		)
		(property "Datasheet" "~"
			(at 0.3048 -1.27 0)
			(effects
				(font
					(size 1.27 1.27)
				)
				(hide yes)
			)
		)
		(property "Description" "Heatsink with electrical connection, 3 pin"
			(at 0 0 0)
			(effects
				(font
					(size 1.27 1.27)
				)
				(hide yes)
			)
		)
		(property "ki_keywords" "thermal heat temperature"
			(at 0 0 0)
			(effects
				(font
					(size 1.27 1.27)
				)
				(hide yes)
			)
		)
		(property "ki_fp_filters" "Heatsink_*"
			(at 0 0 0)
			(effects
				(font
					(size 1.27 1.27)
				)
				(hide yes)
			)
		)
		(symbol "Heatsink_Pad_3Pin_0_1"
			(polyline
				(pts
					(xy -0.3302 0) (xy -0.9652 0) (xy -0.9652 2.54) (xy -1.6002 2.54) (xy -1.6002 0) (xy -2.2352 0)
					(xy -2.2352 2.54) (xy -2.8702 2.54) (xy -2.8702 -1.27) (xy -0.9652 -1.27)
				)
				(stroke
					(width 0.254)
					(type default)
				)
				(fill
					(type background)
				)
			)
			(polyline
				(pts
					(xy -0.3302 0) (xy -0.3302 2.54) (xy 0.3048 2.54) (xy 0.3048 0) (xy 0.9398 0) (xy 0.9398 2.54)
					(xy 1.5748 2.54) (xy 1.5748 0) (xy 2.2098 0) (xy 2.2098 2.54) (xy 2.8448 2.54) (xy 2.8448 -1.27)
					(xy -0.9652 -1.27)
				)
				(stroke
					(width 0.254)
					(type default)
				)
				(fill
					(type background)
				)
			)
		)
		(symbol "Heatsink_Pad_3Pin_1_1"
			(pin passive line
				(at -2.54 -2.54 90)
				(length 1.27)
				(name "~"
					(effects
						(font
							(size 1.27 1.27)
						)
					)
				)
				(number "1"
					(effects
						(font
							(size 1.27 1.27)
						)
					)
				)
			)
			(pin passive line
				(at 0 -2.54 90)
				(length 1.27)
				(name "~"
					(effects
						(font
							(size 1.27 1.27)
						)
					)
				)
				(number "2"
					(effects
						(font
							(size 1.27 1.27)
						)
					)
				)
			)
			(pin passive line
				(at 2.54 -2.54 90)
				(length 1.27)
				(name "~"
					(effects
						(font
							(size 1.27 1.27)
						)
					)
				)
				(number "3"
					(effects
						(font
							(size 1.27 1.27)
						)
					)
				)
			)
		)
	)
	(symbol "Housing"
		(pin_names
			(offset 1.016)
		)
		(exclude_from_sim yes)
		(in_bom yes)
		(on_board yes)
		(property "Reference" "N"
			(at 3.81 0 0)
			(effects
				(font
					(size 1.27 1.27)
				)
				(justify left)
			)
		)
		(property "Value" "Housing"
			(at 3.81 -1.905 0)
			(effects
				(font
					(size 1.27 1.27)
				)
				(justify left)
			)
		)
		(property "Footprint" ""
			(at 1.27 1.27 0)
			(effects
				(font
					(size 1.27 1.27)
				)
				(hide yes)
			)
		)
		(property "Datasheet" "~"
			(at 1.27 1.27 0)
			(effects
				(font
					(size 1.27 1.27)
				)
				(hide yes)
			)
		)
		(property "Description" "Housing"
			(at 0 0 0)
			(effects
				(font
					(size 1.27 1.27)
				)
				(hide yes)
			)
		)
		(property "ki_keywords" "housing enclosure"
			(at 0 0 0)
			(effects
				(font
					(size 1.27 1.27)
				)
				(hide yes)
			)
		)
		(property "ki_fp_filters" "Enclosure* Housing*"
			(at 0 0 0)
			(effects
				(font
					(size 1.27 1.27)
				)
				(hide yes)
			)
		)
		(symbol "Housing_0_1"
			(rectangle
				(start -5.08 -0.635)
				(end -1.27 -1.905)
				(stroke
					(width 0)
					(type default)
				)
				(fill
					(type none)
				)
			)
			(circle
				(center -4.445 -3.175)
				(radius 0.635)
				(stroke
					(width 0)
					(type default)
				)
				(fill
					(type outline)
				)
			)
			(circle
				(center -1.905 -3.175)
				(radius 0.635)
				(stroke
					(width 0)
					(type default)
				)
				(fill
					(type outline)
				)
			)
			(polyline
				(pts
					(xy -4.5212 -1.5748) (xy -4.4704 -1.3716)
				)
				(stroke
					(width 0)
					(type default)
				)
				(fill
					(type none)
				)
			)
			(polyline
				(pts
					(xy -4.4196 -1.6764) (xy -4.064 -1.6764)
				)
				(stroke
					(width 0)
					(type default)
				)
				(fill
					(type none)
				)
			)
			(polyline
				(pts
					(xy -4.4196 -1.2192) (xy -4.3688 -0.9652)
				)
				(stroke
					(width 0)
					(type default)
				)
				(fill
					(type none)
				)
			)
			(polyline
				(pts
					(xy -4.318 -1.3208) (xy -4.0132 -1.3208)
				)
				(stroke
					(width 0)
					(type default)
				)
				(fill
					(type none)
				)
			)
			(polyline
				(pts
					(xy -4.2164 -0.9144) (xy -3.9116 -0.9144)
				)
				(stroke
					(width 0)
					(type default)
				)
				(fill
					(type none)
				)
			)
			(polyline
				(pts
					(xy -3.9116 -1.6256) (xy -3.8608 -1.3716)
				)
				(stroke
					(width 0)
					(type default)
				)
				(fill
					(type none)
				)
			)
			(polyline
				(pts
					(xy -3.81 -1.2192) (xy -3.7592 -0.9652)
				)
				(stroke
					(width 0)
					(type default)
				)
				(fill
					(type none)
				)
			)
			(polyline
				(pts
					(xy -3.6068 -1.5748) (xy -3.556 -1.3716)
				)
				(stroke
					(width 0)
					(type default)
				)
				(fill
					(type none)
				)
			)
			(polyline
				(pts
					(xy -3.5052 -1.6764) (xy -3.1496 -1.6764)
				)
				(stroke
					(width 0)
					(type default)
				)
				(fill
					(type none)
				)
			)
			(polyline
				(pts
					(xy -3.5052 -1.2192) (xy -3.4544 -0.9652)
				)
				(stroke
					(width 0)
					(type default)
				)
				(fill
					(type none)
				)
			)
			(polyline
				(pts
					(xy -3.4036 -1.3208) (xy -3.0988 -1.3208)
				)
				(stroke
					(width 0)
					(type default)
				)
				(fill
					(type none)
				)
			)
			(polyline
				(pts
					(xy -3.302 -0.9144) (xy -2.9972 -0.9144)
				)
				(stroke
					(width 0)
					(type default)
				)
				(fill
					(type none)
				)
			)
			(polyline
				(pts
					(xy -2.9972 -1.6256) (xy -2.9464 -1.3716)
				)
				(stroke
					(width 0)
					(type default)
				)
				(fill
					(type none)
				)
			)
			(polyline
				(pts
					(xy -2.8956 -1.2192) (xy -2.8448 -0.9652)
				)
				(stroke
					(width 0)
					(type default)
				)
				(fill
					(type none)
				)
			)
			(polyline
				(pts
					(xy -2.6924 -1.5748) (xy -2.6416 -1.3716)
				)
				(stroke
					(width 0)
					(type default)
				)
				(fill
					(type none)
				)
			)
			(polyline
				(pts
					(xy -2.5908 -1.6764) (xy -2.2352 -1.6764)
				)
				(stroke
					(width 0)
					(type default)
				)
				(fill
					(type none)
				)
			)
			(polyline
				(pts
					(xy -2.5908 -1.2192) (xy -2.54 -0.9652)
				)
				(stroke
					(width 0)
					(type default)
				)
				(fill
					(type none)
				)
			)
			(polyline
				(pts
					(xy -2.4892 -1.3208) (xy -2.1844 -1.3208)
				)
				(stroke
					(width 0)
					(type default)
				)
				(fill
					(type none)
				)
			)
			(polyline
				(pts
					(xy -2.3876 -0.9144) (xy -2.0828 -0.9144)
				)
				(stroke
					(width 0)
					(type default)
				)
				(fill
					(type none)
				)
			)
			(polyline
				(pts
					(xy -2.0828 -1.6256) (xy -2.032 -1.3716)
				)
				(stroke
					(width 0)
					(type default)
				)
				(fill
					(type none)
				)
			)
			(polyline
				(pts
					(xy -1.9812 -1.2192) (xy -1.9304 -0.9652)
				)
				(stroke
					(width 0)
					(type default)
				)
				(fill
					(type none)
				)
			)
			(polyline
				(pts
					(xy -0.635 0) (xy -0.635 -4.445)
				)
				(stroke
					(width 0)
					(type default)
				)
				(fill
					(type none)
				)
			)
			(polyline
				(pts
					(xy -5.715 0) (xy -0.635 0) (xy 3.175 3.81)
				)
				(stroke
					(width 0)
					(type default)
				)
				(fill
					(type none)
				)
			)
			(polyline
				(pts
					(xy -5.715 0) (xy -5.715 -4.445) (xy -0.635 -4.445) (xy 3.175 -0.635) (xy 3.175 3.81) (xy -1.905 3.81)
					(xy -5.715 0)
				)
				(stroke
					(width 0)
					(type default)
				)
				(fill
					(type background)
				)
			)
		)
	)
	(symbol "Housing_Pad"
		(pin_numbers hide)
		(pin_names
			(offset 1.016) hide)
		(exclude_from_sim yes)
		(in_bom yes)
		(on_board yes)
		(property "Reference" "N"
			(at 4.445 0 0)
			(effects
				(font
					(size 1.27 1.27)
				)
				(justify left)
			)
		)
		(property "Value" "Housing_Pad"
			(at 4.445 -1.905 0)
			(effects
				(font
					(size 1.27 1.27)
				)
				(justify left)
			)
		)
		(property "Footprint" ""
			(at 1.905 1.27 0)
			(effects
				(font
					(size 1.27 1.27)
				)
				(hide yes)
			)
		)
		(property "Datasheet" "~"
			(at 1.905 1.27 0)
			(effects
				(font
					(size 1.27 1.27)
				)
				(hide yes)
			)
		)
		(property "Description" "Housing with connection pin"
			(at 0 0 0)
			(effects
				(font
					(size 1.27 1.27)
				)
				(hide yes)
			)
		)
		(property "ki_keywords" "housing enclosure shield"
			(at 0 0 0)
			(effects
				(font
					(size 1.27 1.27)
				)
				(hide yes)
			)
		)
		(symbol "Housing_Pad_0_1"
			(rectangle
				(start -4.445 -0.635)
				(end -0.635 -1.905)
				(stroke
					(width 0)
					(type default)
				)
				(fill
					(type none)
				)
			)
			(circle
				(center -3.81 -3.175)
				(radius 0.635)
				(stroke
					(width 0)
					(type default)
				)
				(fill
					(type outline)
				)
			)
			(circle
				(center -1.27 -3.175)
				(radius 0.635)
				(stroke
					(width 0)
					(type default)
				)
				(fill
					(type outline)
				)
			)
			(polyline
				(pts
					(xy -3.8862 -1.5748) (xy -3.8354 -1.3716)
				)
				(stroke
					(width 0)
					(type default)
				)
				(fill
					(type none)
				)
			)
			(polyline
				(pts
					(xy -3.7846 -1.6764) (xy -3.429 -1.6764)
				)
				(stroke
					(width 0)
					(type default)
				)
				(fill
					(type none)
				)
			)
			(polyline
				(pts
					(xy -3.7846 -1.2192) (xy -3.7338 -0.9652)
				)
				(stroke
					(width 0)
					(type default)
				)
				(fill
					(type none)
				)
			)
			(polyline
				(pts
					(xy -3.683 -1.3208) (xy -3.3782 -1.3208)
				)
				(stroke
					(width 0)
					(type default)
				)
				(fill
					(type none)
				)
			)
			(polyline
				(pts
					(xy -3.5814 -0.9144) (xy -3.2766 -0.9144)
				)
				(stroke
					(width 0)
					(type default)
				)
				(fill
					(type none)
				)
			)
			(polyline
				(pts
					(xy -3.2766 -1.6256) (xy -3.2258 -1.3716)
				)
				(stroke
					(width 0)
					(type default)
				)
				(fill
					(type none)
				)
			)
			(polyline
				(pts
					(xy -3.175 -1.2192) (xy -3.1242 -0.9652)
				)
				(stroke
					(width 0)
					(type default)
				)
				(fill
					(type none)
				)
			)
			(polyline
				(pts
					(xy -2.9718 -1.5748) (xy -2.921 -1.3716)
				)
				(stroke
					(width 0)
					(type default)
				)
				(fill
					(type none)
				)
			)
			(polyline
				(pts
					(xy -2.8702 -1.6764) (xy -2.5146 -1.6764)
				)
				(stroke
					(width 0)
					(type default)
				)
				(fill
					(type none)
				)
			)
			(polyline
				(pts
					(xy -2.8702 -1.2192) (xy -2.8194 -0.9652)
				)
				(stroke
					(width 0)
					(type default)
				)
				(fill
					(type none)
				)
			)
			(polyline
				(pts
					(xy -2.7686 -1.3208) (xy -2.4638 -1.3208)
				)
				(stroke
					(width 0)
					(type default)
				)
				(fill
					(type none)
				)
			)
			(polyline
				(pts
					(xy -2.667 -0.9144) (xy -2.3622 -0.9144)
				)
				(stroke
					(width 0)
					(type default)
				)
				(fill
					(type none)
				)
			)
			(polyline
				(pts
					(xy -2.3622 -1.6256) (xy -2.3114 -1.3716)
				)
				(stroke
					(width 0)
					(type default)
				)
				(fill
					(type none)
				)
			)
			(polyline
				(pts
					(xy -2.2606 -1.2192) (xy -2.2098 -0.9652)
				)
				(stroke
					(width 0)
					(type default)
				)
				(fill
					(type none)
				)
			)
			(polyline
				(pts
					(xy -2.0574 -1.5748) (xy -2.0066 -1.3716)
				)
				(stroke
					(width 0)
					(type default)
				)
				(fill
					(type none)
				)
			)
			(polyline
				(pts
					(xy -1.9558 -1.6764) (xy -1.6002 -1.6764)
				)
				(stroke
					(width 0)
					(type default)
				)
				(fill
					(type none)
				)
			)
			(polyline
				(pts
					(xy -1.9558 -1.2192) (xy -1.905 -0.9652)
				)
				(stroke
					(width 0)
					(type default)
				)
				(fill
					(type none)
				)
			)
			(polyline
				(pts
					(xy -1.8542 -1.3208) (xy -1.5494 -1.3208)
				)
				(stroke
					(width 0)
					(type default)
				)
				(fill
					(type none)
				)
			)
			(polyline
				(pts
					(xy -1.7526 -0.9144) (xy -1.4478 -0.9144)
				)
				(stroke
					(width 0)
					(type default)
				)
				(fill
					(type none)
				)
			)
			(polyline
				(pts
					(xy -1.4478 -1.6256) (xy -1.397 -1.3716)
				)
				(stroke
					(width 0)
					(type default)
				)
				(fill
					(type none)
				)
			)
			(polyline
				(pts
					(xy -1.3462 -1.2192) (xy -1.2954 -0.9652)
				)
				(stroke
					(width 0)
					(type default)
				)
				(fill
					(type none)
				)
			)
			(polyline
				(pts
					(xy 0 0) (xy 0 -4.445)
				)
				(stroke
					(width 0)
					(type default)
				)
				(fill
					(type none)
				)
			)
			(polyline
				(pts
					(xy -5.08 0) (xy 0 0) (xy 3.81 3.81)
				)
				(stroke
					(width 0)
					(type default)
				)
				(fill
					(type none)
				)
			)
			(polyline
				(pts
					(xy -5.08 0) (xy -5.08 -4.445) (xy 0 -4.445) (xy 3.81 -0.635) (xy 3.81 3.81) (xy -1.27 3.81) (xy -5.08 0)
				)
				(stroke
					(width 0)
					(type default)
				)
				(fill
					(type background)
				)
			)
		)
		(symbol "Housing_Pad_1_1"
			(pin input line
				(at -5.08 -5.08 90)
				(length 2.54)
				(name "PAD"
					(effects
						(font
							(size 1.27 1.27)
						)
					)
				)
				(number "1"
					(effects
						(font
							(size 1.27 1.27)
						)
					)
				)
			)
		)
	)
	(symbol "MountingHole"
		(pin_names
			(offset 1.016)
		)
		(exclude_from_sim yes)
		(in_bom no)
		(on_board yes)
		(property "Reference" "H"
			(at 0 5.08 0)
			(effects
				(font
					(size 1.27 1.27)
				)
			)
		)
		(property "Value" "MountingHole"
			(at 0 3.175 0)
			(effects
				(font
					(size 1.27 1.27)
				)
			)
		)
		(property "Footprint" ""
			(at 0 0 0)
			(effects
				(font
					(size 1.27 1.27)
				)
				(hide yes)
			)
		)
		(property "Datasheet" "~"
			(at 0 0 0)
			(effects
				(font
					(size 1.27 1.27)
				)
				(hide yes)
			)
		)
		(property "Description" "Mounting Hole without connection"
			(at 0 0 0)
			(effects
				(font
					(size 1.27 1.27)
				)
				(hide yes)
			)
		)
		(property "ki_keywords" "mounting hole"
			(at 0 0 0)
			(effects
				(font
					(size 1.27 1.27)
				)
				(hide yes)
			)
		)
		(property "ki_fp_filters" "MountingHole*"
			(at 0 0 0)
			(effects
				(font
					(size 1.27 1.27)
				)
				(hide yes)
			)
		)
		(symbol "MountingHole_0_1"
			(circle
				(center 0 0)
				(radius 1.27)
				(stroke
					(width 1.27)
					(type default)
				)
				(fill
					(type none)
				)
			)
		)
	)
	(symbol "MountingHole_Pad"
		(pin_numbers hide)
		(pin_names
			(offset 1.016) hide)
		(exclude_from_sim yes)
		(in_bom no)
		(on_board yes)
		(property "Reference" "H"
			(at 0 6.35 0)
			(effects
				(font
					(size 1.27 1.27)
				)
			)
		)
		(property "Value" "MountingHole_Pad"
			(at 0 4.445 0)
			(effects
				(font
					(size 1.27 1.27)
				)
			)
		)
		(property "Footprint" ""
			(at 0 0 0)
			(effects
				(font
					(size 1.27 1.27)
				)
				(hide yes)
			)
		)
		(property "Datasheet" "~"
			(at 0 0 0)
			(effects
				(font
					(size 1.27 1.27)
				)
				(hide yes)
			)
		)
		(property "Description" "Mounting Hole with connection"
			(at 0 0 0)
			(effects
				(font
					(size 1.27 1.27)
				)
				(hide yes)
			)
		)
		(property "ki_keywords" "mounting hole"
			(at 0 0 0)
			(effects
				(font
					(size 1.27 1.27)
				)
				(hide yes)
			)
		)
		(property "ki_fp_filters" "MountingHole*Pad*"
			(at 0 0 0)
			(effects
				(font
					(size 1.27 1.27)
				)
				(hide yes)
			)
		)
		(symbol "MountingHole_Pad_0_1"
			(circle
				(center 0 1.27)
				(radius 1.27)
				(stroke
					(width 1.27)
					(type default)
				)
				(fill
					(type none)
				)
			)
		)
		(symbol "MountingHole_Pad_1_1"
			(pin input line
				(at 0 -2.54 90)
				(length 2.54)
				(name "1"
					(effects
						(font
							(size 1.27 1.27)
						)
					)
				)
				(number "1"
					(effects
						(font
							(size 1.27 1.27)
						)
					)
				)
			)
		)
	)
	(symbol "MountingHole_Pad_MP"
		(pin_numbers hide)
		(pin_names
			(offset 1.016) hide)
		(exclude_from_sim yes)
		(in_bom no)
		(on_board yes)
		(property "Reference" "H"
			(at 0 6.35 0)
			(effects
				(font
					(size 1.27 1.27)
				)
			)
		)
		(property "Value" "MountingHole_Pad_MP"
			(at 0 4.445 0)
			(effects
				(font
					(size 1.27 1.27)
				)
			)
		)
		(property "Footprint" ""
			(at 0 0 0)
			(effects
				(font
					(size 1.27 1.27)
				)
				(hide yes)
			)
		)
		(property "Datasheet" "~"
			(at 0 0 0)
			(effects
				(font
					(size 1.27 1.27)
				)
				(hide yes)
			)
		)
		(property "Description" "Mounting Hole with connection as pad named MP"
			(at 0 0 0)
			(effects
				(font
					(size 1.27 1.27)
				)
				(hide yes)
			)
		)
		(property "ki_keywords" "mounting hole"
			(at 0 0 0)
			(effects
				(font
					(size 1.27 1.27)
				)
				(hide yes)
			)
		)
		(property "ki_fp_filters" "MountingHole*Pad*"
			(at 0 0 0)
			(effects
				(font
					(size 1.27 1.27)
				)
				(hide yes)
			)
		)
		(symbol "MountingHole_Pad_MP_0_1"
			(circle
				(center 0 1.27)
				(radius 1.27)
				(stroke
					(width 1.27)
					(type default)
				)
				(fill
					(type none)
				)
			)
		)
		(symbol "MountingHole_Pad_MP_1_1"
			(pin input line
				(at 0 -2.54 90)
				(length 2.54)
				(name "MP"
					(effects
						(font
							(size 1.27 1.27)
						)
					)
				)
				(number "MP"
					(effects
						(font
							(size 1.27 1.27)
						)
					)
				)
			)
		)
	)
)