@startuml
!includeurl https://raw.githubusercontent.com/RicardoNiepel/C4-PlantUML/release/1-0/C4_Context.puml

Person(guest, "Guest", "A person who wants to visit the residents of the flat")
Person(resident, "Resident", "The person who is visited")

System(B2A, "Bell2Attic", "A system to enlarge the circle of attention to visitors.")

System_Ext(bell, "bell", "bell used by the complete housing")

Rel(guest, bell, rings to be heared by the resident)
Rel(resident, B2A, gets notified for the new guest)
Rel(bell, B2A, uses the signal)

@enduml