user_id,role_id,baja
16,2,0
15,1,1
20,3,0
20,7,1
6,5,0
15,5,0
17,10,1
12,9,0
13,3,1
21,3,1
18,8,0
21,2,1
13,10,0
18,9,0
14,2,1
7,3,0
17,5,1
2,5,0
12,6,0
18,6,0
2,6,0
1,9,0
13,2,1
2,8,1
3,9,1
10,2,0
22,1,1
7,9,0
11,4,1
16,8,0
9,10,1
10,2,0
18,5,0
6,4,1
17,5,1
16,9,0
4,1,1
13,1,1
22,2,1
9,8,1
1,7,0
4,5,1
21,4,1
23,10,1
8,2,0
12,6,0
10,4,0
5,8,0
20,5,1
9,4,1
