"id","name","surname"
1,hector,crispens
2,natalia,rodriguez
3,juan domingo,gutierres
4,Bautista Sanabria,Sarabia
5,Benjamín Roque,Puente
6,Natalia Mateo,Portillo
7,Rebeca Medina,Muñoz
8,Dr. Emiliano Treviño,Olivas
9,Dr. Tomas Sarabia Hijo,Hernández
10,Diego Alejandro Cardenas,Villarreal
11,Ing. Montserrat Molina,Escobedo
12,Emily Bueno,Peres
13,Dr. Tomas Salazar Hijo,Delrío
14,Juan Esteban Sarabia,Serna
15,Lic. Juan Martín Alonzo Segundo,Zavala
16,Valentino Villegas,Valadez
17,Esteban Robledo,Delafuente
18,Isidora Rosas,Alcaraz
19,Ana Paula Preciado,Romero
20,Sr. Agustín Yáñez Tercero,Rodrígez
21,Maite Portillo,Cervantes
22,Juan Manuel Ramos,Partida
23,Sra. Alexa Armas,Rojo
