{
    "error": null,
    "result": [
        {
            "id": "100101",
            "description": "1.Agricultura"
        },
        {
            "id": "0111013",
            "description": "CULTIVO DE ALPISTE"
        },
        {
            "id": "0111021",
            "description": "CULTIVO DE ARROZ"
        },
        {
            "id": "0111039",
            "description": "CULTIVO DE AVENA"
        },
        {
            "id": "0111047",
            "description": "CULTIVO DE CEBADA"
        },
        {
            "id": "0111055",
            "description": "CULTIVO DE LINAZA"
        },
        {
            "id": "0111063",
            "description": "CULTIVO DE MAIZ"
        },
        {
            "id": "0111071",
            "description": "CULTIVO DE MILO"
        },
        {
            "id": "0111089",
            "description": "CULTIVO DE SORGO"
        },
        {
            "id": "0111097",
            "description": "CULTIVO DE SOYA"
        },
        {
            "id": "0111104",
            "description": "CULTIVO DE TRIGO"
        },
        {
            "id": "0112011",
            "description": "CULTIVO DE AJO"
        },
        {
            "id": "0112029",
            "description": "CULTIVO DE CALABAZA"
        }
    ]
}