{
	"nombres":"Joaquin",
	"apaterno":"López",
	"amaterno":"doriga",
	"rfc":"GUTR130389G34",
	"correo":"joaquin@correo.com",
	"status":1,
	"perfil":4,
	"nombre_usuario":"joaquin.lópez",
	"genero": "01",
	"fecha_nacimiento":"13-03-1989"
}