{
    "error": null,
    "result": [
        {
            "id": "1",
            "description": "Ford"
        },
        {
            "id": "2",
            "description": "Nissan"
        },
        {
            "id": "3",
            "description": "Toyota"
        },
        {
            "id": "4",
            "description": "Volkswagen"
        },
        {
            "id": "5",
            "description": "Chevrolet"
        }
    ]
}
