{
  "title": "Obtener lista de las estaciones",
  "endpoint": "/Estacion/GetAllEstaciones",
  "method": "GET",
  "responses": [
    {
      "status": "200",
      "label": "200: Devuelve un lisado de estaciones",
      "headers": {
        "Content-Type": "application/json"
      },
      "body": [
        {
          "id": "00000001",
          "estacion": "Garden Santa Fe",
          "calle": "Eje 1 Nte.(Mosqueta)",
          "colonia": "Buenavista",
          "numero": "259",
          "id_cp": "1",
          "id_ciudad": "2",
          "eliminacion_logica": false
      },
      {
          "id": "00000002",
          "estacion": "Garden Santa Fe",
          "calle": "Eje 1 Nte.(Mosqueta)",
          "colonia": "Buenavista",
          "numero": "259",
          "id_cp": "1",
          "id_ciudad": "2",
          "eliminacion_logica": false
      },
      {
          "id": "00000003",
          "estacion": "Garden Santa Fe",
          "calle": "Eje 1 Nte.(Mosqueta)",
          "colonia": "Buenavista",
          "numero": "259",
          "id_cp": "1",
          "id_ciudad": "2",
          "eliminacion_logica": false
      },
      {
          "id": "0000004",
          "estacion": "Garden Santa Fe",
          "calle": "Eje 1 Nte.(Mosqueta)",
          "colonia": "Buenavista",
          "numero": "259",
          "id_cp": "1",
          "id_ciudad": "2",
          "eliminacion_logica": false
      },
      {
          "id": "0000005",
          "estacion": "Garden Santa Fe",
          "calle": "Eje 1 Nte.(Mosqueta)",
          "colonia": "Buenavista",
          "numero": "259",
          "id_cp": "1",
          "id_ciudad": "2",
          "eliminacion_logica": false
      },
      {
          "id": "0000006",
          "estacion": "Garden Santa Fe",
          "calle": "Eje 1 Nte.(Mosqueta)",
          "colonia": "Buenavista",
          "numero": "259",
          "id_cp": "1",
          "id_ciudad": "2",
          "eliminacion_logica": false
      },
      {
          "id": "0000007",
          "estacion": "Garden Santa Fe",
          "calle": "Eje 1 Nte.(Mosqueta)",
          "colonia": "Buenavista",
          "numero": "259",
          "id_cp": "1",
          "id_ciudad": "2",
          "eliminacion_logica": false
      },
      {
          "id": "0000008",
          "estacion": "Garden Santa Fe",
          "calle": "Eje 1 Nte.(Mosqueta)",
          "colonia": "Buenavista",
          "numero": "259",
          "id_cp": "1",
          "id_ciudad": "2",
          "eliminacion_logica": false
      },
      {
          "id": "0000009",
          "estacion": "Garden Santa Fe",
          "calle": "Eje 1 Nte.(Mosqueta)",
          "colonia": "Buenavista",
          "numero": "259",
          "id_cp": "1",
          "id_ciudad": "2",
          "eliminacion_logica": false
      },
      {
          "id": "00000010",
          "estacion": "Garden Santa Fe",
          "calle": "Eje 1 Nte.(Mosqueta)",
          "colonia": "Buenavista",
          "numero": "259",
          "id_cp": "1",
          "id_ciudad": "2",
          "eliminacion_logica": false
      },
      {
          "id": "00000011",
          "estacion": "Garden Santa Fe",
          "calle": "Eje 1 Nte.(Mosqueta)",
          "colonia": "Buenavista",
          "numero": "259",
          "id_cp": "1",
          "id_ciudad": "2",
          "eliminacion_logica": false
      },
      {
          "id": "00000012",
        "estacion": "Garden Santa Fe",
        "calle": "Eje 1 Nte.(Mosqueta)",
        "colonia": "Buenavista",
        "numero": "259",
        "id_cp": "1",
        "id_ciudad": "2",
          "eliminacion_logica": false
      }
      ]
    },
    {
      "status": "401",
      "label": "401 No autorizado",
      "headers": {
        "Content-Type": "application/json"
      },
      "body": {
        "error": "string",
        "message": "string",
        "path": "string",
        "status": 0,
        "timestamp": 0
      }
    },
    {
      "status": "500",
      "label": "500: Internal Server Error",
      "headers": {
        "Content-Type": "application/json"
      },
      "body": {
        "error": {
          "code": 0,
          "message": "string"
        },
        "result": "string"
      }
    }
  ]
}
