{
  "title": "Cambio de Contrasenia",
  "endpoint": "/account/changePassword",
  "method": "POST",
  "responses": [
    {
      "status": "200",
      "label": "200: Ok",
      "headers": {
        "Content-Type": "application/json"
      },
      "body": {
        "error": null,
        "result": {
          "id": 7,
          "wasChange": true
        }
      }
    },
    {
      "status": "400",
      "label": "400: Contraseña actual incorrecta",
      "headers": {
        "Content-Type": "application/json"
      },
      "body": {
        "error": {
          "code": 400,
          "message": "Contraseña actual incorrecta"
        },
        "result": null
      }
    },
    {
      "status": "400",
      "label": "400: La nueva contraseña ya ha sido usada",
      "headers": {
        "Content-Type": "application/json"
      },
      "body": {
        "error": {
          "code": 400,
          "message": "La nueva contraseña ya ha sido usada"
        },
        "result": null
      }
    },
    {
      "status": "401",
      "label": "401: Sesión Inactiva",
      "headers": {
        "Content-Type": "application/json"
      },
      "body": {
        "error": {
          "code": 401,
          "message": "JWT expired at 2018-10-15T11:55:01-0500. Current time: 2018-10-22T21:24:24-0500"
        },
        "result": null
      }
    },
    {
      "status": "500",
      "label": "500: Error",
      "headers": {
        "Content-Type": "application/json"
      },
      "body": {
        "error": {
          "code": 500,
          "message": "Internal Server Error"
        },
        "result": null
      }
    }
  ]
}