{
    "error": null,
    "result": [
        {
            "id": "1",
            "description": "42115"
        },
        {
            "id": "2",
            "description": "06350"
        },
        {
            "id": "3",
            "description": "98632"
        },
        {
            "id": "4",
            "description": "09876"
        },
        {
            "id": "5",
            "description": "456278"
        }
    ]
}
