{
  "title": "Sector CNBV",
  "endpoint": "/cat/sectorCNBV",
  "method": "GET",
  "responses": [
    {
      "status": "200",
      "label": "200",
      "headers": {
        "Content-Type": "application/json"
      },
      "bodyFile": "sectorCNBV.json"
    },
    {
      "status": "200",
      "label": "200",
      "headers": {
        "Content-Type": "application/json"
      },
      "bodyFile": "../errors/nodata.json"
    },
    {
      "status": "500",
      "label": "500",
      "headers": {
        "Content-Type": "application/json"
      },
      "bodyFile": "../errors/500.json"
    }
  ]
}