{
  "title": "Estatus usuario",
  "endpoint": "/estatusUsuario",
  "method": "GET",
  "responses": [
    {
      "status": "200",
      "label": "200",
      "headers": {
        "Content-Type": "application/json"
      },
      "bodyFile": "userStatus.json"
    },
    {
      "status": "200",
      "label": "200",
      "headers": {
        "Content-Type": "application/json"
      },
      "body": {
        "error": {
          "code": 204,
          "message": "No data found"
        },
        "result": []
      }
    },
    {
      "status": "500",
      "label": "500: Internal Server Error",
      "headers": {
        "Content-Type": "application/json"
      },
      "body": {
        "error": {
          "code": 500,
          "message": "Internal Server Error"
        },
        "result": null
      }
    }
  ]
}