{
    "error": null,
    "result": [
        {
            "id": 1,
            "description": "Persona Física"
        },
        {
            "id": 2,
            "description": "Persona Física con Act. Empresarial"
        },
        {
            "id": 3,
            "description": "Persona Moral"
        }
    ]
}