{
    "error": null,
    "result": [
        {
            "id": 1,
            "description": "Credencial de Elector (IFE)"
        },
        {
            "id": 2,
            "description": "Pasaporte Vigente"
        },
        {
            "id": 3,
            "description": "Cédula Profesional"
        },
        {
            "id": 4,
            "description": "Forma Migratoria FM2"
        },
        {
            "id": 5,
            "description": "Forma Migratoria FM3"
        },
        {
            "id": 6,
            "description": "Forma Migratoria FMM o FMT"
        },
        {
            "id": 7,
            "description": "Forma Migratoria FMTF"
        },
        {
            "id": 8,
            "description": "Forma Migratoria FMVL"
        },
        {
            "id": 9,
            "description": "FALTANTE"
        },
        {
            "id": 10,
            "description": "Credencial INAPAM"
        },
        {
            "id": 11,
            "description": "Credencial de menores"
        }
    ]
}