{
    "error": null,
    "result": [
        {
            "id": "1",
            "description": "Administrador"
        },
        {
            "id": "2",
            "description": "Cliente"
        },
        {
            "id": "3",
            "description": "Chofer"
        },
        {
            "id": "4",
            "description": "Otro"
        }
    ]
}