{
  "title": "Grupo Económico CNBV",
  "endpoint": "/cat/grupoEcoCNBV",
  "method": "POST",
  "responses": [
    {
      "status": "200",
      "label": "200",
      "headers": {
        "Content-Type": "application/json"
      },
      "bodyFile": "grupoEcoCNBV.json"
    },
    {
      "status": "200",
      "label": "200",
      "headers": {
        "Content-Type": "application/json"
      },
      "bodyFile": "../errors/nodata.json"
    },
    {
      "status": "500",
      "label": "500",
      "headers": {
        "Content-Type": "application/json"
      },
      "bodyFile": "../errors/500.json"
    }
  ]
}